activemq-dev mailing list archives

Site index · List index
Message view « Date » · « Thread »
Top « Date » · « Thread »
From Apache Hudson Server <hud...@hudson.zones.apache.org>
Subject Build failed in Hudson: ActiveMQ-5.3-Deploy #12
Date Wed, 17 Mar 2010 04:21:50 GMT
See <http://hudson.zones.apache.org/hudson/job/ActiveMQ-5.3-Deploy/12/changes>

Changes:

[dejanb] merging 923706 - https://issues.apache.org/activemq/browse/AMQ-2594 - jdbc out of
order messages

[dejanb] merging 923300 and 923694 - https://issues.apache.org/activemq/browse/AMQ-2594 -
jdbc order of messages

------------------------------------------
[...truncated 11684 lines...]
Downloading: http://repository.apache.org/snapshots/org/apache/activemq/activemq-pool/5.3.1-SNAPSHOT/activemq-pool-5.3.1-SNAPSHOT.jar
[INFO] [compiler:compile {execution: default-compile}]
[INFO] No sources to compile
[INFO] [resources:testResources {execution: default-testResources}]
[INFO] Using 'UTF-8' encoding to copy filtered resources.
[INFO] skip non existing resourceDirectory <http://hudson.zones.apache.org/hudson/job/ActiveMQ-5.3-Deploy/ws/trunk/activemq-web-demo/src/test/resources>
[INFO] Copying 3 resources
Downloading: http://repository.apache.org/snapshots/org/apache/activemq/kahadb/5.3.1-SNAPSHOT/kahadb-5.3.1-SNAPSHOT.jar
Downloading: http://repository.apache.org/snapshots/org/apache/activemq/activemq-camel/5.3.1-SNAPSHOT/activemq-camel-5.3.1-SNAPSHOT.jar
Downloading: http://repository.apache.org/snapshots/org/apache/activemq/activemq-pool/5.3.1-SNAPSHOT/activemq-pool-5.3.1-SNAPSHOT.jar
[INFO] [compiler:testCompile {execution: default-testCompile}]
[INFO] No sources to compile
Downloading: http://repository.apache.org/snapshots/org/apache/activemq/kahadb/5.3.1-SNAPSHOT/kahadb-5.3.1-SNAPSHOT.jar
Downloading: http://repository.apache.org/snapshots/org/apache/activemq/activemq-camel/5.3.1-SNAPSHOT/activemq-camel-5.3.1-SNAPSHOT.jar
Downloading: http://repository.apache.org/snapshots/org/apache/activemq/activemq-pool/5.3.1-SNAPSHOT/activemq-pool-5.3.1-SNAPSHOT.jar
[INFO] [surefire:test {execution: default-test}]
[INFO] Surefire report directory: <http://hudson.zones.apache.org/hudson/job/ActiveMQ-5.3-Deploy/ws/trunk/activemq-web-demo/target/surefire-reports>

-------------------------------------------------------
 T E S T S
-------------------------------------------------------
There are no tests to run.

Results :

Tests run: 0, Failures: 0, Errors: 0, Skipped: 0

[HUDSON] Recording test resultsDownloading: http://repository.apache.org/snapshots/org/apache/activemq/kahadb/5.3.1-SNAPSHOT/kahadb-5.3.1-SNAPSHOT.jar

Downloading: http://repository.apache.org/snapshots/org/apache/activemq/activemq-camel/5.3.1-SNAPSHOT/activemq-camel-5.3.1-SNAPSHOT.jar
Downloading: http://repository.apache.org/snapshots/org/apache/activemq/activemq-pool/5.3.1-SNAPSHOT/activemq-pool-5.3.1-SNAPSHOT.jar
[INFO] [war:war {execution: default-war}]
[INFO] Packaging webapp
[INFO] Assembling webapp[activemq-web-demo] in [<http://hudson.zones.apache.org/hudson/job/ActiveMQ-5.3-Deploy/ws/trunk/activemq-web-demo/target/activemq-web-demo-5.3.1-SNAPSHOT]>
[INFO] Processing war project
[INFO] Copying webapp resources[<http://hudson.zones.apache.org/hudson/job/ActiveMQ-5.3-Deploy/ws/trunk/activemq-web-demo/src/main/webapp]>
[INFO] Webapp assembled in[147 msecs]
[INFO] Building war: <http://hudson.zones.apache.org/hudson/job/ActiveMQ-5.3-Deploy/ws/trunk/activemq-web-demo/target/activemq-web-demo-5.3.1-SNAPSHOT.war>
[INFO] Preparing source:jar
[WARNING] Removing: jar from forked lifecycle, to prevent recursive invocation.
Downloading: http://repository.apache.org/snapshots/org/apache/activemq/kahadb/5.3.1-SNAPSHOT/kahadb-5.3.1-SNAPSHOT.jar
Downloading: http://repository.apache.org/snapshots/org/apache/activemq/activemq-camel/5.3.1-SNAPSHOT/activemq-camel-5.3.1-SNAPSHOT.jar
Downloading: http://repository.apache.org/snapshots/org/apache/activemq/activemq-pool/5.3.1-SNAPSHOT/activemq-pool-5.3.1-SNAPSHOT.jar
[HUDSON] Archiving <http://hudson.zones.apache.org/hudson/job/ActiveMQ-5.3-Deploy/ws/trunk/activemq-web-demo/pom.xml>
to /export/home/hudson/hudson/jobs/ActiveMQ-5.3-Deploy/modules/org.apache.activemq$activemq-web-demo/builds/2010-03-17_04-02-07/archive/org.apache.activemq/activemq-web-demo/5.3.1-SNAPSHOT/pom.xml
[HUDSON] Archiving <http://hudson.zones.apache.org/hudson/job/ActiveMQ-5.3-Deploy/ws/trunk/activemq-web-demo/target/activemq-web-demo-5.3.1-SNAPSHOT.war>
to /export/home/hudson/hudson/jobs/ActiveMQ-5.3-Deploy/modules/org.apache.activemq$activemq-web-demo/builds/2010-03-17_04-02-07/archive/org.apache.activemq/activemq-web-demo/5.3.1-SNAPSHOT/activemq-web-demo-5.3.1-SNAPSHOT.war
[INFO] [enforcer:enforce {execution: default}]
[INFO] [source:jar {execution: attach-sources}]
[INFO] Building jar: <http://hudson.zones.apache.org/hudson/job/ActiveMQ-5.3-Deploy/ws/trunk/activemq-web-demo/target/activemq-web-demo-5.3.1-SNAPSHOT-sources.jar>
Downloading: http://repository.apache.org/snapshots/org/apache/activemq/kahadb/5.3.1-SNAPSHOT/kahadb-5.3.1-SNAPSHOT.jar
Downloading: http://repository.apache.org/snapshots/org/apache/activemq/activemq-camel/5.3.1-SNAPSHOT/activemq-camel-5.3.1-SNAPSHOT.jar
Downloading: http://repository.apache.org/snapshots/org/apache/activemq/activemq-pool/5.3.1-SNAPSHOT/activemq-pool-5.3.1-SNAPSHOT.jar
[INFO] [javadoc:jar {execution: attach-javadocs}]
[INFO] [ianal:verify-legal-files {execution: default}]
[INFO] Checking legal files in: activemq-web-demo-5.3.1-SNAPSHOT.war
[INFO] Checking legal files in: activemq-web-demo-5.3.1-SNAPSHOT-sources.jar
[INFO] [install:install {execution: default-install}]
[INFO] Installing <http://hudson.zones.apache.org/hudson/job/ActiveMQ-5.3-Deploy/ws/trunk/activemq-web-demo/target/activemq-web-demo-5.3.1-SNAPSHOT.war>
to /home/hudson/.m2/repository/org/apache/activemq/activemq-web-demo/5.3.1-SNAPSHOT/activemq-web-demo-5.3.1-SNAPSHOT.war
[INFO] Installing <http://hudson.zones.apache.org/hudson/job/ActiveMQ-5.3-Deploy/ws/trunk/activemq-web-demo/target/activemq-web-demo-5.3.1-SNAPSHOT-sources.jar>
to /home/hudson/.m2/repository/org/apache/activemq/activemq-web-demo/5.3.1-SNAPSHOT/activemq-web-demo-5.3.1-SNAPSHOT-sources.jar
[INFO] [deploy:deploy {execution: default-deploy}]
[INFO] Retrieving previous build number from apache.snapshots.https
Uploading: https://repository.apache.org/content/repositories/snapshots/org/apache/activemq/activemq-web-demo/5.3.1-SNAPSHOT/activemq-web-demo-5.3.1-SNAPSHOT.war
14385K uploaded  (activemq-web-demo-5.3.1-SNAPSHOT.war)
[INFO] Retrieving previous metadata from apache.snapshots.https
[INFO] Uploading repository metadata for: 'artifact org.apache.activemq:activemq-web-demo'
[INFO] Retrieving previous metadata from apache.snapshots.https
[INFO] Uploading repository metadata for: 'snapshot org.apache.activemq:activemq-web-demo:5.3.1-SNAPSHOT'
[INFO] Uploading project information for activemq-web-demo 5.3.1-SNAPSHOT
[INFO] Retrieving previous build number from apache.snapshots.https
Uploading: https://repository.apache.org/content/repositories/snapshots/org/apache/activemq/activemq-web-demo/5.3.1-SNAPSHOT/activemq-web-demo-5.3.1-SNAPSHOT-sources.jar
6K uploaded  (activemq-web-demo-5.3.1-SNAPSHOT-sources.jar)
[HUDSON] Archiving <http://hudson.zones.apache.org/hudson/job/ActiveMQ-5.3-Deploy/ws/trunk/activemq-web-demo/target/activemq-web-demo-5.3.1-SNAPSHOT-sources.jar>
to /export/home/hudson/hudson/jobs/ActiveMQ-5.3-Deploy/modules/org.apache.activemq$activemq-web-demo/builds/2010-03-17_04-02-07/archive/org.apache.activemq/activemq-web-demo/5.3.1-SNAPSHOT/activemq-web-demo-5.3.1-SNAPSHOT-sources.jar
[INFO] ------------------------------------------------------------------------
[INFO] Building ActiveMQ :: XMPP
[INFO]    task-segment: [clean, deploy]
[INFO] ------------------------------------------------------------------------
[INFO] [clean:clean {execution: default-clean}]
Downloading: http://repository.apache.org/snapshots/org/apache/activemq/activemq-core/5.3.1-SNAPSHOT/activemq-core-5.3.1-SNAPSHOT.jar
Downloading: http://repository.apache.org/snapshots/org/apache/activemq/kahadb/5.3.1-SNAPSHOT/kahadb-5.3.1-SNAPSHOT.jar
[INFO] [enforcer:enforce {execution: default}]
[WARNING] POM for 'com.sun.xml.bind:jaxb-impl:pom:2.0.2:runtime' is invalid.

Its dependencies (if any) will NOT be available to the current build.
[WARNING] POM for 'com.sun.xml.bind:jaxb-xjc:pom:2.0.2:runtime' is invalid.

Its dependencies (if any) will NOT be available to the current build.
-----------------------------------------------------
this realm = app0.child-container[org.jvnet.jaxb2.maven2:maven-jaxb2-plugin:0.1]
urls[0] = file:/home/hudson/.m2/repository/org/jvnet/jaxb2/maven2/maven-jaxb2-plugin/0.1/maven-jaxb2-plugin-0.1.jar
urls[1] = file:/home/hudson/.m2/repository/org/codehaus/plexus/plexus-utils/1.1/plexus-utils-1.1.jar
urls[2] = file:/home/hudson/.m2/repository/com/sun/xml/bind/jaxb-impl/2.0.2/jaxb-impl-2.0.2.jar
urls[3] = file:/home/hudson/.m2/repository/com/sun/xml/bind/jaxb-xjc/2.0.2/jaxb-xjc-2.0.2.jar
Number of imports: 10
import: org.codehaus.classworlds.Entry@a6c57a42
import: org.codehaus.classworlds.Entry@12f43f3b
import: org.codehaus.classworlds.Entry@20025374
import: org.codehaus.classworlds.Entry@f8e44ca4
import: org.codehaus.classworlds.Entry@92758522
import: org.codehaus.classworlds.Entry@ebf2705b
import: org.codehaus.classworlds.Entry@bb25e54
import: org.codehaus.classworlds.Entry@bece5185
import: org.codehaus.classworlds.Entry@3fee8e37
import: org.codehaus.classworlds.Entry@3fee19d8


this realm = plexus.core.maven
Number of imports: 10
import: org.codehaus.classworlds.Entry@a6c57a42
import: org.codehaus.classworlds.Entry@12f43f3b
import: org.codehaus.classworlds.Entry@20025374
import: org.codehaus.classworlds.Entry@f8e44ca4
import: org.codehaus.classworlds.Entry@92758522
import: org.codehaus.classworlds.Entry@ebf2705b
import: org.codehaus.classworlds.Entry@bb25e54
import: org.codehaus.classworlds.Entry@bece5185
import: org.codehaus.classworlds.Entry@3fee8e37
import: org.codehaus.classworlds.Entry@3fee19d8


this realm = plexus.core
urls[0] = file:/home/hudson/hudson-slave/maven2.1-interceptor.jar
urls[1] = file:/home/hudson/hudson-slave/maven-interceptor.jar
urls[2] = file:/home/hudson/tools/maven/apache-maven-2.2.1/lib/maven-2.2.1-uber.jar
Number of imports: 10
import: org.codehaus.classworlds.Entry@a6c57a42
import: org.codehaus.classworlds.Entry@12f43f3b
import: org.codehaus.classworlds.Entry@20025374
import: org.codehaus.classworlds.Entry@f8e44ca4
import: org.codehaus.classworlds.Entry@92758522
import: org.codehaus.classworlds.Entry@ebf2705b
import: org.codehaus.classworlds.Entry@bb25e54
import: org.codehaus.classworlds.Entry@bece5185
import: org.codehaus.classworlds.Entry@3fee8e37
import: org.codehaus.classworlds.Entry@3fee19d8
-----------------------------------------------------
[HUDSON] Archiving <http://hudson.zones.apache.org/hudson/job/ActiveMQ-5.3-Deploy/ws/trunk/activemq-xmpp/pom.xml>
to /export/home/hudson/hudson/jobs/ActiveMQ-5.3-Deploy/modules/org.apache.activemq$activemq-xmpp/builds/2010-03-17_04-02-07/archive/org.apache.activemq/activemq-xmpp/5.3.1-SNAPSHOT/pom.xml
[INFO] ------------------------------------------------------------------------
[INFO] SKIPPING ActiveMQ :: Web Console
[INFO]    task-segment: [clean, deploy]
[INFO] This project has been banned from further executions due to previous failures.
[INFO] ------------------------------------------------------------------------
[INFO] ------------------------------------------------------------------------
[INFO] SKIPPING ActiveMQ :: Assembly
[INFO]    task-segment: [clean, deploy]
[INFO] This project has been banned from further executions due to previous failures.
[INFO] ------------------------------------------------------------------------
[INFO] 
[INFO] 
[INFO] ------------------------------------------------------------------------
[INFO] Reactor Summary:
[INFO] ------------------------------------------------------------------------
[INFO] ActiveMQ .............................................. SUCCESS [16.100s]
[INFO] ActiveMQ :: KahaDB .................................... SUCCESS [25.392s]
[INFO] ActiveMQ :: JAAS ...................................... SUCCESS [14.145s]
[INFO] Openwire Generator .................................... SUCCESS [12.672s]
[INFO] ActiveMQ :: jmdns 1.0 ................................. SUCCESS [14.490s]
[INFO] ActiveMQ :: Core ...................................... SUCCESS [2:18.452s]
[INFO] ActiveMQ :: RA ........................................ SUCCESS [3:13.485s]
[INFO] ActiveMQ :: Pool ...................................... SUCCESS [2:17.109s]
[INFO] ActiveMQ :: Camel ..................................... SUCCESS [23.835s]
[INFO] ActiveMQ :: Console ................................... SUCCESS [24.534s]
[INFO] ActiveMQ :: Optional .................................. SUCCESS [23.050s]
[INFO] ActiveMQ :: Jar Bundle ................................ SUCCESS [28.942s]
[INFO] ActiveMQ :: File Server ............................... SUCCESS [52.316s]
[INFO] ActiveMQ :: Apache Karaf .............................. SUCCESS [6.823s]
[INFO] ActiveMQ :: RAR ....................................... SUCCESS [58.370s]
[INFO] ActiveMQ :: Run Jar ................................... SUCCESS [8.103s]
[INFO] ActiveMQ Tooling ...................................... SUCCESS [3.291s]
[INFO] ActiveMQ :: Memory Usage Test Plugin .................. SUCCESS [14.300s]
[INFO] ActiveMQ :: Performance Test Plugin ................... SUCCESS [14.928s]
[INFO] ActiveMQ :: StartUp Plugin ............................ SUCCESS [12.425s]
[INFO] ActiveMQ :: Web ....................................... SUCCESS [37.727s]
[INFO] ActiveMQ :: Web Demo .................................. SUCCESS [1:46.759s]
[INFO] ActiveMQ :: XMPP ...................................... FAILED [0.837s]
[INFO] ActiveMQ :: Web Console ............................... SKIPPED (dependency build failed
or was skipped)
[INFO] ActiveMQ :: Assembly .................................. SKIPPED (dependency build failed
or was skipped)
[INFO] ------------------------------------------------------------------------
[INFO] Error for project: ActiveMQ :: XMPP (during deploy)
[INFO] ------------------------------------------------------------------------
[INFO] Internal error in the plugin manager executing goal 'org.jvnet.jaxb2.maven2:maven-jaxb2-plugin:0.1:generate':
Unable to load the mojo 'org.jvnet.jaxb2.maven2:maven-jaxb2-plugin:0.1:generate' in the plugin
'org.jvnet.jaxb2.maven2:maven-jaxb2-plugin'. A required class is missing: com/sun/tools/xjc/ErrorReceiver
[INFO] ------------------------------------------------------------------------
[INFO] Trace
org.apache.maven.lifecycle.LifecycleExecutionException: Internal error in the plugin manager
executing goal 'org.jvnet.jaxb2.maven2:maven-jaxb2-plugin:0.1:generate': Unable to load the
mojo 'org.jvnet.jaxb2.maven2:maven-jaxb2-plugin:0.1:generate' in the plugin 'org.jvnet.jaxb2.maven2:maven-jaxb2-plugin'.
A required class is missing: com/sun/tools/xjc/ErrorReceiver
	at org.apache.maven.lifecycle.DefaultLifecycleExecutor.executeGoals(DefaultLifecycleExecutor.java:698)
	at org.apache.maven.lifecycle.DefaultLifecycleExecutor.executeGoalWithLifecycle(DefaultLifecycleExecutor.java:556)
	at org.apache.maven.lifecycle.DefaultLifecycleExecutor.executeGoal(DefaultLifecycleExecutor.java:535)
	at org.apache.maven.lifecycle.DefaultLifecycleExecutor.executeGoalAndHandleFailures(DefaultLifecycleExecutor.java:387)
	at org.apache.maven.lifecycle.DefaultLifecycleExecutor.executeTaskSegments(DefaultLifecycleExecutor.java:348)
	at org.apache.maven.lifecycle.DefaultLifecycleExecutor.execute(DefaultLifecycleExecutor.java:180)
	at org.apache.maven.lifecycle.LifecycleExecutorInterceptor.execute(LifecycleExecutorInterceptor.java:65)
	at org.apache.maven.DefaultMaven.doExecute(DefaultMaven.java:328)
	at org.apache.maven.DefaultMaven.execute(DefaultMaven.java:138)
	at org.apache.maven.cli.MavenCli.main(MavenCli.java:362)
	at sun.reflect.NativeMethodAccessorImpl.invoke0(Native Method)
	at sun.reflect.NativeMethodAccessorImpl.invoke(NativeMethodAccessorImpl.java:39)
	at sun.reflect.DelegatingMethodAccessorImpl.invoke(DelegatingMethodAccessorImpl.java:25)
	at java.lang.reflect.Method.invoke(Method.java:585)
	at org.codehaus.classworlds.Launcher.launchEnhanced(Launcher.java:315)
	at org.codehaus.classworlds.Launcher.launch(Launcher.java:255)
	at hudson.maven.agent.Main.launch(Main.java:165)
	at hudson.maven.MavenBuilder.call(MavenBuilder.java:159)
	at hudson.maven.MavenModuleSetBuild$Builder.call(MavenModuleSetBuild.java:688)
	at hudson.maven.MavenModuleSetBuild$Builder.call(MavenModuleSetBuild.java:632)
	at hudson.remoting.UserRequest.perform(UserRequest.java:104)
	at hudson.remoting.UserRequest.perform(UserRequest.java:48)
	at hudson.remoting.Request$2.run(Request.java:236)
	at java.util.concurrent.Executors$RunnableAdapter.call(Executors.java:417)
	at java.util.concurrent.FutureTask$Sync.innerRun(FutureTask.java:269)
	at java.util.concurrent.FutureTask.run(FutureTask.java:123)
	at java.util.concurrent.ThreadPoolExecutor$Worker.runTask(ThreadPoolExecutor.java:650)
	at java.util.concurrent.ThreadPoolExecutor$Worker.run(ThreadPoolExecutor.java:675)
	at java.lang.Thread.run(Thread.java:595)
Caused by: org.apache.maven.plugin.PluginManagerException: Unable to load the mojo 'org.jvnet.jaxb2.maven2:maven-jaxb2-plugin:0.1:generate'
in the plugin 'org.jvnet.jaxb2.maven2:maven-jaxb2-plugin'. A required class is missing: com/sun/tools/xjc/ErrorReceiver
	at org.apache.maven.plugin.DefaultPluginManager.getConfiguredMojo(DefaultPluginManager.java:669)
	at org.apache.maven.plugin.DefaultPluginManager.executeMojo(DefaultPluginManager.java:468)
	at hudson.maven.agent.PluginManagerInterceptor.executeMojo(PluginManagerInterceptor.java:182)
	at org.apache.maven.lifecycle.DefaultLifecycleExecutor.executeGoals(DefaultLifecycleExecutor.java:694)
	... 28 more
Caused by: org.codehaus.plexus.component.repository.exception.ComponentLookupException: Unable
to lookup component 'org.apache.maven.plugin.Mojoorg.jvnet.jaxb2.maven2:maven-jaxb2-plugin:0.1:generate',
it could not be created
	at org.codehaus.plexus.DefaultPlexusContainer.lookup(DefaultPlexusContainer.java:335)
	at org.codehaus.plexus.DefaultPlexusContainer.lookup(DefaultPlexusContainer.java:440)
	at hudson.maven.agent.ContainerFilter.lookup(ContainerFilter.java:89)
	at hudson.maven.agent.PluginManagerInterceptor$1$1.lookup(PluginManagerInterceptor.java:95)
	at org.apache.maven.plugin.DefaultPluginManager.getConfiguredMojo(DefaultPluginManager.java:652)
	... 31 more
Caused by: org.codehaus.plexus.component.factory.ComponentInstantiationException: Could not
instanciate component: role: 'null', implementation: 'org.jvnet.jaxb2.maven2.XJC2Mojo'
	at org.codehaus.plexus.component.factory.java.JavaComponentFactory.makeException(JavaComponentFactory.java:77)
	at org.codehaus.plexus.component.factory.java.JavaComponentFactory.newInstance(JavaComponentFactory.java:62)
	at org.codehaus.plexus.DefaultPlexusContainer.createComponentInstance(DefaultPlexusContainer.java:1464)
	at org.codehaus.plexus.component.manager.AbstractComponentManager.createComponentInstance(AbstractComponentManager.java:93)
	at org.codehaus.plexus.component.manager.PerLookupComponentManager.getComponent(PerLookupComponentManager.java:48)
	at org.codehaus.plexus.DefaultPlexusContainer.lookup(DefaultPlexusContainer.java:331)
	... 35 more
Caused by: java.lang.NoClassDefFoundError: com/sun/tools/xjc/ErrorReceiver
	at java.lang.Class.getDeclaredConstructors0(Native Method)
	at java.lang.Class.privateGetDeclaredConstructors(Class.java:2357)
	at java.lang.Class.getConstructor0(Class.java:2671)
	at java.lang.Class.newInstance0(Class.java:321)
	at java.lang.Class.newInstance(Class.java:303)
	at org.codehaus.plexus.component.factory.java.JavaComponentFactory.newInstance(JavaComponentFactory.java:44)
	... 39 more
[INFO] ------------------------------------------------------------------------
[INFO] BUILD ERRORS
[INFO] ------------------------------------------------------------------------
[INFO] Total time: 19 minutes 10 seconds
[INFO] Finished at: Wed Mar 17 04:21:25 UTC 2010
[INFO] Final Memory: 91M/1067M
[INFO] ------------------------------------------------------------------------
Waiting for Hudson to finish collecting data
channel stopped


Mime
View raw message