activemq-dev mailing list archives

Site index · List index
Message view « Date » · « Thread »
Top « Date » · « Thread »
From Apache Hudson Server <hud...@hudson.zones.apache.org>
Subject Build failed in Hudson: ActiveMQ-5.3 #44
Date Thu, 18 Feb 2010 15:16:47 GMT
See <http://hudson.zones.apache.org/hudson/job/ActiveMQ-5.3/44/changes>

Changes:

[gtully] merge -r910315 https://svn.apache.org/repos/asf/activemq/trunk - resolve https://issues.apache.org/activemq/browse/AMQ-2607

------------------------------------------
[...truncated 5371 lines...]
[INFO]    task-segment: [clean, install]
[INFO] This project has been banned from further executions due to previous failures.
[INFO] ------------------------------------------------------------------------
[INFO] ------------------------------------------------------------------------
[INFO] SKIPPING ActiveMQ :: Optional
[INFO]    task-segment: [clean, install]
[INFO] This project has been banned from further executions due to previous failures.
[INFO] ------------------------------------------------------------------------
[INFO] ------------------------------------------------------------------------
[INFO] SKIPPING ActiveMQ :: Jar Bundle
[INFO]    task-segment: [clean, install]
[INFO] This project has been banned from further executions due to previous failures.
[INFO] ------------------------------------------------------------------------
[INFO] ------------------------------------------------------------------------
[INFO] SKIPPING ActiveMQ :: File Server
[INFO]    task-segment: [clean, install]
[INFO] This project has been banned from further executions due to previous failures.
[INFO] ------------------------------------------------------------------------
[INFO] ------------------------------------------------------------------------
[INFO] Building ActiveMQ :: Apache Karaf
[INFO]    task-segment: [clean, install]
[INFO] ------------------------------------------------------------------------
Downloading: http://repository.apache.org/snapshots/org/codehaus/mojo/build-helper-maven-plugin/1.2/build-helper-maven-plugin-1.2.pom
Downloading: http://repo1.maven.org/maven2/org/codehaus/mojo/build-helper-maven-plugin/1.2/build-helper-maven-plugin-1.2.pom
Downloading: http://repository.apache.org/snapshots/org/codehaus/mojo/mojo/17/mojo-17.pom
Downloading: http://repo1.maven.org/maven2/org/codehaus/mojo/mojo/17/mojo-17.pom
Downloading: http://repository.apache.org/snapshots/org/codehaus/mojo/build-helper-maven-plugin/1.2/build-helper-maven-plugin-1.2.jar
Downloading: http://repo1.maven.org/maven2/org/codehaus/mojo/build-helper-maven-plugin/1.2/build-helper-maven-plugin-1.2.jar
[INFO] [clean:clean]
[INFO] [enforcer:enforce {execution: default}]
[INFO] [remote-resources:process {execution: default}]
[INFO] [resources:resources {execution: filter}]
[INFO] Using 'UTF-8' encoding to copy filtered resources.
[INFO] Copying 1 resource
[INFO] Copying 3 resources
[INFO] [resources:resources]
[INFO] Using 'UTF-8' encoding to copy filtered resources.
[INFO] Copying 1 resource
[INFO] Copying 3 resources
[INFO] [compiler:compile]
[INFO] No sources to compile
[INFO] [resources:testResources]
[INFO] Using 'UTF-8' encoding to copy filtered resources.
[INFO] skip non existing resourceDirectory <http://hudson.zones.apache.org/hudson/job/ActiveMQ-5.3/ws/activemq-5.3/activemq-karaf/src/test/resources>
[INFO] Copying 3 resources
[INFO] [compiler:testCompile]
[INFO] No sources to compile
[INFO] [surefire:test]
Downloading: http://repository.apache.org/snapshots/org/apache/maven/surefire/surefire-junit/2.4.3/surefire-junit-2.4.3.pom
Downloading: http://repo1.maven.org/maven2/org/apache/maven/surefire/surefire-junit/2.4.3/surefire-junit-2.4.3.pom
Downloading: http://repository.apache.org/snapshots/org/apache/maven/surefire/surefire-junit/2.4.3/surefire-junit-2.4.3.jar
Downloading: http://repo1.maven.org/maven2/org/apache/maven/surefire/surefire-junit/2.4.3/surefire-junit-2.4.3.jar
Downloading: http://repository.apache.org/snapshots/junit/junit/3.8.1/junit-3.8.1.jar
Downloading: http://repo1.maven.org/maven2/junit/junit/3.8.1/junit-3.8.1.jar
[INFO] Surefire report directory: <http://hudson.zones.apache.org/hudson/job/ActiveMQ-5.3/ws/activemq-5.3/activemq-karaf/target/surefire-reports>

-------------------------------------------------------
 T E S T S
-------------------------------------------------------
There are no tests to run.

Results :

Tests run: 0, Failures: 0, Errors: 0, Skipped: 0

[HUDSON] Recording test results
[INFO] [jar:jar]
[INFO] Building jar: <http://hudson.zones.apache.org/hudson/job/ActiveMQ-5.3/ws/activemq-5.3/activemq-karaf/target/activemq-karaf-5.3.1-SNAPSHOT.jar>
Downloading: http://repository.apache.org/snapshots/org/apache/maven/maven-project/2.0.2/maven-project-2.0.2.pom
Downloading: http://repo1.maven.org/maven2/org/apache/maven/maven-project/2.0.2/maven-project-2.0.2.pom
Downloading: http://repository.apache.org/snapshots/org/apache/maven/maven-profile/2.0.2/maven-profile-2.0.2.pom
Downloading: http://repository.springsource.com/maven/bundles/external/org/apache/maven/maven-profile/2.0.2/maven-profile-2.0.2.pom
Downloading: http://repo1.maven.org/maven2/org/apache/maven/maven-profile/2.0.2/maven-profile-2.0.2.pom
Downloading: http://repository.apache.org/snapshots/org/apache/maven/maven-model/2.0.2/maven-model-2.0.2.pom
Downloading: http://repository.springsource.com/maven/bundles/external/org/apache/maven/maven-model/2.0.2/maven-model-2.0.2.pom
Downloading: http://repo1.maven.org/maven2/org/apache/maven/maven-model/2.0.2/maven-model-2.0.2.pom
Downloading: http://repository.apache.org/snapshots/org/apache/maven/maven-repository-metadata/2.0.2/maven-repository-metadata-2.0.2.pom
Downloading: http://repository.springsource.com/maven/bundles/external/org/apache/maven/maven-repository-metadata/2.0.2/maven-repository-metadata-2.0.2.pom
Downloading: http://repo1.maven.org/maven2/org/apache/maven/maven-repository-metadata/2.0.2/maven-repository-metadata-2.0.2.pom
[INFO] [build-helper:attach-artifact {execution: attach-artifacts}]
[INFO] [ianal:verify-legal-files {execution: default}]
[INFO] Checking legal files in: activemq-karaf-5.3.1-SNAPSHOT.jar
[INFO] [install:install]
[INFO] Installing <http://hudson.zones.apache.org/hudson/job/ActiveMQ-5.3/ws/activemq-5.3/activemq-karaf/target/activemq-karaf-5.3.1-SNAPSHOT.jar>
to <http://hudson.zones.apache.org/hudson/job/ActiveMQ-5.3/ws/.repository/org/apache/activemq/activemq-karaf/5.3.1-SNAPSHOT/activemq-karaf-5.3.1-SNAPSHOT.jar>
[INFO] Installing <http://hudson.zones.apache.org/hudson/job/ActiveMQ-5.3/ws/activemq-5.3/activemq-karaf/target/classes/features.xml>
to <http://hudson.zones.apache.org/hudson/job/ActiveMQ-5.3/ws/.repository/org/apache/activemq/activemq-karaf/5.3.1-SNAPSHOT/activemq-karaf-5.3.1-SNAPSHOT-features.xml>
[HUDSON] Archiving <http://hudson.zones.apache.org/hudson/job/ActiveMQ-5.3/ws/activemq-5.3/activemq-karaf/pom.xml>
to /export/home/hudson/hudson/jobs/ActiveMQ-5.3/modules/org.apache.activemq$activemq-karaf/builds/2010-02-18_15-04-11/archive/org.apache.activemq/activemq-karaf/5.3.1-SNAPSHOT/pom.xml
[HUDSON] Archiving <http://hudson.zones.apache.org/hudson/job/ActiveMQ-5.3/ws/activemq-5.3/activemq-karaf/target/activemq-karaf-5.3.1-SNAPSHOT.jar>
to /export/home/hudson/hudson/jobs/ActiveMQ-5.3/modules/org.apache.activemq$activemq-karaf/builds/2010-02-18_15-04-11/archive/org.apache.activemq/activemq-karaf/5.3.1-SNAPSHOT/activemq-karaf-5.3.1-SNAPSHOT.jar
[HUDSON] Archiving <http://hudson.zones.apache.org/hudson/job/ActiveMQ-5.3/ws/activemq-5.3/activemq-karaf/target/classes/features.xml>
to /export/home/hudson/hudson/jobs/ActiveMQ-5.3/modules/org.apache.activemq$activemq-karaf/builds/2010-02-18_15-04-11/archive/org.apache.activemq/activemq-karaf/5.3.1-SNAPSHOT/features.xml
[INFO] ------------------------------------------------------------------------
[INFO] SKIPPING ActiveMQ :: RAR
[INFO]    task-segment: [clean, install]
[INFO] This project has been banned from further executions due to previous failures.
[INFO] ------------------------------------------------------------------------
[INFO] ------------------------------------------------------------------------
[INFO] SKIPPING ActiveMQ :: Run Jar
[INFO]    task-segment: [clean, install]
[INFO] This project has been banned from further executions due to previous failures.
[INFO] ------------------------------------------------------------------------
[INFO] ------------------------------------------------------------------------
[INFO] Building ActiveMQ Tooling
[INFO]    task-segment: [clean, install]
[INFO] ------------------------------------------------------------------------
[INFO] [clean:clean]
[INFO] [enforcer:enforce {execution: default}]
[INFO] [remote-resources:process {execution: default}]
[INFO] [site:attach-descriptor]
[INFO] [ianal:verify-legal-files {execution: default}]
[INFO] [install:install]
[INFO] Installing <http://hudson.zones.apache.org/hudson/job/ActiveMQ-5.3/ws/activemq-5.3/activemq-tooling/pom.xml>
to <http://hudson.zones.apache.org/hudson/job/ActiveMQ-5.3/ws/.repository/org/apache/activemq/tooling/activemq-tooling/5.3.1-SNAPSHOT/activemq-tooling-5.3.1-SNAPSHOT.pom>
[HUDSON] Archiving <http://hudson.zones.apache.org/hudson/job/ActiveMQ-5.3/ws/activemq-5.3/activemq-tooling/pom.xml>
to /export/home/hudson/hudson/jobs/ActiveMQ-5.3/modules/org.apache.activemq.tooling$activemq-tooling/builds/2010-02-18_15-04-11/archive/org.apache.activemq.tooling/activemq-tooling/5.3.1-SNAPSHOT/pom.xml
[INFO] ------------------------------------------------------------------------
[INFO] SKIPPING ActiveMQ :: Memory Usage Test Plugin
[INFO]    task-segment: [clean, install]
[INFO] This project has been banned from further executions due to previous failures.
[INFO] ------------------------------------------------------------------------
[INFO] ------------------------------------------------------------------------
[INFO] SKIPPING ActiveMQ :: Performance Test Plugin
[INFO]    task-segment: [clean, install]
[INFO] This project has been banned from further executions due to previous failures.
[INFO] ------------------------------------------------------------------------
[INFO] ------------------------------------------------------------------------
[INFO] SKIPPING ActiveMQ :: StartUp Plugin
[INFO]    task-segment: [clean, install]
[INFO] This project has been banned from further executions due to previous failures.
[INFO] ------------------------------------------------------------------------
[INFO] ------------------------------------------------------------------------
[INFO] SKIPPING ActiveMQ :: Web
[INFO]    task-segment: [clean, install]
[INFO] This project has been banned from further executions due to previous failures.
[INFO] ------------------------------------------------------------------------
[INFO] ------------------------------------------------------------------------
[INFO] SKIPPING ActiveMQ :: Web Demo
[INFO]    task-segment: [clean, install]
[INFO] This project has been banned from further executions due to previous failures.
[INFO] ------------------------------------------------------------------------
[INFO] ------------------------------------------------------------------------
[INFO] SKIPPING ActiveMQ :: XMPP
[INFO]    task-segment: [clean, install]
[INFO] This project has been banned from further executions due to previous failures.
[INFO] ------------------------------------------------------------------------
[INFO] ------------------------------------------------------------------------
[INFO] SKIPPING ActiveMQ :: Web Console
[INFO]    task-segment: [clean, install]
[INFO] This project has been banned from further executions due to previous failures.
[INFO] ------------------------------------------------------------------------
[INFO] ------------------------------------------------------------------------
[INFO] SKIPPING ActiveMQ :: Assembly
[INFO]    task-segment: [clean, install]
[INFO] This project has been banned from further executions due to previous failures.
[INFO] ------------------------------------------------------------------------
[INFO] 
[INFO] 
[INFO] ------------------------------------------------------------------------
[INFO] Reactor Summary:
[INFO] ------------------------------------------------------------------------
[INFO] ActiveMQ .............................................. SUCCESS [4:58.912s]
[INFO] ActiveMQ :: KahaDB .................................... SUCCESS [1:55.942s]
[INFO] ActiveMQ :: JAAS ...................................... SUCCESS [1:42.003s]
[INFO] Openwire Generator .................................... SUCCESS [28.163s]
[INFO] ActiveMQ :: jmdns 1.0 ................................. SUCCESS [0.941s]
[INFO] ActiveMQ :: Core ...................................... FAILED [2:36.054s]
[INFO] ActiveMQ :: RA ........................................ SKIPPED (dependency build failed
or was skipped)
[INFO] ActiveMQ :: Pool ...................................... SKIPPED (dependency build failed
or was skipped)
[INFO] ActiveMQ :: Camel ..................................... SKIPPED (dependency build failed
or was skipped)
[INFO] ActiveMQ :: Console ................................... SKIPPED (dependency build failed
or was skipped)
[INFO] ActiveMQ :: Optional .................................. SKIPPED (dependency build failed
or was skipped)
[INFO] ActiveMQ :: Jar Bundle ................................ SKIPPED (dependency build failed
or was skipped)
[INFO] ActiveMQ :: File Server ............................... SKIPPED (dependency build failed
or was skipped)
[INFO] ActiveMQ :: Apache Karaf .............................. SUCCESS [9.653s]
[INFO] ActiveMQ :: RAR ....................................... SKIPPED (dependency build failed
or was skipped)
[INFO] ActiveMQ :: Run Jar ................................... SKIPPED (dependency build failed
or was skipped)
[INFO] ActiveMQ Tooling ...................................... SUCCESS [0.158s]
[INFO] ActiveMQ :: Memory Usage Test Plugin .................. SKIPPED (dependency build failed
or was skipped)
[INFO] ActiveMQ :: Performance Test Plugin ................... SKIPPED (dependency build failed
or was skipped)
[INFO] ActiveMQ :: StartUp Plugin ............................ SKIPPED (dependency build failed
or was skipped)
[INFO] ActiveMQ :: Web ....................................... SKIPPED (dependency build failed
or was skipped)
[INFO] ActiveMQ :: Web Demo .................................. SKIPPED (dependency build failed
or was skipped)
[INFO] ActiveMQ :: XMPP ...................................... SKIPPED (dependency build failed
or was skipped)
[INFO] ActiveMQ :: Web Console ............................... SKIPPED (dependency build failed
or was skipped)
[INFO] ActiveMQ :: Assembly .................................. SKIPPED (dependency build failed
or was skipped)
[INFO] ------------------------------------------------------------------------
[INFO] Error for project: ActiveMQ :: Core (during install)
[INFO] ------------------------------------------------------------------------
[INFO] Compilation failure

<http://hudson.zones.apache.org/hudson/job/ActiveMQ-5.3/ws/activemq-5.3/activemq-core/src/main/java/org/apache/activemq/ActiveMQConnection.java>:[2270,16]
cannot find symbol
symbol  : class FailoverTransport
location: class org.apache.activemq.ActiveMQConnection

<http://hudson.zones.apache.org/hudson/job/ActiveMQ-5.3/ws/activemq-5.3/activemq-core/src/main/java/org/apache/activemq/ActiveMQConnection.java>:[2270,71]
cannot find symbol
symbol  : class FailoverTransport
location: class org.apache.activemq.ActiveMQConnection

<http://hudson.zones.apache.org/hudson/job/ActiveMQ-5.3/ws/activemq-5.3/activemq-core/src/main/java/org/apache/activemq/transport/failover/FailoverTransport.java>:[216,28]
cannot find symbol
symbol  : method transportInterrupted()
location: class org.apache.activemq.state.ConnectionStateTracker


[INFO] ------------------------------------------------------------------------
[INFO] Trace
org.apache.maven.BuildFailureException: Compilation failure
	at org.apache.maven.lifecycle.DefaultLifecycleExecutor.executeGoals(DefaultLifecycleExecutor.java:580)
	at org.apache.maven.lifecycle.DefaultLifecycleExecutor.executeGoalWithLifecycle(DefaultLifecycleExecutor.java:500)
	at org.apache.maven.lifecycle.DefaultLifecycleExecutor.executeGoal(DefaultLifecycleExecutor.java:479)
	at org.apache.maven.lifecycle.DefaultLifecycleExecutor.executeGoalAndHandleFailures(DefaultLifecycleExecutor.java:331)
	at org.apache.maven.lifecycle.DefaultLifecycleExecutor.executeTaskSegments(DefaultLifecycleExecutor.java:292)
	at org.apache.maven.lifecycle.DefaultLifecycleExecutor.execute(DefaultLifecycleExecutor.java:142)
	at org.apache.maven.lifecycle.LifecycleExecutorInterceptor.execute(LifecycleExecutorInterceptor.java:65)
	at org.apache.maven.DefaultMaven.doExecute(DefaultMaven.java:336)
	at org.apache.maven.DefaultMaven.execute(DefaultMaven.java:129)
	at org.apache.maven.cli.MavenCli.main(MavenCli.java:301)
	at sun.reflect.NativeMethodAccessorImpl.invoke0(Native Method)
	at sun.reflect.NativeMethodAccessorImpl.invoke(NativeMethodAccessorImpl.java:39)
	at sun.reflect.DelegatingMethodAccessorImpl.invoke(DelegatingMethodAccessorImpl.java:25)
	at java.lang.reflect.Method.invoke(Method.java:585)
	at org.codehaus.classworlds.Launcher.launchEnhanced(Launcher.java:315)
	at org.codehaus.classworlds.Launcher.launch(Launcher.java:255)
	at hudson.maven.agent.Main.launch(Main.java:165)
	at hudson.maven.MavenBuilder.call(MavenBuilder.java:159)
	at hudson.maven.MavenModuleSetBuild$Builder.call(MavenModuleSetBuild.java:688)
	at hudson.maven.MavenModuleSetBuild$Builder.call(MavenModuleSetBuild.java:632)
	at hudson.remoting.UserRequest.perform(UserRequest.java:104)
	at hudson.remoting.UserRequest.perform(UserRequest.java:48)
	at hudson.remoting.Request$2.run(Request.java:236)
	at java.util.concurrent.Executors$RunnableAdapter.call(Executors.java:417)
	at java.util.concurrent.FutureTask$Sync.innerRun(FutureTask.java:269)
	at java.util.concurrent.FutureTask.run(FutureTask.java:123)
	at java.util.concurrent.ThreadPoolExecutor$Worker.runTask(ThreadPoolExecutor.java:650)
	at java.util.concurrent.ThreadPoolExecutor$Worker.run(ThreadPoolExecutor.java:675)
	at java.lang.Thread.run(Thread.java:595)
Caused by: org.apache.maven.plugin.CompilationFailureException: Compilation failure
	at org.apache.maven.plugin.AbstractCompilerMojo.execute(AbstractCompilerMojo.java:516)
	at org.apache.maven.plugin.CompilerMojo.execute(CompilerMojo.java:114)
	at org.apache.maven.plugin.DefaultPluginManager.executeMojo(DefaultPluginManager.java:453)
	at hudson.maven.agent.PluginManagerInterceptor.executeMojo(PluginManagerInterceptor.java:182)
	at org.apache.maven.lifecycle.DefaultLifecycleExecutor.executeGoals(DefaultLifecycleExecutor.java:559)
	... 28 more
[INFO] ------------------------------------------------------------------------
[INFO] BUILD ERRORS
[INFO] ------------------------------------------------------------------------
[INFO] Total time: 12 minutes 8 seconds
[INFO] Finished at: Thu Feb 18 15:16:34 UTC 2010
[INFO] Final Memory: 55M/1105M
[INFO] ------------------------------------------------------------------------
Waiting for Hudson to finish collecting data
Sending e-mails to: dev@activemq.apache.org
channel stopped
[locks-and-latches] Releasing all the locks
[locks-and-latches] All the locks released


Mime
View raw message