activemq-dev mailing list archives

Site index · List index
Message view « Date » · « Thread »
Top « Date » · « Thread »
From Apache Hudson Server <hud...@hudson.zones.apache.org>
Subject Build failed in Hudson: ActiveMQ-5.3 #35
Date Tue, 02 Feb 2010 09:42:09 GMT
See <http://hudson.zones.apache.org/hudson/job/ActiveMQ-5.3/35/changes>

Changes:

[gtully] merge -c 833435 https://svn.apache.org/repos/asf/activemq/trunk - resolve intermittent
failure of DiscoveryNetworkReconnectTest due to network timing issues

[gtully] merge -c 905432 https://svn.apache.org/repos/asf/activemq/trunk - commit may throw
a TransactionRolledBackException in the event that after a failover recovery, the same messages
are not redispatched - the transaction cannot be fully recreated so it must rollback

[gtully] merge -c 905349 https://svn.apache.org/repos/asf/activemq/trunk - resolve: https://issues.apache.org/activemq/browse/AMQ-2589
- add null check

------------------------------------------
[...truncated 8365 lines...]
Downloading: http://download.java.net/maven/2/jivesoftware/smackx/3.1.0/smackx-3.1.0.jar
Downloading: http://repository.codehaus.org//jivesoftware/smackx/3.1.0/smackx-3.1.0.jar
Downloading: http://repository.springsource.com/maven/bundles/external/jivesoftware/smackx/3.1.0/smackx-3.1.0.jar
Downloading: http://repo1.maven.org/maven2/jivesoftware/smackx/3.1.0/smackx-3.1.0.jar
[INFO] [enforcer:enforce {execution: default}]
Downloading: http://download.java.net/maven/2/org/apache/maven/maven-settings/2.0.4/maven-settings-2.0.4.pom
Downloading: https://repository.apache.org/content/repositories/snapshots//org/apache/maven/maven-settings/2.0.4/maven-settings-2.0.4.pom
Downloading: https://maven-repository.dev.java.net/nonav/repository/org.apache.maven/poms/maven-settings-2.0.4.pom
367b downloaded
[WARNING] *** CHECKSUM FAILED - Checksum failed on download: local = 'de0c356d76856d8e6729cd5eb14e271c53852c3a';
remote = '<!DOCTYPE' - RETRYING
Downloading: https://maven-repository.dev.java.net/nonav/repository/org.apache.maven/poms/maven-settings-2.0.4.pom
367b downloaded
[WARNING] *** CHECKSUM FAILED - Checksum failed on download: local = 'de0c356d76856d8e6729cd5eb14e271c53852c3a';
remote = '<!DOCTYPE' - IGNORING
[WARNING] POM for 'org.apache.maven:maven-settings:pom:2.0.4:runtime' is invalid. It will
be ignored for artifact resolution. Reason: Not a v4.0.0 POM. for project org.apache.maven:maven-settings
at <http://hudson.zones.apache.org/hudson/job/ActiveMQ-5.3/ws/.repository/org/apache/maven/maven-settings/2.0.4/maven-settings-2.0.4.pom>
[WARNING] POM for 'org.apache.maven:maven-settings:pom:2.0.4:runtime' is invalid. It will
be ignored for artifact resolution. Reason: Not a v4.0.0 POM. for project org.apache.maven:maven-settings
at <http://hudson.zones.apache.org/hudson/job/ActiveMQ-5.3/ws/.repository/org/apache/maven/maven-settings/2.0.4/maven-settings-2.0.4.pom>
Downloading: http://download.java.net/maven/2/org/apache/maven/maven-profile/2.0.4/maven-profile-2.0.4.pom
Downloading: https://repository.apache.org/content/repositories/snapshots//org/apache/maven/maven-profile/2.0.4/maven-profile-2.0.4.pom
Downloading: https://maven-repository.dev.java.net/nonav/repository/org.apache.maven/poms/maven-profile-2.0.4.pom
366b downloaded
[WARNING] *** CHECKSUM FAILED - Checksum failed on download: local = 'bb64cd1224f0b91ecd251d042820a69c2540b591';
remote = '<!DOCTYPE' - RETRYING
Downloading: https://maven-repository.dev.java.net/nonav/repository/org.apache.maven/poms/maven-profile-2.0.4.pom
366b downloaded
[WARNING] *** CHECKSUM FAILED - Checksum failed on download: local = 'bb64cd1224f0b91ecd251d042820a69c2540b591';
remote = '<!DOCTYPE' - IGNORING
[WARNING] POM for 'org.apache.maven:maven-profile:pom:2.0.4:runtime' is invalid. It will be
ignored for artifact resolution. Reason: Not a v4.0.0 POM. for project org.apache.maven:maven-profile
at <http://hudson.zones.apache.org/hudson/job/ActiveMQ-5.3/ws/.repository/org/apache/maven/maven-profile/2.0.4/maven-profile-2.0.4.pom>
[WARNING] POM for 'org.apache.maven:maven-profile:pom:2.0.4:runtime' is invalid. It will be
ignored for artifact resolution. Reason: Not a v4.0.0 POM. for project org.apache.maven:maven-profile
at <http://hudson.zones.apache.org/hudson/job/ActiveMQ-5.3/ws/.repository/org/apache/maven/maven-profile/2.0.4/maven-profile-2.0.4.pom>
Downloading: http://download.java.net/maven/2/org/apache/maven/maven-model/2.0.4/maven-model-2.0.4.pom
Downloading: https://repository.apache.org/content/repositories/snapshots//org/apache/maven/maven-model/2.0.4/maven-model-2.0.4.pom
Downloading: https://maven-repository.dev.java.net/nonav/repository/org.apache.maven/poms/maven-model-2.0.4.pom
364b downloaded
[WARNING] *** CHECKSUM FAILED - Checksum failed on download: local = 'ca59f379d1b1f9c332921331db086fa357d1acd9';
remote = '<!DOCTYPE' - RETRYING
Downloading: https://maven-repository.dev.java.net/nonav/repository/org.apache.maven/poms/maven-model-2.0.4.pom
364b downloaded
[WARNING] *** CHECKSUM FAILED - Checksum failed on download: local = 'ca59f379d1b1f9c332921331db086fa357d1acd9';
remote = '<!DOCTYPE' - IGNORING
[WARNING] POM for 'org.apache.maven:maven-model:pom:2.0.4:runtime' is invalid. It will be
ignored for artifact resolution. Reason: Not a v4.0.0 POM. for project org.apache.maven:maven-model
at <http://hudson.zones.apache.org/hudson/job/ActiveMQ-5.3/ws/.repository/org/apache/maven/maven-model/2.0.4/maven-model-2.0.4.pom>
[WARNING] POM for 'org.apache.maven:maven-model:pom:2.0.4:runtime' is invalid. It will be
ignored for artifact resolution. Reason: Not a v4.0.0 POM. for project org.apache.maven:maven-model
at <http://hudson.zones.apache.org/hudson/job/ActiveMQ-5.3/ws/.repository/org/apache/maven/maven-model/2.0.4/maven-model-2.0.4.pom>
Downloading: http://download.java.net/maven/2/org/apache/maven/maven-artifact-manager/2.0.4/maven-artifact-manager-2.0.4.pom
Downloading: https://repository.apache.org/content/repositories/snapshots//org/apache/maven/maven-artifact-manager/2.0.4/maven-artifact-manager-2.0.4.pom
Downloading: https://maven-repository.dev.java.net/nonav/repository/org.apache.maven/poms/maven-artifact-manager-2.0.4.pom
375b downloaded
[WARNING] *** CHECKSUM FAILED - Checksum failed on download: local = '7f9f1a7a1979d721c645aabd45aa08cc659f2f31';
remote = '<!DOCTYPE' - RETRYING
Downloading: https://maven-repository.dev.java.net/nonav/repository/org.apache.maven/poms/maven-artifact-manager-2.0.4.pom
375b downloaded
[WARNING] *** CHECKSUM FAILED - Checksum failed on download: local = '7f9f1a7a1979d721c645aabd45aa08cc659f2f31';
remote = '<!DOCTYPE' - IGNORING
[WARNING] POM for 'org.apache.maven:maven-artifact-manager:pom:2.0.4:runtime' is invalid.
It will be ignored for artifact resolution. Reason: Not a v4.0.0 POM. for project org.apache.maven:maven-artifact-manager
at <http://hudson.zones.apache.org/hudson/job/ActiveMQ-5.3/ws/.repository/org/apache/maven/maven-artifact-manager/2.0.4/maven-artifact-manager-2.0.4.pom>
[WARNING] POM for 'org.apache.maven:maven-artifact-manager:pom:2.0.4:runtime' is invalid.
It will be ignored for artifact resolution. Reason: Not a v4.0.0 POM. for project org.apache.maven:maven-artifact-manager
at <http://hudson.zones.apache.org/hudson/job/ActiveMQ-5.3/ws/.repository/org/apache/maven/maven-artifact-manager/2.0.4/maven-artifact-manager-2.0.4.pom>
Downloading: http://download.java.net/maven/2/com/sun/xml/bind/jaxb-impl/2.0.2/jaxb-impl-2.0.2.pom
Downloading: https://repository.apache.org/content/repositories/snapshots//com/sun/xml/bind/jaxb-impl/2.0.2/jaxb-impl-2.0.2.pom
Downloading: https://maven-repository.dev.java.net/nonav/repository/com.sun.xml.bind/poms/jaxb-impl-2.0.2.pom
362b downloaded
[WARNING] *** CHECKSUM FAILED - Checksum failed on download: local = '769ae6c9dafd6130220a06e5beee91705e5b7bde';
remote = '<!DOCTYPE' - RETRYING
Downloading: https://maven-repository.dev.java.net/nonav/repository/com.sun.xml.bind/poms/jaxb-impl-2.0.2.pom
362b downloaded
[WARNING] *** CHECKSUM FAILED - Checksum failed on download: local = '769ae6c9dafd6130220a06e5beee91705e5b7bde';
remote = '<!DOCTYPE' - IGNORING
[WARNING] POM for 'com.sun.xml.bind:jaxb-impl:pom:2.0.2:runtime' is invalid. It will be ignored
for artifact resolution. Reason: Not a v4.0.0 POM. for project com.sun.xml.bind:jaxb-impl
at <http://hudson.zones.apache.org/hudson/job/ActiveMQ-5.3/ws/.repository/com/sun/xml/bind/jaxb-impl/2.0.2/jaxb-impl-2.0.2.pom>
[WARNING] POM for 'com.sun.xml.bind:jaxb-impl:pom:2.0.2:runtime' is invalid. It will be ignored
for artifact resolution. Reason: Not a v4.0.0 POM. for project com.sun.xml.bind:jaxb-impl
at <http://hudson.zones.apache.org/hudson/job/ActiveMQ-5.3/ws/.repository/com/sun/xml/bind/jaxb-impl/2.0.2/jaxb-impl-2.0.2.pom>
Downloading: http://download.java.net/maven/2/com/sun/xml/bind/jaxb-xjc/2.0.2/jaxb-xjc-2.0.2.pom
Downloading: https://repository.apache.org/content/repositories/snapshots//com/sun/xml/bind/jaxb-xjc/2.0.2/jaxb-xjc-2.0.2.pom
Downloading: https://maven-repository.dev.java.net/nonav/repository/com.sun.xml.bind/poms/jaxb-xjc-2.0.2.pom
361b downloaded
[WARNING] *** CHECKSUM FAILED - Checksum failed on download: local = 'b59d620e249524c9168efc526bff841fd6e4a7dd';
remote = '<!DOCTYPE' - RETRYING
Downloading: https://maven-repository.dev.java.net/nonav/repository/com.sun.xml.bind/poms/jaxb-xjc-2.0.2.pom
361b downloaded
[WARNING] *** CHECKSUM FAILED - Checksum failed on download: local = 'b59d620e249524c9168efc526bff841fd6e4a7dd';
remote = '<!DOCTYPE' - IGNORING
[WARNING] POM for 'com.sun.xml.bind:jaxb-xjc:pom:2.0.2:runtime' is invalid. It will be ignored
for artifact resolution. Reason: Not a v4.0.0 POM. for project com.sun.xml.bind:jaxb-xjc at
<http://hudson.zones.apache.org/hudson/job/ActiveMQ-5.3/ws/.repository/com/sun/xml/bind/jaxb-xjc/2.0.2/jaxb-xjc-2.0.2.pom>
[WARNING] POM for 'com.sun.xml.bind:jaxb-xjc:pom:2.0.2:runtime' is invalid. It will be ignored
for artifact resolution. Reason: Not a v4.0.0 POM. for project com.sun.xml.bind:jaxb-xjc at
<http://hudson.zones.apache.org/hudson/job/ActiveMQ-5.3/ws/.repository/com/sun/xml/bind/jaxb-xjc/2.0.2/jaxb-xjc-2.0.2.pom>
Downloading: http://download.java.net/maven/2/com/sun/xml/bind/jaxb-impl/2.0.2/jaxb-impl-2.0.2.jar
Downloading: https://repository.apache.org/content/repositories/snapshots//com/sun/xml/bind/jaxb-impl/2.0.2/jaxb-impl-2.0.2.jar
Downloading: https://maven-repository.dev.java.net/nonav/repository/com.sun.xml.bind/jars/jaxb-impl-2.0.2.jar
362b downloaded
[WARNING] *** CHECKSUM FAILED - Checksum failed on download: local = '2c455eda9365334ca48dd448b2795e4526c40197';
remote = '<!DOCTYPE' - RETRYING
Downloading: https://maven-repository.dev.java.net/nonav/repository/com.sun.xml.bind/jars/jaxb-impl-2.0.2.jar
362b downloaded
[WARNING] *** CHECKSUM FAILED - Checksum failed on download: local = '2c455eda9365334ca48dd448b2795e4526c40197';
remote = '<!DOCTYPE' - IGNORING
Downloading: http://download.java.net/maven/2/com/sun/xml/bind/jaxb-xjc/2.0.2/jaxb-xjc-2.0.2.jar
Downloading: https://repository.apache.org/content/repositories/snapshots//com/sun/xml/bind/jaxb-xjc/2.0.2/jaxb-xjc-2.0.2.jar
Downloading: https://maven-repository.dev.java.net/nonav/repository/com.sun.xml.bind/jars/jaxb-xjc-2.0.2.jar
361b downloaded
[WARNING] *** CHECKSUM FAILED - Checksum failed on download: local = '8f853df57fc28590177eacae7a020c2e3c1a686a';
remote = '<!DOCTYPE' - RETRYING
Downloading: https://maven-repository.dev.java.net/nonav/repository/com.sun.xml.bind/jars/jaxb-xjc-2.0.2.jar
361b downloaded
[WARNING] *** CHECKSUM FAILED - Checksum failed on download: local = '8f853df57fc28590177eacae7a020c2e3c1a686a';
remote = '<!DOCTYPE' - IGNORING
-----------------------------------------------------
this realm = app0.child-container[org.jvnet.jaxb2.maven2:maven-jaxb2-plugin]
urls[0] = <http://hudson.zones.apache.org/hudson/job/ActiveMQ-5.3/ws/.repository/org/jvnet/jaxb2/maven2/maven-jaxb2-plugin/0.1/maven-jaxb2-plugin-0.1.jar>
urls[1] = <http://hudson.zones.apache.org/hudson/job/ActiveMQ-5.3/ws/.repository/org/codehaus/plexus/plexus-utils/1.1/plexus-utils-1.1.jar>
urls[2] = <http://hudson.zones.apache.org/hudson/job/ActiveMQ-5.3/ws/.repository/com/sun/xml/bind/jaxb-impl/2.0.2/jaxb-impl-2.0.2.jar>
urls[3] = <http://hudson.zones.apache.org/hudson/job/ActiveMQ-5.3/ws/.repository/com/sun/xml/bind/jaxb-xjc/2.0.2/jaxb-xjc-2.0.2.jar>
Number of imports: 10
import: org.codehaus.classworlds.Entry@a6c57a42
import: org.codehaus.classworlds.Entry@12f43f3b
import: org.codehaus.classworlds.Entry@20025374
import: org.codehaus.classworlds.Entry@f8e44ca4
import: org.codehaus.classworlds.Entry@92758522
import: org.codehaus.classworlds.Entry@ebf2705b
import: org.codehaus.classworlds.Entry@bb25e54
import: org.codehaus.classworlds.Entry@bece5185
import: org.codehaus.classworlds.Entry@3fee8e37
import: org.codehaus.classworlds.Entry@3fee19d8


this realm = plexus.core.maven
Number of imports: 10
import: org.codehaus.classworlds.Entry@a6c57a42
import: org.codehaus.classworlds.Entry@12f43f3b
import: org.codehaus.classworlds.Entry@20025374
import: org.codehaus.classworlds.Entry@f8e44ca4
import: org.codehaus.classworlds.Entry@92758522
import: org.codehaus.classworlds.Entry@ebf2705b
import: org.codehaus.classworlds.Entry@bb25e54
import: org.codehaus.classworlds.Entry@bece5185
import: org.codehaus.classworlds.Entry@3fee8e37
import: org.codehaus.classworlds.Entry@3fee19d8


this realm = plexus.core
urls[0] = file:/home/hudson/hudson-slave/maven-interceptor.jar
urls[1] = file:/home/hudson/tools/maven/apache-maven-2.0.10/lib/maven-2.0.10-uber.jar
Number of imports: 10
import: org.codehaus.classworlds.Entry@a6c57a42
import: org.codehaus.classworlds.Entry@12f43f3b
import: org.codehaus.classworlds.Entry@20025374
import: org.codehaus.classworlds.Entry@f8e44ca4
import: org.codehaus.classworlds.Entry@92758522
import: org.codehaus.classworlds.Entry@ebf2705b
import: org.codehaus.classworlds.Entry@bb25e54
import: org.codehaus.classworlds.Entry@bece5185
import: org.codehaus.classworlds.Entry@3fee8e37
import: org.codehaus.classworlds.Entry@3fee19d8
-----------------------------------------------------
[HUDSON] Archiving <http://hudson.zones.apache.org/hudson/job/ActiveMQ-5.3/ws/activemq-5.3/activemq-xmpp/pom.xml>
to /export/home/hudson/hudson/jobs/ActiveMQ-5.3/modules/org.apache.activemq$activemq-xmpp/builds/2010-02-02_06-57-31/archive/org.apache.activemq/activemq-xmpp/5.3.1-SNAPSHOT/pom.xml
[INFO] ------------------------------------------------------------------------
[INFO] SKIPPING ActiveMQ :: Web Console
[INFO]    task-segment: [clean, install]
[INFO] This project has been banned from further executions due to previous failures.
[INFO] ------------------------------------------------------------------------
[INFO] ------------------------------------------------------------------------
[INFO] SKIPPING ActiveMQ :: Assembly
[INFO]    task-segment: [clean, install]
[INFO] This project has been banned from further executions due to previous failures.
[INFO] ------------------------------------------------------------------------
[INFO] 
[INFO] 
[INFO] ------------------------------------------------------------------------
[INFO] Reactor Summary:
[INFO] ------------------------------------------------------------------------
[INFO] ActiveMQ .............................................. SUCCESS [5:00.594s]
[INFO] ActiveMQ :: KahaDB .................................... SUCCESS [1:36.304s]
[INFO] ActiveMQ :: JAAS ...................................... SUCCESS [1:29.618s]
[INFO] Openwire Generator .................................... SUCCESS [28.061s]
[INFO] ActiveMQ :: jmdns 1.0 ................................. SUCCESS [0.936s]
[INFO] ActiveMQ :: Core ...................................... SUCCESS [2:09:12.707s]
[INFO] ActiveMQ :: RA ........................................ SUCCESS [57.380s]
[INFO] ActiveMQ :: Pool ...................................... SUCCESS [20.145s]
[INFO] ActiveMQ :: Camel ..................................... SUCCESS [2:01.494s]
[INFO] ActiveMQ :: Console ................................... SUCCESS [5.521s]
[INFO] ActiveMQ :: Optional .................................. SUCCESS [15:05.237s]
[INFO] ActiveMQ :: Jar Bundle ................................ SUCCESS [9.959s]
[INFO] ActiveMQ :: File Server ............................... SUCCESS [16.278s]
[INFO] ActiveMQ :: Apache Karaf .............................. SUCCESS [2.481s]
[INFO] ActiveMQ :: RAR ....................................... SUCCESS [5.380s]
[INFO] ActiveMQ :: Run Jar ................................... SUCCESS [0.367s]
[INFO] ActiveMQ Tooling ...................................... SUCCESS [0.168s]
[INFO] ActiveMQ :: Memory Usage Test Plugin .................. SUCCESS [51.104s]
[INFO] ActiveMQ :: Performance Test Plugin ................... SUCCESS [2.424s]
[INFO] ActiveMQ :: StartUp Plugin ............................ SUCCESS [7.568s]
[INFO] ActiveMQ :: Web ....................................... SUCCESS [12.518s]
[INFO] ActiveMQ :: Web Demo .................................. SUCCESS [5.848s]
[INFO] ActiveMQ :: XMPP ...................................... FAILED [16.879s]
[INFO] ActiveMQ :: Web Console ............................... SKIPPED (dependency build failed
or was skipped)
[INFO] ActiveMQ :: Assembly .................................. SKIPPED (dependency build failed
or was skipped)
[INFO] ------------------------------------------------------------------------
[INFO] Error for project: ActiveMQ :: XMPP (during install)
[INFO] ------------------------------------------------------------------------
[INFO] Internal error in the plugin manager executing goal 'org.jvnet.jaxb2.maven2:maven-jaxb2-plugin:0.1:generate':
Unable to find the mojo 'org.jvnet.jaxb2.maven2:maven-jaxb2-plugin:0.1:generate' in the plugin
'org.jvnet.jaxb2.maven2:maven-jaxb2-plugin'
com/sun/tools/xjc/ErrorReceiver
[INFO] ------------------------------------------------------------------------
[INFO] Trace
org.apache.maven.lifecycle.LifecycleExecutionException: Internal error in the plugin manager
executing goal 'org.jvnet.jaxb2.maven2:maven-jaxb2-plugin:0.1:generate': Unable to find the
mojo 'org.jvnet.jaxb2.maven2:maven-jaxb2-plugin:0.1:generate' in the plugin 'org.jvnet.jaxb2.maven2:maven-jaxb2-plugin'
	at org.apache.maven.lifecycle.DefaultLifecycleExecutor.executeGoals(DefaultLifecycleExecutor.java:563)
	at org.apache.maven.lifecycle.DefaultLifecycleExecutor.executeGoalWithLifecycle(DefaultLifecycleExecutor.java:500)
	at org.apache.maven.lifecycle.DefaultLifecycleExecutor.executeGoal(DefaultLifecycleExecutor.java:479)
	at org.apache.maven.lifecycle.DefaultLifecycleExecutor.executeGoalAndHandleFailures(DefaultLifecycleExecutor.java:331)
	at org.apache.maven.lifecycle.DefaultLifecycleExecutor.executeTaskSegments(DefaultLifecycleExecutor.java:292)
	at org.apache.maven.lifecycle.DefaultLifecycleExecutor.execute(DefaultLifecycleExecutor.java:142)
	at org.apache.maven.lifecycle.LifecycleExecutorInterceptor.execute(LifecycleExecutorInterceptor.java:65)
	at org.apache.maven.DefaultMaven.doExecute(DefaultMaven.java:336)
	at org.apache.maven.DefaultMaven.execute(DefaultMaven.java:129)
	at org.apache.maven.cli.MavenCli.main(MavenCli.java:301)
	at sun.reflect.NativeMethodAccessorImpl.invoke0(Native Method)
	at sun.reflect.NativeMethodAccessorImpl.invoke(NativeMethodAccessorImpl.java:39)
	at sun.reflect.DelegatingMethodAccessorImpl.invoke(DelegatingMethodAccessorImpl.java:25)
	at java.lang.reflect.Method.invoke(Method.java:592)
	at org.codehaus.classworlds.Launcher.launchEnhanced(Launcher.java:315)
	at org.codehaus.classworlds.Launcher.launch(Launcher.java:255)
	at hudson.maven.agent.Main.launch(Main.java:165)
	at hudson.maven.MavenBuilder.call(MavenBuilder.java:159)
	at hudson.maven.MavenModuleSetBuild$Builder.call(MavenModuleSetBuild.java:688)
	at hudson.maven.MavenModuleSetBuild$Builder.call(MavenModuleSetBuild.java:632)
	at hudson.remoting.UserRequest.perform(UserRequest.java:104)
	at hudson.remoting.UserRequest.perform(UserRequest.java:48)
	at hudson.remoting.Request$2.run(Request.java:236)
	at java.util.concurrent.Executors$RunnableAdapter.call(Executors.java:417)
	at java.util.concurrent.FutureTask$Sync.innerRun(FutureTask.java:269)
	at java.util.concurrent.FutureTask.run(FutureTask.java:123)
	at java.util.concurrent.ThreadPoolExecutor$Worker.runTask(ThreadPoolExecutor.java:651)
	at java.util.concurrent.ThreadPoolExecutor$Worker.run(ThreadPoolExecutor.java:676)
	at java.lang.Thread.run(Thread.java:595)
Caused by: org.apache.maven.plugin.PluginManagerException: Unable to find the mojo 'org.jvnet.jaxb2.maven2:maven-jaxb2-plugin:0.1:generate'
in the plugin 'org.jvnet.jaxb2.maven2:maven-jaxb2-plugin'
	at org.apache.maven.plugin.DefaultPluginManager.getConfiguredMojo(DefaultPluginManager.java:620)
	at org.apache.maven.plugin.DefaultPluginManager.executeMojo(DefaultPluginManager.java:431)
	at hudson.maven.agent.PluginManagerInterceptor.executeMojo(PluginManagerInterceptor.java:182)
	at org.apache.maven.lifecycle.DefaultLifecycleExecutor.executeGoals(DefaultLifecycleExecutor.java:559)
	... 28 more
Caused by: org.codehaus.plexus.component.repository.exception.ComponentLookupException: Unable
to lookup component 'org.apache.maven.plugin.Mojoorg.jvnet.jaxb2.maven2:maven-jaxb2-plugin:0.1:generate',
it could not be created
	at org.codehaus.plexus.DefaultPlexusContainer.lookup(DefaultPlexusContainer.java:335)
	at org.codehaus.plexus.DefaultPlexusContainer.lookup(DefaultPlexusContainer.java:440)
	at hudson.maven.agent.ContainerFilter.lookup(ContainerFilter.java:89)
	at hudson.maven.agent.PluginManagerInterceptor$1$1.lookup(PluginManagerInterceptor.java:95)
	at org.apache.maven.plugin.DefaultPluginManager.getConfiguredMojo(DefaultPluginManager.java:611)
	... 31 more
Caused by: org.codehaus.plexus.component.factory.ComponentInstantiationException: Could not
instanciate component: role: 'null', implementation: 'org.jvnet.jaxb2.maven2.XJC2Mojo'
	at org.codehaus.plexus.component.factory.java.JavaComponentFactory.makeException(JavaComponentFactory.java:77)
	at org.codehaus.plexus.component.factory.java.JavaComponentFactory.newInstance(JavaComponentFactory.java:62)
	at org.codehaus.plexus.DefaultPlexusContainer.createComponentInstance(DefaultPlexusContainer.java:1464)
	at org.codehaus.plexus.component.manager.AbstractComponentManager.createComponentInstance(AbstractComponentManager.java:93)
	at org.codehaus.plexus.component.manager.PerLookupComponentManager.getComponent(PerLookupComponentManager.java:48)
	at org.codehaus.plexus.DefaultPlexusContainer.lookup(DefaultPlexusContainer.java:331)
	... 35 more
Caused by: java.lang.NoClassDefFoundError: com/sun/tools/xjc/ErrorReceiver
	at java.lang.Class.getDeclaredConstructors0(Native Method)
	at java.lang.Class.privateGetDeclaredConstructors(Class.java:2357)
	at java.lang.Class.getConstructor0(Class.java:2671)
	at java.lang.Class.newInstance0(Class.java:321)
	at java.lang.Class.newInstance(Class.java:303)
	at org.codehaus.plexus.component.factory.java.JavaComponentFactory.newInstance(JavaComponentFactory.java:44)
	... 39 more
[INFO] ------------------------------------------------------------------------
[INFO] BUILD ERRORS
[INFO] ------------------------------------------------------------------------
[INFO] Total time: 163 minutes 38 seconds
[INFO] Finished at: Tue Feb 02 09:46:01 UTC 2010
[INFO] Final Memory: 80M/1018M
[INFO] ------------------------------------------------------------------------
Waiting for Hudson to finish collecting data
Sending e-mails to: dev@activemq.apache.org
Sending e-mails to: dev@activemq.apache.org
channel stopped
[locks-and-latches] Releasing all the locks
[locks-and-latches] All the locks released


Mime
View raw message