activemq-dev mailing list archives

Site index · List index
Message view « Date » · « Thread »
Top « Date » · « Thread »
From Apache Hudson Server <hud...@hudson.zones.apache.org>
Subject Build failed in Hudson: ActiveMQ-5.3 #29
Date Mon, 25 Jan 2010 21:02:33 GMT
See <http://hudson.zones.apache.org/hudson/job/ActiveMQ-5.3/29/changes>

Changes:

[dejanb] merging 893834,899673,900850,901789,902134,902135,902728,902850 - https://issues.apache.org/activemq/browse/AMQ-2570
& https://issues.apache.org/activemq/browse/AMQ-2550 - osgi & karaf support

[dejanb] merging 902816 - making ExpiredMessagesTest pass on very slow machines

------------------------------------------
[...truncated 2454 lines...]
Reference from     <http://hudson.zones.apache.org/hudson/job/ActiveMQ-5.3/ws/.repository/org/apache/activemq/protobuf/activemq-protobuf/1.0/activemq-protobuf-1.0.jar>
Classpath          [Jar:., Jar:activemq-core, Jar:commons-logging-api, Jar:geronimo-jms_1.1_spec,
Jar:activeio-core, Jar:geronimo-j2ee-management_1.1_spec, Jar:commons-logging, Jar:kahadb,
Jar:activemq-protobuf, Jar:spring-osgi-core, Jar:spring-osgi-io, Jar:geronimo-j2ee-management_1.0_spec,
Jar:spring-context, Jar:aopalliance, Jar:spring-beans, Jar:spring-core, Jar:commons-net, Jar:activemq-camel,
Jar:camel-jms, Jar:camel-core, Jar:jaxb-api, Jar:stax-api, Jar:activation, Jar:jaxb-impl,
Jar:camel-spring, Jar:spring-tx, Jar:spring-aop, Jar:spring-jms, Jar:commons-pool, Jar:spring-context-support,
Jar:geronimo-jta_1.1_spec, Jar:camel-web, Jar:camel-groovy, Jar:groovy-all, Jar:ant, Jar:ant-launcher,
Jar:jline, Jar:camel-ruby, Jar:jruby, Jar:jersey-spring, Jar:jersey-server, Jar:jersey-core,
Jar:jsr311-api, Jar:asm, Jar:spring, Jar:spring-web, Jar:jersey-json, Jar:jettison, Jar:stax-api,
Jar:jackson-asl, Jar:jersey-atom, Jar:rome, Jar:jdom, Jar:sitemesh, Jar:jstl, Jar:standard,
Jar:slf4j-api, Jar:slf4j-log4j12, Jar:log4j, Jar:activemq-pool, Jar:geronimo-jta_1.0.1B_spec,
Jar:geronimo-servlet_2.5_spec, Jar:jetty-util, Jar:xbean-spring, Jar:spring-webmvc, Jar:xmlpull,
Jar:xstream, Jar:xpp3_min]
[WARNING] Warning building bundle org.apache.activemq:activemq-web:bundle:5.3.1-SNAPSHOT :
Split package org/apache/activemq/protobuf/compiler/parser
Use directive -split-package:=(merge-first|merge-last|error|first) on Export/Private Package
instruction to get rid of this warning
Package found in   [Jar:activemq-core, Jar:activemq-protobuf]
Reference from     <http://hudson.zones.apache.org/hudson/job/ActiveMQ-5.3/ws/.repository/org/apache/activemq/protobuf/activemq-protobuf/1.0/activemq-protobuf-1.0.jar>
Classpath          [Jar:., Jar:activemq-core, Jar:commons-logging-api, Jar:geronimo-jms_1.1_spec,
Jar:activeio-core, Jar:geronimo-j2ee-management_1.1_spec, Jar:commons-logging, Jar:kahadb,
Jar:activemq-protobuf, Jar:spring-osgi-core, Jar:spring-osgi-io, Jar:geronimo-j2ee-management_1.0_spec,
Jar:spring-context, Jar:aopalliance, Jar:spring-beans, Jar:spring-core, Jar:commons-net, Jar:activemq-camel,
Jar:camel-jms, Jar:camel-core, Jar:jaxb-api, Jar:stax-api, Jar:activation, Jar:jaxb-impl,
Jar:camel-spring, Jar:spring-tx, Jar:spring-aop, Jar:spring-jms, Jar:commons-pool, Jar:spring-context-support,
Jar:geronimo-jta_1.1_spec, Jar:camel-web, Jar:camel-groovy, Jar:groovy-all, Jar:ant, Jar:ant-launcher,
Jar:jline, Jar:camel-ruby, Jar:jruby, Jar:jersey-spring, Jar:jersey-server, Jar:jersey-core,
Jar:jsr311-api, Jar:asm, Jar:spring, Jar:spring-web, Jar:jersey-json, Jar:jettison, Jar:stax-api,
Jar:jackson-asl, Jar:jersey-atom, Jar:rome, Jar:jdom, Jar:sitemesh, Jar:jstl, Jar:standard,
Jar:slf4j-api, Jar:slf4j-log4j12, Jar:log4j, Jar:activemq-pool, Jar:geronimo-jta_1.0.1B_spec,
Jar:geronimo-servlet_2.5_spec, Jar:jetty-util, Jar:xbean-spring, Jar:spring-webmvc, Jar:xmlpull,
Jar:xstream, Jar:xpp3_min]
[INFO] [ianal:verify-legal-files {execution: default}]
[INFO] Checking legal files in: activemq-web-5.3.1-SNAPSHOT.jar
[INFO] [install:install]
[INFO] Installing <http://hudson.zones.apache.org/hudson/job/ActiveMQ-5.3/ws/activemq-5.3/activemq-web/target/activemq-web-5.3.1-SNAPSHOT.jar>
to <http://hudson.zones.apache.org/hudson/job/ActiveMQ-5.3/ws/.repository/org/apache/activemq/activemq-web/5.3.1-SNAPSHOT/activemq-web-5.3.1-SNAPSHOT.jar>
[INFO] [bundle:install]
[INFO] Parsing <http://hudson.zones.apache.org/hudson/job/ActiveMQ-5.3/ws/.repository/repository.xml>
[INFO] Installing org/apache/activemq/activemq-web/5.3.1-SNAPSHOT/activemq-web-5.3.1-SNAPSHOT.jar
[INFO] Writing OBR metadata
[HUDSON] Archiving <http://hudson.zones.apache.org/hudson/job/ActiveMQ-5.3/ws/activemq-5.3/activemq-web/pom.xml>
to /export/home/hudson/hudson/jobs/ActiveMQ-5.3/modules/org.apache.activemq$activemq-web/builds/2010-01-25_18-38-06/archive/org.apache.activemq/activemq-web/5.3.1-SNAPSHOT/pom.xml
[HUDSON] Archiving <http://hudson.zones.apache.org/hudson/job/ActiveMQ-5.3/ws/activemq-5.3/activemq-web/target/activemq-web-5.3.1-SNAPSHOT.jar>
to /export/home/hudson/hudson/jobs/ActiveMQ-5.3/modules/org.apache.activemq$activemq-web/builds/2010-01-25_18-38-06/archive/org.apache.activemq/activemq-web/5.3.1-SNAPSHOT/activemq-web-5.3.1-SNAPSHOT.jar
[INFO] ------------------------------------------------------------------------
[INFO] Building ActiveMQ :: Web Demo
[INFO]    task-segment: [clean, install]
[INFO] ------------------------------------------------------------------------
[INFO] [clean:clean]
[INFO] Deleting file set: <http://hudson.zones.apache.org/hudson/job/ActiveMQ-5.3/ws/activemq-5.3/activemq-web-demo/target>
(included: [**], excluded: [])
[INFO] snapshot org.apache.activemq:activemq-web:5.3.1-SNAPSHOT: checking for updates from
com.springsource.repository.bundles.external
[INFO] snapshot org.apache.activemq:activemq-web:5.3.1-SNAPSHOT: checking for updates from
apache.snapshots
[INFO] [enforcer:enforce {execution: default}]
[INFO] [remote-resources:process {execution: default}]
[INFO] [resources:resources]
[INFO] Using 'UTF-8' encoding to copy filtered resources.
[INFO] skip non existing resourceDirectory <http://hudson.zones.apache.org/hudson/job/ActiveMQ-5.3/ws/activemq-5.3/activemq-web-demo/src/main/resources>
[INFO] Copying 3 resources
[INFO] [compiler:compile]
[INFO] No sources to compile
[INFO] [resources:testResources]
[INFO] Using 'UTF-8' encoding to copy filtered resources.
[INFO] skip non existing resourceDirectory <http://hudson.zones.apache.org/hudson/job/ActiveMQ-5.3/ws/activemq-5.3/activemq-web-demo/src/test/resources>
[INFO] Copying 3 resources
[INFO] [compiler:testCompile]
[INFO] No sources to compile
[INFO] [surefire:test]
[INFO] Surefire report directory: <http://hudson.zones.apache.org/hudson/job/ActiveMQ-5.3/ws/activemq-5.3/activemq-web-demo/target/surefire-reports>

-------------------------------------------------------
 T E S T S
-------------------------------------------------------
There are no tests to run.

Results :

Tests run: 0, Failures: 0, Errors: 0, Skipped: 0

[HUDSON] Recording test results
[INFO] [war:war]
[INFO] Packaging webapp
[INFO] Assembling webapp[activemq-web-demo] in [<http://hudson.zones.apache.org/hudson/job/ActiveMQ-5.3/ws/activemq-5.3/activemq-web-demo/target/activemq-web-demo-5.3.1-SNAPSHOT]>
[INFO] Processing war project
[INFO] Copying webapp resources[<http://hudson.zones.apache.org/hudson/job/ActiveMQ-5.3/ws/activemq-5.3/activemq-web-demo/src/main/webapp]>
[INFO] Webapp assembled in[326 msecs]
[INFO] Building war: <http://hudson.zones.apache.org/hudson/job/ActiveMQ-5.3/ws/activemq-5.3/activemq-web-demo/target/activemq-web-demo-5.3.1-SNAPSHOT.war>
[INFO] [ianal:verify-legal-files {execution: default}]
[INFO] Checking legal files in: activemq-web-demo-5.3.1-SNAPSHOT.war
[INFO] [install:install]
[INFO] Installing <http://hudson.zones.apache.org/hudson/job/ActiveMQ-5.3/ws/activemq-5.3/activemq-web-demo/target/activemq-web-demo-5.3.1-SNAPSHOT.war>
to <http://hudson.zones.apache.org/hudson/job/ActiveMQ-5.3/ws/.repository/org/apache/activemq/activemq-web-demo/5.3.1-SNAPSHOT/activemq-web-demo-5.3.1-SNAPSHOT.war>
[HUDSON] Archiving <http://hudson.zones.apache.org/hudson/job/ActiveMQ-5.3/ws/activemq-5.3/activemq-web-demo/pom.xml>
to /export/home/hudson/hudson/jobs/ActiveMQ-5.3/modules/org.apache.activemq$activemq-web-demo/builds/2010-01-25_18-38-06/archive/org.apache.activemq/activemq-web-demo/5.3.1-SNAPSHOT/pom.xml
[HUDSON] Archiving <http://hudson.zones.apache.org/hudson/job/ActiveMQ-5.3/ws/activemq-5.3/activemq-web-demo/target/activemq-web-demo-5.3.1-SNAPSHOT.war>
to /export/home/hudson/hudson/jobs/ActiveMQ-5.3/modules/org.apache.activemq$activemq-web-demo/builds/2010-01-25_18-38-06/archive/org.apache.activemq/activemq-web-demo/5.3.1-SNAPSHOT/activemq-web-demo-5.3.1-SNAPSHOT.war
[INFO] ------------------------------------------------------------------------
[INFO] Building ActiveMQ :: XMPP
[INFO]    task-segment: [clean, install]
[INFO] ------------------------------------------------------------------------
[INFO] [clean:clean]
[INFO] [enforcer:enforce {execution: default}]
[WARNING] POM for 'org.apache.maven:maven-settings:pom:2.0.4:runtime' is invalid. It will
be ignored for artifact resolution. Reason: Not a v4.0.0 POM. for project org.apache.maven:maven-settings
at <http://hudson.zones.apache.org/hudson/job/ActiveMQ-5.3/ws/.repository/org/apache/maven/maven-settings/2.0.4/maven-settings-2.0.4.pom>
[WARNING] POM for 'org.apache.maven:maven-settings:pom:2.0.4:runtime' is invalid. It will
be ignored for artifact resolution. Reason: Not a v4.0.0 POM. for project org.apache.maven:maven-settings
at <http://hudson.zones.apache.org/hudson/job/ActiveMQ-5.3/ws/.repository/org/apache/maven/maven-settings/2.0.4/maven-settings-2.0.4.pom>
[WARNING] POM for 'org.apache.maven:maven-profile:pom:2.0.4:runtime' is invalid. It will be
ignored for artifact resolution. Reason: Not a v4.0.0 POM. for project org.apache.maven:maven-profile
at <http://hudson.zones.apache.org/hudson/job/ActiveMQ-5.3/ws/.repository/org/apache/maven/maven-profile/2.0.4/maven-profile-2.0.4.pom>
[WARNING] POM for 'org.apache.maven:maven-profile:pom:2.0.4:runtime' is invalid. It will be
ignored for artifact resolution. Reason: Not a v4.0.0 POM. for project org.apache.maven:maven-profile
at <http://hudson.zones.apache.org/hudson/job/ActiveMQ-5.3/ws/.repository/org/apache/maven/maven-profile/2.0.4/maven-profile-2.0.4.pom>
[WARNING] POM for 'org.apache.maven:maven-model:pom:2.0.4:runtime' is invalid. It will be
ignored for artifact resolution. Reason: Not a v4.0.0 POM. for project org.apache.maven:maven-model
at <http://hudson.zones.apache.org/hudson/job/ActiveMQ-5.3/ws/.repository/org/apache/maven/maven-model/2.0.4/maven-model-2.0.4.pom>
[WARNING] POM for 'org.apache.maven:maven-model:pom:2.0.4:runtime' is invalid. It will be
ignored for artifact resolution. Reason: Not a v4.0.0 POM. for project org.apache.maven:maven-model
at <http://hudson.zones.apache.org/hudson/job/ActiveMQ-5.3/ws/.repository/org/apache/maven/maven-model/2.0.4/maven-model-2.0.4.pom>
[WARNING] POM for 'org.apache.maven:maven-artifact-manager:pom:2.0.4:runtime' is invalid.
It will be ignored for artifact resolution. Reason: Not a v4.0.0 POM. for project org.apache.maven:maven-artifact-manager
at <http://hudson.zones.apache.org/hudson/job/ActiveMQ-5.3/ws/.repository/org/apache/maven/maven-artifact-manager/2.0.4/maven-artifact-manager-2.0.4.pom>
[WARNING] POM for 'org.apache.maven:maven-artifact-manager:pom:2.0.4:runtime' is invalid.
It will be ignored for artifact resolution. Reason: Not a v4.0.0 POM. for project org.apache.maven:maven-artifact-manager
at <http://hudson.zones.apache.org/hudson/job/ActiveMQ-5.3/ws/.repository/org/apache/maven/maven-artifact-manager/2.0.4/maven-artifact-manager-2.0.4.pom>
[WARNING] POM for 'com.sun.xml.bind:jaxb-impl:pom:2.0.2:runtime' is invalid. It will be ignored
for artifact resolution. Reason: Not a v4.0.0 POM. for project com.sun.xml.bind:jaxb-impl
at <http://hudson.zones.apache.org/hudson/job/ActiveMQ-5.3/ws/.repository/com/sun/xml/bind/jaxb-impl/2.0.2/jaxb-impl-2.0.2.pom>
[WARNING] POM for 'com.sun.xml.bind:jaxb-impl:pom:2.0.2:runtime' is invalid. It will be ignored
for artifact resolution. Reason: Not a v4.0.0 POM. for project com.sun.xml.bind:jaxb-impl
at <http://hudson.zones.apache.org/hudson/job/ActiveMQ-5.3/ws/.repository/com/sun/xml/bind/jaxb-impl/2.0.2/jaxb-impl-2.0.2.pom>
[WARNING] POM for 'com.sun.xml.bind:jaxb-xjc:pom:2.0.2:runtime' is invalid. It will be ignored
for artifact resolution. Reason: Not a v4.0.0 POM. for project com.sun.xml.bind:jaxb-xjc at
<http://hudson.zones.apache.org/hudson/job/ActiveMQ-5.3/ws/.repository/com/sun/xml/bind/jaxb-xjc/2.0.2/jaxb-xjc-2.0.2.pom>
[WARNING] POM for 'com.sun.xml.bind:jaxb-xjc:pom:2.0.2:runtime' is invalid. It will be ignored
for artifact resolution. Reason: Not a v4.0.0 POM. for project com.sun.xml.bind:jaxb-xjc at
<http://hudson.zones.apache.org/hudson/job/ActiveMQ-5.3/ws/.repository/com/sun/xml/bind/jaxb-xjc/2.0.2/jaxb-xjc-2.0.2.pom>
-----------------------------------------------------
this realm = app0.child-container[org.jvnet.jaxb2.maven2:maven-jaxb2-plugin]
urls[0] = <http://hudson.zones.apache.org/hudson/job/ActiveMQ-5.3/ws/.repository/org/jvnet/jaxb2/maven2/maven-jaxb2-plugin/0.1/maven-jaxb2-plugin-0.1.jar>
urls[1] = <http://hudson.zones.apache.org/hudson/job/ActiveMQ-5.3/ws/.repository/org/codehaus/plexus/plexus-utils/1.1/plexus-utils-1.1.jar>
urls[2] = <http://hudson.zones.apache.org/hudson/job/ActiveMQ-5.3/ws/.repository/com/sun/xml/bind/jaxb-impl/2.0.2/jaxb-impl-2.0.2.jar>
urls[3] = <http://hudson.zones.apache.org/hudson/job/ActiveMQ-5.3/ws/.repository/com/sun/xml/bind/jaxb-xjc/2.0.2/jaxb-xjc-2.0.2.jar>
Number of imports: 10
import: org.codehaus.classworlds.Entry@a6c57a42
import: org.codehaus.classworlds.Entry@12f43f3b
import: org.codehaus.classworlds.Entry@20025374
import: org.codehaus.classworlds.Entry@f8e44ca4
import: org.codehaus.classworlds.Entry@92758522
import: org.codehaus.classworlds.Entry@ebf2705b
import: org.codehaus.classworlds.Entry@bb25e54
import: org.codehaus.classworlds.Entry@bece5185
import: org.codehaus.classworlds.Entry@3fee8e37
import: org.codehaus.classworlds.Entry@3fee19d8


this realm = plexus.core.maven
Number of imports: 10
import: org.codehaus.classworlds.Entry@a6c57a42
import: org.codehaus.classworlds.Entry@12f43f3b
import: org.codehaus.classworlds.Entry@20025374
import: org.codehaus.classworlds.Entry@f8e44ca4
import: org.codehaus.classworlds.Entry@92758522
import: org.codehaus.classworlds.Entry@ebf2705b
import: org.codehaus.classworlds.Entry@bb25e54
import: org.codehaus.classworlds.Entry@bece5185
import: org.codehaus.classworlds.Entry@3fee8e37
import: org.codehaus.classworlds.Entry@3fee19d8


this realm = plexus.core
urls[0] = file:/home/hudson/hudson-slave/maven-interceptor.jar
urls[1] = file:/home/hudson/tools/maven/apache-maven-2.0.10/lib/maven-2.0.10-uber.jar
Number of imports: 10
import: org.codehaus.classworlds.Entry@a6c57a42
import: org.codehaus.classworlds.Entry@12f43f3b
import: org.codehaus.classworlds.Entry@20025374
import: org.codehaus.classworlds.Entry@f8e44ca4
import: org.codehaus.classworlds.Entry@92758522
import: org.codehaus.classworlds.Entry@ebf2705b
import: org.codehaus.classworlds.Entry@bb25e54
import: org.codehaus.classworlds.Entry@bece5185
import: org.codehaus.classworlds.Entry@3fee8e37
import: org.codehaus.classworlds.Entry@3fee19d8
-----------------------------------------------------
[HUDSON] Archiving <http://hudson.zones.apache.org/hudson/job/ActiveMQ-5.3/ws/activemq-5.3/activemq-xmpp/pom.xml>
to /export/home/hudson/hudson/jobs/ActiveMQ-5.3/modules/org.apache.activemq$activemq-xmpp/builds/2010-01-25_18-38-06/archive/org.apache.activemq/activemq-xmpp/5.3.1-SNAPSHOT/pom.xml
[INFO] ------------------------------------------------------------------------
[INFO] SKIPPING ActiveMQ :: Web Console
[INFO]    task-segment: [clean, install]
[INFO] This project has been banned from further executions due to previous failures.
[INFO] ------------------------------------------------------------------------
[INFO] ------------------------------------------------------------------------
[INFO] SKIPPING ActiveMQ :: Assembly
[INFO]    task-segment: [clean, install]
[INFO] This project has been banned from further executions due to previous failures.
[INFO] ------------------------------------------------------------------------
[INFO] 
[INFO] 
[INFO] ------------------------------------------------------------------------
[INFO] Reactor Summary:
[INFO] ------------------------------------------------------------------------
[INFO] ActiveMQ .............................................. SUCCESS [12.885s]
[INFO] ActiveMQ :: KahaDB .................................... SUCCESS [21.496s]
[INFO] ActiveMQ :: JAAS ...................................... SUCCESS [9.165s]
[INFO] Openwire Generator .................................... SUCCESS [2.068s]
[INFO] ActiveMQ :: jmdns 1.0 ................................. SUCCESS [1.420s]
[INFO] ActiveMQ :: Core ...................................... SUCCESS [2:00:33.465s]
[INFO] ActiveMQ :: RA ........................................ SUCCESS [50.335s]
[INFO] ActiveMQ :: Pool ...................................... SUCCESS [6.709s]
[INFO] ActiveMQ :: Camel ..................................... SUCCESS [1:05.458s]
[INFO] ActiveMQ :: Console ................................... SUCCESS [5.243s]
[INFO] ActiveMQ :: Optional .................................. SUCCESS [14:40.073s]
[INFO] ActiveMQ :: Jar Bundle ................................ SUCCESS [3.164s]
[INFO] ActiveMQ :: File Server ............................... SUCCESS [3.203s]
[INFO] ActiveMQ :: Apache Karaf .............................. SUCCESS [2.046s]
[INFO] ActiveMQ :: RAR ....................................... SUCCESS [1.623s]
[INFO] ActiveMQ :: Run Jar ................................... SUCCESS [0.468s]
[INFO] ActiveMQ Tooling ...................................... SUCCESS [0.144s]
[INFO] ActiveMQ :: Memory Usage Test Plugin .................. SUCCESS [2.341s]
[INFO] ActiveMQ :: Performance Test Plugin ................... SUCCESS [2.762s]
[INFO] ActiveMQ :: StartUp Plugin ............................ SUCCESS [4.522s]
[INFO] ActiveMQ :: Web ....................................... SUCCESS [5.505s]
[INFO] ActiveMQ :: Web Demo .................................. SUCCESS [5.331s]
[INFO] ActiveMQ :: XMPP ...................................... FAILED [0.705s]
[INFO] ActiveMQ :: Web Console ............................... SKIPPED (dependency build failed
or was skipped)
[INFO] ActiveMQ :: Assembly .................................. SKIPPED (dependency build failed
or was skipped)
[INFO] ------------------------------------------------------------------------
[INFO] Error for project: ActiveMQ :: XMPP (during install)
[INFO] ------------------------------------------------------------------------
[INFO] Internal error in the plugin manager executing goal 'org.jvnet.jaxb2.maven2:maven-jaxb2-plugin:0.1:generate':
Unable to find the mojo 'org.jvnet.jaxb2.maven2:maven-jaxb2-plugin:0.1:generate' in the plugin
'org.jvnet.jaxb2.maven2:maven-jaxb2-plugin'
com/sun/tools/xjc/ErrorReceiver
[INFO] ------------------------------------------------------------------------
[INFO] Trace
org.apache.maven.lifecycle.LifecycleExecutionException: Internal error in the plugin manager
executing goal 'org.jvnet.jaxb2.maven2:maven-jaxb2-plugin:0.1:generate': Unable to find the
mojo 'org.jvnet.jaxb2.maven2:maven-jaxb2-plugin:0.1:generate' in the plugin 'org.jvnet.jaxb2.maven2:maven-jaxb2-plugin'
	at org.apache.maven.lifecycle.DefaultLifecycleExecutor.executeGoals(DefaultLifecycleExecutor.java:563)
	at org.apache.maven.lifecycle.DefaultLifecycleExecutor.executeGoalWithLifecycle(DefaultLifecycleExecutor.java:500)
	at org.apache.maven.lifecycle.DefaultLifecycleExecutor.executeGoal(DefaultLifecycleExecutor.java:479)
	at org.apache.maven.lifecycle.DefaultLifecycleExecutor.executeGoalAndHandleFailures(DefaultLifecycleExecutor.java:331)
	at org.apache.maven.lifecycle.DefaultLifecycleExecutor.executeTaskSegments(DefaultLifecycleExecutor.java:292)
	at org.apache.maven.lifecycle.DefaultLifecycleExecutor.execute(DefaultLifecycleExecutor.java:142)
	at org.apache.maven.lifecycle.LifecycleExecutorInterceptor.execute(LifecycleExecutorInterceptor.java:65)
	at org.apache.maven.DefaultMaven.doExecute(DefaultMaven.java:336)
	at org.apache.maven.DefaultMaven.execute(DefaultMaven.java:129)
	at org.apache.maven.cli.MavenCli.main(MavenCli.java:301)
	at sun.reflect.NativeMethodAccessorImpl.invoke0(Native Method)
	at sun.reflect.NativeMethodAccessorImpl.invoke(NativeMethodAccessorImpl.java:39)
	at sun.reflect.DelegatingMethodAccessorImpl.invoke(DelegatingMethodAccessorImpl.java:25)
	at java.lang.reflect.Method.invoke(Method.java:592)
	at org.codehaus.classworlds.Launcher.launchEnhanced(Launcher.java:315)
	at org.codehaus.classworlds.Launcher.launch(Launcher.java:255)
	at hudson.maven.agent.Main.launch(Main.java:165)
	at hudson.maven.MavenBuilder.call(MavenBuilder.java:159)
	at hudson.maven.MavenModuleSetBuild$Builder.call(MavenModuleSetBuild.java:688)
	at hudson.maven.MavenModuleSetBuild$Builder.call(MavenModuleSetBuild.java:632)
	at hudson.remoting.UserRequest.perform(UserRequest.java:104)
	at hudson.remoting.UserRequest.perform(UserRequest.java:48)
	at hudson.remoting.Request$2.run(Request.java:236)
	at java.util.concurrent.Executors$RunnableAdapter.call(Executors.java:417)
	at java.util.concurrent.FutureTask$Sync.innerRun(FutureTask.java:269)
	at java.util.concurrent.FutureTask.run(FutureTask.java:123)
	at java.util.concurrent.ThreadPoolExecutor$Worker.runTask(ThreadPoolExecutor.java:651)
	at java.util.concurrent.ThreadPoolExecutor$Worker.run(ThreadPoolExecutor.java:676)
	at java.lang.Thread.run(Thread.java:595)
Caused by: org.apache.maven.plugin.PluginManagerException: Unable to find the mojo 'org.jvnet.jaxb2.maven2:maven-jaxb2-plugin:0.1:generate'
in the plugin 'org.jvnet.jaxb2.maven2:maven-jaxb2-plugin'
	at org.apache.maven.plugin.DefaultPluginManager.getConfiguredMojo(DefaultPluginManager.java:620)
	at org.apache.maven.plugin.DefaultPluginManager.executeMojo(DefaultPluginManager.java:431)
	at hudson.maven.agent.PluginManagerInterceptor.executeMojo(PluginManagerInterceptor.java:182)
	at org.apache.maven.lifecycle.DefaultLifecycleExecutor.executeGoals(DefaultLifecycleExecutor.java:559)
	... 28 more
Caused by: org.codehaus.plexus.component.repository.exception.ComponentLookupException: Unable
to lookup component 'org.apache.maven.plugin.Mojoorg.jvnet.jaxb2.maven2:maven-jaxb2-plugin:0.1:generate',
it could not be created
	at org.codehaus.plexus.DefaultPlexusContainer.lookup(DefaultPlexusContainer.java:335)
	at org.codehaus.plexus.DefaultPlexusContainer.lookup(DefaultPlexusContainer.java:440)
	at hudson.maven.agent.ContainerFilter.lookup(ContainerFilter.java:89)
	at hudson.maven.agent.PluginManagerInterceptor$1$1.lookup(PluginManagerInterceptor.java:95)
	at org.apache.maven.plugin.DefaultPluginManager.getConfiguredMojo(DefaultPluginManager.java:611)
	... 31 more
Caused by: org.codehaus.plexus.component.factory.ComponentInstantiationException: Could not
instanciate component: role: 'null', implementation: 'org.jvnet.jaxb2.maven2.XJC2Mojo'
	at org.codehaus.plexus.component.factory.java.JavaComponentFactory.makeException(JavaComponentFactory.java:77)
	at org.codehaus.plexus.component.factory.java.JavaComponentFactory.newInstance(JavaComponentFactory.java:62)
	at org.codehaus.plexus.DefaultPlexusContainer.createComponentInstance(DefaultPlexusContainer.java:1464)
	at org.codehaus.plexus.component.manager.AbstractComponentManager.createComponentInstance(AbstractComponentManager.java:93)
	at org.codehaus.plexus.component.manager.PerLookupComponentManager.getComponent(PerLookupComponentManager.java:48)
	at org.codehaus.plexus.DefaultPlexusContainer.lookup(DefaultPlexusContainer.java:331)
	... 35 more
Caused by: java.lang.NoClassDefFoundError: com/sun/tools/xjc/ErrorReceiver
	at java.lang.Class.getDeclaredConstructors0(Native Method)
	at java.lang.Class.privateGetDeclaredConstructors(Class.java:2357)
	at java.lang.Class.getConstructor0(Class.java:2671)
	at java.lang.Class.newInstance0(Class.java:321)
	at java.lang.Class.newInstance(Class.java:303)
	at org.codehaus.plexus.component.factory.java.JavaComponentFactory.newInstance(JavaComponentFactory.java:44)
	... 39 more
[INFO] ------------------------------------------------------------------------
[INFO] BUILD ERRORS
[INFO] ------------------------------------------------------------------------
[INFO] Total time: 144 minutes 2 seconds
[INFO] Finished at: Mon Jan 25 21:06:00 UTC 2010
[INFO] Final Memory: 78M/1063M
[INFO] ------------------------------------------------------------------------
Waiting for Hudson to finish collecting data
channel stopped
[locks-and-latches] Releasing all the locks
[locks-and-latches] All the locks released


Mime
View raw message