activemq-dev mailing list archives

Site index · List index
Message view « Date » · « Thread »
Top « Date » · « Thread »
From Apache Hudson Server <hud...@hudson.zones.apache.org>
Subject Build failed in Hudson: ActiveMQ #238
Date Thu, 21 Jan 2010 01:37:58 GMT
See <http://hudson.zones.apache.org/hudson/job/ActiveMQ/238/changes>

Changes:

[rajdavies] Improvement for https://issues.apache.org/activemq/browse/AMQ-2512

[gtully] resolve https://issues.apache.org/activemq/browse/AMQ-2573 - rollback of audit check
needs to be synced with redispatch after failover transport resumption, otherwise some redispatched
unconsumed messages can get auto-acked as duplicates in error

[gtully] resolve https://issues.apache.org/activemq/browse/AMQ-2567

[rajdavies] Fix for https://issues.apache.org/activemq/browse/AMQ-2575

[dejanb] https://issues.apache.org/activemq/browse/AMQ-2574 - stop osgi bundle on application
context close

------------------------------------------
[...truncated 435 lines...]
[INFO] Preparing source:jar
[HUDSON] Archiving <http://hudson.zones.apache.org/hudson/job/ActiveMQ/ws/trunk/activemq-karaf/pom.xml>
to /export/home/hudson/hudson/jobs/ActiveMQ/modules/org.apache.activemq$activemq-karaf/builds/2010-01-21_01-35-14/archive/org.apache.activemq/activemq-karaf/5.4-SNAPSHOT/pom.xml
[HUDSON] Archiving <http://hudson.zones.apache.org/hudson/job/ActiveMQ/ws/trunk/activemq-karaf/target/activemq-karaf-5.4-SNAPSHOT.jar>
to /export/home/hudson/hudson/jobs/ActiveMQ/modules/org.apache.activemq$activemq-karaf/builds/2010-01-21_01-35-14/archive/org.apache.activemq/activemq-karaf/5.4-SNAPSHOT/activemq-karaf-5.4-SNAPSHOT.jar
[HUDSON] Archiving <http://hudson.zones.apache.org/hudson/job/ActiveMQ/ws/trunk/activemq-karaf/target/classes/features.xml>
to /export/home/hudson/hudson/jobs/ActiveMQ/modules/org.apache.activemq$activemq-karaf/builds/2010-01-21_01-35-14/archive/org.apache.activemq/activemq-karaf/5.4-SNAPSHOT/features.xml
[INFO] [enforcer:enforce {execution: default}]
[INFO] [source:jar]
[INFO] Building jar: <http://hudson.zones.apache.org/hudson/job/ActiveMQ/ws/trunk/activemq-karaf/target/activemq-karaf-5.4-SNAPSHOT-sources.jar>
[HUDSON] Archiving <http://hudson.zones.apache.org/hudson/job/ActiveMQ/ws/trunk/activemq-karaf/target/activemq-karaf-5.4-SNAPSHOT-sources.jar>
to /export/home/hudson/hudson/jobs/ActiveMQ/modules/org.apache.activemq$activemq-karaf/builds/2010-01-21_01-35-14/archive/org.apache.activemq/activemq-karaf/5.4-SNAPSHOT/activemq-karaf-5.4-SNAPSHOT-sources.jar
[INFO] ------------------------------------------------------------------------
[INFO] SKIPPING ActiveMQ :: RAR
[INFO]    task-segment: [clean, install, source:jar]
[INFO] This project has been banned from further executions due to previous failures.
[INFO] ------------------------------------------------------------------------
[INFO] ------------------------------------------------------------------------
[INFO] SKIPPING ActiveMQ :: Run Jar
[INFO]    task-segment: [clean, install, source:jar]
[INFO] This project has been banned from further executions due to previous failures.
[INFO] ------------------------------------------------------------------------
[INFO] ------------------------------------------------------------------------
[INFO] Building ActiveMQ Tooling
[INFO]    task-segment: [clean, install, source:jar]
[INFO] ------------------------------------------------------------------------
[INFO] [clean:clean]
[INFO] Deleting file set: <http://hudson.zones.apache.org/hudson/job/ActiveMQ/ws/trunk/activemq-tooling/target>
(included: [**], excluded: [])
[INFO] [enforcer:enforce {execution: default}]
[INFO] [remote-resources:process {execution: default}]
[INFO] [site:attach-descriptor]
[INFO] [ianal:verify-legal-files {execution: default}]
[INFO] [install:install]
[INFO] Installing <http://hudson.zones.apache.org/hudson/job/ActiveMQ/ws/trunk/activemq-tooling/pom.xml>
to <http://hudson.zones.apache.org/hudson/job/ActiveMQ/ws/.repository/org/apache/activemq/tooling/activemq-tooling/5.4-SNAPSHOT/activemq-tooling-5.4-SNAPSHOT.pom>
[INFO] Preparing source:jar
[HUDSON] Archiving <http://hudson.zones.apache.org/hudson/job/ActiveMQ/ws/trunk/activemq-tooling/pom.xml>
to /export/home/hudson/hudson/jobs/ActiveMQ/modules/org.apache.activemq.tooling$activemq-tooling/builds/2010-01-21_01-35-14/archive/org.apache.activemq.tooling/activemq-tooling/5.4-SNAPSHOT/pom.xml
[INFO] [enforcer:enforce {execution: default}]
[INFO] [source:jar]
[INFO] ------------------------------------------------------------------------
[INFO] SKIPPING ActiveMQ :: Memory Usage Test Plugin
[INFO]    task-segment: [clean, install, source:jar]
[INFO] This project has been banned from further executions due to previous failures.
[INFO] ------------------------------------------------------------------------
[INFO] ------------------------------------------------------------------------
[INFO] SKIPPING ActiveMQ :: Performance Test Plugin
[INFO]    task-segment: [clean, install, source:jar]
[INFO] This project has been banned from further executions due to previous failures.
[INFO] ------------------------------------------------------------------------
[INFO] ------------------------------------------------------------------------
[INFO] SKIPPING ActiveMQ :: StartUp Plugin
[INFO]    task-segment: [clean, install, source:jar]
[INFO] This project has been banned from further executions due to previous failures.
[INFO] ------------------------------------------------------------------------
[INFO] ------------------------------------------------------------------------
[INFO] SKIPPING ActiveMQ :: Web
[INFO]    task-segment: [clean, install, source:jar]
[INFO] This project has been banned from further executions due to previous failures.
[INFO] ------------------------------------------------------------------------
[INFO] ------------------------------------------------------------------------
[INFO] SKIPPING ActiveMQ :: Web Demo
[INFO]    task-segment: [clean, install, source:jar]
[INFO] This project has been banned from further executions due to previous failures.
[INFO] ------------------------------------------------------------------------
[INFO] ------------------------------------------------------------------------
[INFO] SKIPPING ActiveMQ :: XMPP
[INFO]    task-segment: [clean, install, source:jar]
[INFO] This project has been banned from further executions due to previous failures.
[INFO] ------------------------------------------------------------------------
[INFO] ------------------------------------------------------------------------
[INFO] SKIPPING ActiveMQ :: Web Console
[INFO]    task-segment: [clean, install, source:jar]
[INFO] This project has been banned from further executions due to previous failures.
[INFO] ------------------------------------------------------------------------
[INFO] ------------------------------------------------------------------------
[INFO] SKIPPING ActiveMQ :: Assembly
[INFO]    task-segment: [clean, install, source:jar]
[INFO] This project has been banned from further executions due to previous failures.
[INFO] ------------------------------------------------------------------------
[INFO] 
[INFO] 
[INFO] ------------------------------------------------------------------------
[INFO] Reactor Summary:
[INFO] ------------------------------------------------------------------------
[INFO] ActiveMQ .............................................. SUCCESS [26.829s]
[INFO] ActiveMQ :: KahaDB .................................... SUCCESS [28.202s]
[INFO] ActiveMQ :: JAAS ...................................... SUCCESS [12.329s]
[INFO] Openwire Generator .................................... SUCCESS [4.982s]
[INFO] ActiveMQ :: jmdns 1.0 ................................. SUCCESS [3.179s]
[INFO] ActiveMQ :: Core ...................................... FAILED [28.656s]
[INFO] ActiveMQ :: RA ........................................ SKIPPED (dependency build failed
or was skipped)
[INFO] ActiveMQ :: Pool ...................................... SKIPPED (dependency build failed
or was skipped)
[INFO] ActiveMQ :: Camel ..................................... SKIPPED (dependency build failed
or was skipped)
[INFO] ActiveMQ :: Console ................................... SKIPPED (dependency build failed
or was skipped)
[INFO] ActiveMQ :: Optional .................................. SKIPPED (dependency build failed
or was skipped)
[INFO] ActiveMQ :: Jar Bundle ................................ SKIPPED (dependency build failed
or was skipped)
[INFO] ActiveMQ :: File Server ............................... SKIPPED (dependency build failed
or was skipped)
[INFO] ActiveMQ :: Apache Karaf .............................. SUCCESS [2.891s]
[INFO] ActiveMQ :: RAR ....................................... SKIPPED (dependency build failed
or was skipped)
[INFO] ActiveMQ :: Run Jar ................................... SKIPPED (dependency build failed
or was skipped)
[INFO] ActiveMQ Tooling ...................................... SUCCESS [1.107s]
[INFO] ActiveMQ :: Memory Usage Test Plugin .................. SKIPPED (dependency build failed
or was skipped)
[INFO] ActiveMQ :: Performance Test Plugin ................... SKIPPED (dependency build failed
or was skipped)
[INFO] ActiveMQ :: StartUp Plugin ............................ SKIPPED (dependency build failed
or was skipped)
[INFO] ActiveMQ :: Web ....................................... SKIPPED (dependency build failed
or was skipped)
[INFO] ActiveMQ :: Web Demo .................................. SKIPPED (dependency build failed
or was skipped)
[INFO] ActiveMQ :: XMPP ...................................... SKIPPED (dependency build failed
or was skipped)
[INFO] ActiveMQ :: Web Console ............................... SKIPPED (dependency build failed
or was skipped)
[INFO] ActiveMQ :: Assembly .................................. SKIPPED (dependency build failed
or was skipped)
[INFO] ------------------------------------------------------------------------
[INFO] Error for project: ActiveMQ :: Core (during source:jar)
[INFO] ------------------------------------------------------------------------
[INFO] Failed to resolve artifact.

Missing:
----------
1) org.aopalliance:com.springsource.org.aopalliance:jar:1.0.0

  Try downloading the file manually from the project website.

  Then, install it using the command: 
      mvn install:install-file -DgroupId=org.aopalliance -DartifactId=com.springsource.org.aopalliance
-Dversion=1.0.0 -Dpackaging=jar -Dfile=/path/to/file

  Alternatively, if you host your own repository you can deploy the file there: 
      mvn deploy:deploy-file -DgroupId=org.aopalliance -DartifactId=com.springsource.org.aopalliance
-Dversion=1.0.0 -Dpackaging=jar -Dfile=/path/to/file -Durl=[url] -DrepositoryId=[id]

  Path to dependency: 
  	1) org.apache.activemq:activemq-core:bundle:5.4-SNAPSHOT
  	2) org.springframework.osgi:spring-osgi-core:jar:1.2.1
  	3) org.springframework:org.springframework.aop:jar:2.5.6.SEC01
  	4) org.aopalliance:com.springsource.org.aopalliance:jar:1.0.0

----------
1 required artifact is missing.

for artifact: 
  org.apache.activemq:activemq-core:bundle:5.4-SNAPSHOT

from the specified remote repositories:
  central (http://repo1.maven.org/maven2),
  apache.snapshots (http://repository.apache.org/snapshots)



[INFO] ------------------------------------------------------------------------
[INFO] Trace
org.apache.maven.lifecycle.LifecycleExecutionException: Missing:
----------
1) org.aopalliance:com.springsource.org.aopalliance:jar:1.0.0

  Try downloading the file manually from the project website.

  Then, install it using the command: 
      mvn install:install-file -DgroupId=org.aopalliance -DartifactId=com.springsource.org.aopalliance
-Dversion=1.0.0 -Dpackaging=jar -Dfile=/path/to/file

  Alternatively, if you host your own repository you can deploy the file there: 
      mvn deploy:deploy-file -DgroupId=org.aopalliance -DartifactId=com.springsource.org.aopalliance
-Dversion=1.0.0 -Dpackaging=jar -Dfile=/path/to/file -Durl=[url] -DrepositoryId=[id]

  Path to dependency: 
  	1) org.apache.activemq:activemq-core:bundle:5.4-SNAPSHOT
  	2) org.springframework.osgi:spring-osgi-core:jar:1.2.1
  	3) org.springframework:org.springframework.aop:jar:2.5.6.SEC01
  	4) org.aopalliance:com.springsource.org.aopalliance:jar:1.0.0

----------
1 required artifact is missing.

for artifact: 
  org.apache.activemq:activemq-core:bundle:5.4-SNAPSHOT

from the specified remote repositories:
  central (http://repo1.maven.org/maven2),
  apache.snapshots (http://repository.apache.org/snapshots)


	at org.apache.maven.lifecycle.DefaultLifecycleExecutor.executeGoals(DefaultLifecycleExecutor.java:576)
	at org.apache.maven.lifecycle.DefaultLifecycleExecutor.executeGoalWithLifecycle(DefaultLifecycleExecutor.java:500)
	at org.apache.maven.lifecycle.DefaultLifecycleExecutor.forkProjectLifecycle(DefaultLifecycleExecutor.java:925)
	at org.apache.maven.lifecycle.DefaultLifecycleExecutor.forkLifecycle(DefaultLifecycleExecutor.java:768)
	at org.apache.maven.lifecycle.DefaultLifecycleExecutor.executeGoals(DefaultLifecycleExecutor.java:530)
	at org.apache.maven.lifecycle.DefaultLifecycleExecutor.executeStandaloneGoal(DefaultLifecycleExecutor.java:513)
	at org.apache.maven.lifecycle.DefaultLifecycleExecutor.executeGoal(DefaultLifecycleExecutor.java:483)
	at org.apache.maven.lifecycle.DefaultLifecycleExecutor.executeGoalAndHandleFailures(DefaultLifecycleExecutor.java:331)
	at org.apache.maven.lifecycle.DefaultLifecycleExecutor.executeTaskSegments(DefaultLifecycleExecutor.java:292)
	at org.apache.maven.lifecycle.DefaultLifecycleExecutor.execute(DefaultLifecycleExecutor.java:142)
	at org.apache.maven.lifecycle.LifecycleExecutorInterceptor.execute(LifecycleExecutorInterceptor.java:65)
	at org.apache.maven.DefaultMaven.doExecute(DefaultMaven.java:336)
	at org.apache.maven.DefaultMaven.execute(DefaultMaven.java:129)
	at org.apache.maven.cli.MavenCli.main(MavenCli.java:301)
	at sun.reflect.NativeMethodAccessorImpl.invoke0(Native Method)
	at sun.reflect.NativeMethodAccessorImpl.invoke(NativeMethodAccessorImpl.java:39)
	at sun.reflect.DelegatingMethodAccessorImpl.invoke(DelegatingMethodAccessorImpl.java:25)
	at java.lang.reflect.Method.invoke(Method.java:592)
	at org.codehaus.classworlds.Launcher.launchEnhanced(Launcher.java:315)
	at org.codehaus.classworlds.Launcher.launch(Launcher.java:255)
	at hudson.maven.agent.Main.launch(Main.java:165)
	at hudson.maven.MavenBuilder.call(MavenBuilder.java:159)
	at hudson.maven.MavenModuleSetBuild$Builder.call(MavenModuleSetBuild.java:688)
	at hudson.maven.MavenModuleSetBuild$Builder.call(MavenModuleSetBuild.java:632)
	at hudson.remoting.UserRequest.perform(UserRequest.java:104)
	at hudson.remoting.UserRequest.perform(UserRequest.java:48)
	at hudson.remoting.Request$2.run(Request.java:236)
	at java.util.concurrent.Executors$RunnableAdapter.call(Executors.java:417)
	at java.util.concurrent.FutureTask$Sync.innerRun(FutureTask.java:269)
	at java.util.concurrent.FutureTask.run(FutureTask.java:123)
	at java.util.concurrent.ThreadPoolExecutor$Worker.runTask(ThreadPoolExecutor.java:651)
	at java.util.concurrent.ThreadPoolExecutor$Worker.run(ThreadPoolExecutor.java:676)
	at java.lang.Thread.run(Thread.java:595)
Caused by: org.apache.maven.artifact.resolver.MultipleArtifactsNotFoundException: Missing:
----------
1) org.aopalliance:com.springsource.org.aopalliance:jar:1.0.0

  Try downloading the file manually from the project website.

  Then, install it using the command: 
      mvn install:install-file -DgroupId=org.aopalliance -DartifactId=com.springsource.org.aopalliance
-Dversion=1.0.0 -Dpackaging=jar -Dfile=/path/to/file

  Alternatively, if you host your own repository you can deploy the file there: 
      mvn deploy:deploy-file -DgroupId=org.aopalliance -DartifactId=com.springsource.org.aopalliance
-Dversion=1.0.0 -Dpackaging=jar -Dfile=/path/to/file -Durl=[url] -DrepositoryId=[id]

  Path to dependency: 
  	1) org.apache.activemq:activemq-core:bundle:5.4-SNAPSHOT
  	2) org.springframework.osgi:spring-osgi-core:jar:1.2.1
  	3) org.springframework:org.springframework.aop:jar:2.5.6.SEC01
  	4) org.aopalliance:com.springsource.org.aopalliance:jar:1.0.0

----------
1 required artifact is missing.

for artifact: 
  org.apache.activemq:activemq-core:bundle:5.4-SNAPSHOT

from the specified remote repositories:
  central (http://repo1.maven.org/maven2),
  apache.snapshots (http://repository.apache.org/snapshots)


	at org.apache.maven.artifact.resolver.DefaultArtifactResolver.resolveTransitively(DefaultArtifactResolver.java:324)
	at org.apache.maven.artifact.resolver.DefaultArtifactResolver.resolveTransitively(DefaultArtifactResolver.java:288)
	at org.apache.maven.plugin.DefaultPluginManager.resolveTransitiveDependencies(DefaultPluginManager.java:1417)
	at org.apache.maven.plugin.DefaultPluginManager.executeMojo(DefaultPluginManager.java:407)
	at hudson.maven.agent.PluginManagerInterceptor.executeMojo(PluginManagerInterceptor.java:182)
	at org.apache.maven.lifecycle.DefaultLifecycleExecutor.executeGoals(DefaultLifecycleExecutor.java:559)
	... 32 more
[INFO] ------------------------------------------------------------------------
[INFO] BUILD ERRORS
[INFO] ------------------------------------------------------------------------
[INFO] Total time: 2 minutes 
[INFO] Finished at: Thu Jan 21 01:40:36 UTC 2010
[INFO] Final Memory: 51M/1123M
[INFO] ------------------------------------------------------------------------
channel stopped
[locks-and-latches] Releasing all the locks
[locks-and-latches] All the locks released


Mime
View raw message