activemq-dev mailing list archives

Site index · List index
Message view « Date » · « Thread »
Top « Date » · « Thread »
From Apache Hudson Server <hud...@hudson.zones.apache.org>
Subject Build failed in Hudson: ActiveMQ #233
Date Sat, 16 Jan 2010 05:31:24 GMT
See <http://hudson.zones.apache.org/hudson/job/ActiveMQ/233/changes>

Changes:

[dejanb] https://issues.apache.org/activemq/browse/AMQ-2570 - first iteration of activemq
karaf features definition

[rajdavies] test case for https://issues.apache.org/activemq/browse/AMQ-2568

[rajdavies] Added fix for https://issues.apache.org/activemq/browse/AMQ-451

------------------------------------------
[...truncated 2521 lines...]
[INFO] [remote-resources:process {execution: default}]
[INFO] [resources:resources]
[INFO] Using 'UTF-8' encoding to copy filtered resources.
[INFO] Copying 7 resources
[INFO] Copying 3 resources
[INFO] [compiler:compile]
[INFO] Compiling 31 source files to <http://hudson.zones.apache.org/hudson/job/ActiveMQ/ws/trunk/activemq-web/target/classes>
[INFO] [resources:testResources]
[INFO] Using 'UTF-8' encoding to copy filtered resources.
[INFO] Copying 1 resource
[INFO] Copying 3 resources
[INFO] [compiler:testCompile]
[INFO] Compiling 1 source file to <http://hudson.zones.apache.org/hudson/job/ActiveMQ/ws/trunk/activemq-web/target/test-classes>
[INFO] [surefire:test]
[INFO] Surefire report directory: <http://hudson.zones.apache.org/hudson/job/ActiveMQ/ws/trunk/activemq-web/target/surefire-reports>

-------------------------------------------------------
 T E S T S
-------------------------------------------------------
There are no tests to run.

Results :

Tests run: 0, Failures: 0, Errors: 0, Skipped: 0

[INFO] [HUDSON] Recording test results[bundle:bundle]

[WARNING] Warning building bundle org.apache.activemq:activemq-web:bundle:5.4-SNAPSHOT : Split
package org/apache/activemq/protobuf
Use directive -split-package:=(merge-first|merge-last|error|first) on Export/Private Package
instruction to get rid of this warning
Package found in   [Jar:activemq-core, Jar:activemq-protobuf]
Reference from     <http://hudson.zones.apache.org/hudson/job/ActiveMQ/ws/.repository/org/apache/activemq/protobuf/activemq-protobuf/1.0/activemq-protobuf-1.0.jar>
Classpath          [Jar:., Jar:activemq-core, Jar:commons-logging-api, Jar:geronimo-jms_1.1_spec,
Jar:activeio-core, Jar:geronimo-j2ee-management_1.1_spec, Jar:commons-logging, Jar:kahadb,
Jar:activemq-protobuf, Jar:geronimo-j2ee-management_1.0_spec, Jar:spring-context, Jar:aopalliance,
Jar:spring-beans, Jar:spring-core, Jar:commons-net, Jar:activemq-camel, Jar:camel-jms, Jar:camel-core,
Jar:jaxb-api, Jar:stax-api, Jar:activation, Jar:jaxb-impl, Jar:camel-spring, Jar:spring-tx,
Jar:spring-aop, Jar:spring-jms, Jar:commons-pool, Jar:spring-context-support, Jar:geronimo-jta_1.1_spec,
Jar:camel-web, Jar:camel-groovy, Jar:groovy-all, Jar:ant, Jar:ant-launcher, Jar:jline, Jar:camel-ruby,
Jar:jruby, Jar:jersey-spring, Jar:jersey-server, Jar:jersey-core, Jar:jsr311-api, Jar:asm,
Jar:spring-web, Jar:jersey-json, Jar:jettison, Jar:stax-api, Jar:jackson-asl, Jar:jersey-atom,
Jar:rome, Jar:jdom, Jar:sitemesh, Jar:jstl, Jar:standard, Jar:slf4j-api, Jar:slf4j-log4j12,
Jar:log4j, Jar:activemq-pool, Jar:geronimo-jta_1.0.1B_spec, Jar:geronimo-servlet_2.5_spec,
Jar:jetty-util, Jar:xbean-spring, Jar:spring-webmvc, Jar:xmlpull, Jar:xstream, Jar:xpp3_min]
[WARNING] Warning building bundle org.apache.activemq:activemq-web:bundle:5.4-SNAPSHOT : Split
package org/apache/activemq/protobuf/compiler
Use directive -split-package:=(merge-first|merge-last|error|first) on Export/Private Package
instruction to get rid of this warning
Package found in   [Jar:activemq-core, Jar:activemq-protobuf]
Reference from     <http://hudson.zones.apache.org/hudson/job/ActiveMQ/ws/.repository/org/apache/activemq/protobuf/activemq-protobuf/1.0/activemq-protobuf-1.0.jar>
Classpath          [Jar:., Jar:activemq-core, Jar:commons-logging-api, Jar:geronimo-jms_1.1_spec,
Jar:activeio-core, Jar:geronimo-j2ee-management_1.1_spec, Jar:commons-logging, Jar:kahadb,
Jar:activemq-protobuf, Jar:geronimo-j2ee-management_1.0_spec, Jar:spring-context, Jar:aopalliance,
Jar:spring-beans, Jar:spring-core, Jar:commons-net, Jar:activemq-camel, Jar:camel-jms, Jar:camel-core,
Jar:jaxb-api, Jar:stax-api, Jar:activation, Jar:jaxb-impl, Jar:camel-spring, Jar:spring-tx,
Jar:spring-aop, Jar:spring-jms, Jar:commons-pool, Jar:spring-context-support, Jar:geronimo-jta_1.1_spec,
Jar:camel-web, Jar:camel-groovy, Jar:groovy-all, Jar:ant, Jar:ant-launcher, Jar:jline, Jar:camel-ruby,
Jar:jruby, Jar:jersey-spring, Jar:jersey-server, Jar:jersey-core, Jar:jsr311-api, Jar:asm,
Jar:spring-web, Jar:jersey-json, Jar:jettison, Jar:stax-api, Jar:jackson-asl, Jar:jersey-atom,
Jar:rome, Jar:jdom, Jar:sitemesh, Jar:jstl, Jar:standard, Jar:slf4j-api, Jar:slf4j-log4j12,
Jar:log4j, Jar:activemq-pool, Jar:geronimo-jta_1.0.1B_spec, Jar:geronimo-servlet_2.5_spec,
Jar:jetty-util, Jar:xbean-spring, Jar:spring-webmvc, Jar:xmlpull, Jar:xstream, Jar:xpp3_min]
[WARNING] Warning building bundle org.apache.activemq:activemq-web:bundle:5.4-SNAPSHOT : Split
package org/apache/activemq/protobuf/compiler/parser
Use directive -split-package:=(merge-first|merge-last|error|first) on Export/Private Package
instruction to get rid of this warning
Package found in   [Jar:activemq-core, Jar:activemq-protobuf]
Reference from     <http://hudson.zones.apache.org/hudson/job/ActiveMQ/ws/.repository/org/apache/activemq/protobuf/activemq-protobuf/1.0/activemq-protobuf-1.0.jar>
Classpath          [Jar:., Jar:activemq-core, Jar:commons-logging-api, Jar:geronimo-jms_1.1_spec,
Jar:activeio-core, Jar:geronimo-j2ee-management_1.1_spec, Jar:commons-logging, Jar:kahadb,
Jar:activemq-protobuf, Jar:geronimo-j2ee-management_1.0_spec, Jar:spring-context, Jar:aopalliance,
Jar:spring-beans, Jar:spring-core, Jar:commons-net, Jar:activemq-camel, Jar:camel-jms, Jar:camel-core,
Jar:jaxb-api, Jar:stax-api, Jar:activation, Jar:jaxb-impl, Jar:camel-spring, Jar:spring-tx,
Jar:spring-aop, Jar:spring-jms, Jar:commons-pool, Jar:spring-context-support, Jar:geronimo-jta_1.1_spec,
Jar:camel-web, Jar:camel-groovy, Jar:groovy-all, Jar:ant, Jar:ant-launcher, Jar:jline, Jar:camel-ruby,
Jar:jruby, Jar:jersey-spring, Jar:jersey-server, Jar:jersey-core, Jar:jsr311-api, Jar:asm,
Jar:spring-web, Jar:jersey-json, Jar:jettison, Jar:stax-api, Jar:jackson-asl, Jar:jersey-atom,
Jar:rome, Jar:jdom, Jar:sitemesh, Jar:jstl, Jar:standard, Jar:slf4j-api, Jar:slf4j-log4j12,
Jar:log4j, Jar:activemq-pool, Jar:geronimo-jta_1.0.1B_spec, Jar:geronimo-servlet_2.5_spec,
Jar:jetty-util, Jar:xbean-spring, Jar:spring-webmvc, Jar:xmlpull, Jar:xstream, Jar:xpp3_min]
[INFO] [ianal:verify-legal-files {execution: default}]
[INFO] Checking legal files in: activemq-web-5.4-SNAPSHOT.jar
[INFO] [install:install]
[INFO] Installing <http://hudson.zones.apache.org/hudson/job/ActiveMQ/ws/trunk/activemq-web/target/activemq-web-5.4-SNAPSHOT.jar>
to <http://hudson.zones.apache.org/hudson/job/ActiveMQ/ws/.repository/org/apache/activemq/activemq-web/5.4-SNAPSHOT/activemq-web-5.4-SNAPSHOT.jar>
[INFO] [bundle:install]
[INFO] Parsing <http://hudson.zones.apache.org/hudson/job/ActiveMQ/ws/.repository/repository.xml>
[INFO] Installing org/apache/activemq/activemq-web/5.4-SNAPSHOT/activemq-web-5.4-SNAPSHOT.jar
[INFO] Writing OBR metadata
[INFO] Preparing source:jar
[HUDSON] Archiving <http://hudson.zones.apache.org/hudson/job/ActiveMQ/ws/trunk/activemq-web/pom.xml>
to /export/home/hudson/hudson/jobs/ActiveMQ/modules/org.apache.activemq$activemq-web/builds/2010-01-16_00-25-05/archive/org.apache.activemq/activemq-web/5.4-SNAPSHOT/pom.xml
[HUDSON] Archiving <http://hudson.zones.apache.org/hudson/job/ActiveMQ/ws/trunk/activemq-web/target/activemq-web-5.4-SNAPSHOT.jar>
to /export/home/hudson/hudson/jobs/ActiveMQ/modules/org.apache.activemq$activemq-web/builds/2010-01-16_00-25-05/archive/org.apache.activemq/activemq-web/5.4-SNAPSHOT/activemq-web-5.4-SNAPSHOT.jar
[INFO] [enforcer:enforce {execution: default}]
[INFO] [source:jar]
[INFO] Building jar: <http://hudson.zones.apache.org/hudson/job/ActiveMQ/ws/trunk/activemq-web/target/activemq-web-5.4-SNAPSHOT-sources.jar>
[HUDSON] Archiving <http://hudson.zones.apache.org/hudson/job/ActiveMQ/ws/trunk/activemq-web/target/activemq-web-5.4-SNAPSHOT-sources.jar>
to /export/home/hudson/hudson/jobs/ActiveMQ/modules/org.apache.activemq$activemq-web/builds/2010-01-16_00-25-05/archive/org.apache.activemq/activemq-web/5.4-SNAPSHOT/activemq-web-5.4-SNAPSHOT-sources.jar
[INFO] ------------------------------------------------------------------------
[INFO] Building ActiveMQ :: Web Demo
[INFO]    task-segment: [clean, install, source:jar]
[INFO] ------------------------------------------------------------------------
[INFO] [clean:clean]
[INFO] Deleting file set: <http://hudson.zones.apache.org/hudson/job/ActiveMQ/ws/trunk/activemq-web-demo/target>
(included: [**], excluded: [])
[INFO] snapshot org.apache.activemq:activemq-web:5.4-SNAPSHOT: checking for updates from apache.snapshots
[INFO] [enforcer:enforce {execution: default}]
[INFO] [remote-resources:process {execution: default}]
[INFO] [resources:resources]
[INFO] Using 'UTF-8' encoding to copy filtered resources.
[INFO] skip non existing resourceDirectory <http://hudson.zones.apache.org/hudson/job/ActiveMQ/ws/trunk/activemq-web-demo/src/main/resources>
[INFO] Copying 3 resources
[INFO] [compiler:compile]
[INFO] No sources to compile
[INFO] [resources:testResources]
[INFO] Using 'UTF-8' encoding to copy filtered resources.
[INFO] skip non existing resourceDirectory <http://hudson.zones.apache.org/hudson/job/ActiveMQ/ws/trunk/activemq-web-demo/src/test/resources>
[INFO] Copying 3 resources
[INFO] [compiler:testCompile]
[INFO] No sources to compile
[INFO] [surefire:test]
[INFO] Surefire report directory: <http://hudson.zones.apache.org/hudson/job/ActiveMQ/ws/trunk/activemq-web-demo/target/surefire-reports>

-------------------------------------------------------
 T E S T S
-------------------------------------------------------
There are no tests to run.

Results :

Tests run: 0, Failures: 0, Errors: 0, Skipped: 0

[HUDSON] Recording test results
[INFO] [war:war]
[INFO] Packaging webapp
[INFO] Assembling webapp[activemq-web-demo] in [<http://hudson.zones.apache.org/hudson/job/ActiveMQ/ws/trunk/activemq-web-demo/target/activemq-web-demo-5.4-SNAPSHOT]>
[INFO] Processing war project
[INFO] Copying webapp resources[<http://hudson.zones.apache.org/hudson/job/ActiveMQ/ws/trunk/activemq-web-demo/src/main/webapp]>
[INFO] Webapp assembled in[294 msecs]
[INFO] Building war: <http://hudson.zones.apache.org/hudson/job/ActiveMQ/ws/trunk/activemq-web-demo/target/activemq-web-demo-5.4-SNAPSHOT.war>
[INFO] [ianal:verify-legal-files {execution: default}]
[INFO] Checking legal files in: activemq-web-demo-5.4-SNAPSHOT.war
[INFO] [install:install]
[INFO] Installing <http://hudson.zones.apache.org/hudson/job/ActiveMQ/ws/trunk/activemq-web-demo/target/activemq-web-demo-5.4-SNAPSHOT.war>
to <http://hudson.zones.apache.org/hudson/job/ActiveMQ/ws/.repository/org/apache/activemq/activemq-web-demo/5.4-SNAPSHOT/activemq-web-demo-5.4-SNAPSHOT.war>
[INFO] Preparing source:jar
[HUDSON] Archiving <http://hudson.zones.apache.org/hudson/job/ActiveMQ/ws/trunk/activemq-web-demo/pom.xml>
to /export/home/hudson/hudson/jobs/ActiveMQ/modules/org.apache.activemq$activemq-web-demo/builds/2010-01-16_00-25-05/archive/org.apache.activemq/activemq-web-demo/5.4-SNAPSHOT/pom.xml
[HUDSON] Archiving <http://hudson.zones.apache.org/hudson/job/ActiveMQ/ws/trunk/activemq-web-demo/target/activemq-web-demo-5.4-SNAPSHOT.war>
to /export/home/hudson/hudson/jobs/ActiveMQ/modules/org.apache.activemq$activemq-web-demo/builds/2010-01-16_00-25-05/archive/org.apache.activemq/activemq-web-demo/5.4-SNAPSHOT/activemq-web-demo-5.4-SNAPSHOT.war
[INFO] [enforcer:enforce {execution: default}]
[INFO] [source:jar]
[INFO] Building jar: <http://hudson.zones.apache.org/hudson/job/ActiveMQ/ws/trunk/activemq-web-demo/target/activemq-web-demo-5.4-SNAPSHOT-sources.jar>
[HUDSON] Archiving <http://hudson.zones.apache.org/hudson/job/ActiveMQ/ws/trunk/activemq-web-demo/target/activemq-web-demo-5.4-SNAPSHOT-sources.jar>
to /export/home/hudson/hudson/jobs/ActiveMQ/modules/org.apache.activemq$activemq-web-demo/builds/2010-01-16_00-25-05/archive/org.apache.activemq/activemq-web-demo/5.4-SNAPSHOT/activemq-web-demo-5.4-SNAPSHOT-sources.jar
[INFO] ------------------------------------------------------------------------
[INFO] Building ActiveMQ :: XMPP
[INFO]    task-segment: [clean, install, source:jar]
[INFO] ------------------------------------------------------------------------
[INFO] [clean:clean]
[INFO] Deleting file set: <http://hudson.zones.apache.org/hudson/job/ActiveMQ/ws/trunk/activemq-xmpp/target>
(included: [**], excluded: [])
[INFO] [enforcer:enforce {execution: default}]
[INFO] [jaxb2:generate {execution: default}]
[INFO] Succesfully generated output to: <http://hudson.zones.apache.org/hudson/job/ActiveMQ/ws/trunk/activemq-xmpp/target/generated-sources/xjc>
[INFO] [remote-resources:process {execution: default}]
[WARNING] Attempting to build MavenProject instance for Artifact (org.codehaus.woodstox:wstx-asl:3.0.1)
of type: jar; constructing POM artifact instead.
[INFO] [resources:resources]
[INFO] Using 'UTF-8' encoding to copy filtered resources.
[INFO] Copying 34 resources
[INFO] Copying 0 resource
[INFO] Copying 3 resources
[INFO] [compiler:compile]
[INFO] Compiling 143 source files to <http://hudson.zones.apache.org/hudson/job/ActiveMQ/ws/trunk/activemq-xmpp/target/classes>
[INFO] [resources:testResources]
[INFO] Using 'UTF-8' encoding to copy filtered resources.
[INFO] Copying 2 resources
[INFO] Copying 3 resources
[INFO] [compiler:testCompile]
[INFO] Compiling 2 source files to <http://hudson.zones.apache.org/hudson/job/ActiveMQ/ws/trunk/activemq-xmpp/target/test-classes>
[INFO] [surefire:test]
[INFO] Surefire report directory: <http://hudson.zones.apache.org/hudson/job/ActiveMQ/ws/trunk/activemq-xmpp/target/surefire-reports>

-------------------------------------------------------
 T E S T S
-------------------------------------------------------
Running org.apache.activemq.transport.xmpp.XmppTest
Tests run: 1, Failures: 0, Errors: 0, Skipped: 0, Time elapsed: 2.426 sec

Results :

Tests run: 1, Failures: 0, Errors: 0, Skipped: 0

[HUDSON] Recording test results
[INFO] [jar:jar]
[INFO] Building jar: <http://hudson.zones.apache.org/hudson/job/ActiveMQ/ws/trunk/activemq-xmpp/target/activemq-xmpp-5.4-SNAPSHOT.jar>
[INFO] [ianal:verify-legal-files {execution: default}]
[INFO] Checking legal files in: activemq-xmpp-5.4-SNAPSHOT.jar
[INFO] [install:install]
[INFO] Installing <http://hudson.zones.apache.org/hudson/job/ActiveMQ/ws/trunk/activemq-xmpp/target/activemq-xmpp-5.4-SNAPSHOT.jar>
to <http://hudson.zones.apache.org/hudson/job/ActiveMQ/ws/.repository/org/apache/activemq/activemq-xmpp/5.4-SNAPSHOT/activemq-xmpp-5.4-SNAPSHOT.jar>
[INFO] Preparing source:jar
[HUDSON] Archiving <http://hudson.zones.apache.org/hudson/job/ActiveMQ/ws/trunk/activemq-xmpp/pom.xml>
to /export/home/hudson/hudson/jobs/ActiveMQ/modules/org.apache.activemq$activemq-xmpp/builds/2010-01-16_00-25-05/archive/org.apache.activemq/activemq-xmpp/5.4-SNAPSHOT/pom.xml
[HUDSON] Archiving <http://hudson.zones.apache.org/hudson/job/ActiveMQ/ws/trunk/activemq-xmpp/target/activemq-xmpp-5.4-SNAPSHOT.jar>
to /export/home/hudson/hudson/jobs/ActiveMQ/modules/org.apache.activemq$activemq-xmpp/builds/2010-01-16_00-25-05/archive/org.apache.activemq/activemq-xmpp/5.4-SNAPSHOT/activemq-xmpp-5.4-SNAPSHOT.jar
[INFO] [enforcer:enforce {execution: default}]
[INFO] [jaxb2:generate {execution: default}]
[INFO] Skipped XJC execution.  Generated sources were up-to-date.
[INFO] [source:jar]
[INFO] Building jar: <http://hudson.zones.apache.org/hudson/job/ActiveMQ/ws/trunk/activemq-xmpp/target/activemq-xmpp-5.4-SNAPSHOT-sources.jar>
[HUDSON] Archiving <http://hudson.zones.apache.org/hudson/job/ActiveMQ/ws/trunk/activemq-xmpp/target/activemq-xmpp-5.4-SNAPSHOT-sources.jar>
to /export/home/hudson/hudson/jobs/ActiveMQ/modules/org.apache.activemq$activemq-xmpp/builds/2010-01-16_00-25-05/archive/org.apache.activemq/activemq-xmpp/5.4-SNAPSHOT/activemq-xmpp-5.4-SNAPSHOT-sources.jar
[INFO] ------------------------------------------------------------------------
[INFO] Building ActiveMQ :: Web Console
[INFO]    task-segment: [clean, install, source:jar]
[INFO] ------------------------------------------------------------------------
[INFO] [clean:clean]
[INFO] Deleting file set: <http://hudson.zones.apache.org/hudson/job/ActiveMQ/ws/trunk/activemq-web-console/target>
(included: [**], excluded: [])
[INFO] [enforcer:enforce {execution: default}]
[INFO] [remote-resources:process {execution: default}]
[WARNING] Attempting to build MavenProject instance for Artifact (org.codehaus.woodstox:wstx-asl:3.0.1)
of type: jar; constructing POM artifact instead.
[INFO] [resources:resources]
[INFO] Using 'UTF-8' encoding to copy filtered resources.
[INFO] Copying 1 resource
[INFO] Copying 3 resources
[INFO] [compiler:compile]
[INFO] Compiling 12 source files to <http://hudson.zones.apache.org/hudson/job/ActiveMQ/ws/trunk/activemq-web-console/target/classes>
[INFO] [resources:testResources]
[INFO] Using 'UTF-8' encoding to copy filtered resources.
[INFO] skip non existing resourceDirectory <http://hudson.zones.apache.org/hudson/job/ActiveMQ/ws/trunk/activemq-web-console/src/test/resources>
[INFO] Copying 3 resources
[INFO] [compiler:testCompile]
[INFO] Compiling 1 source file to <http://hudson.zones.apache.org/hudson/job/ActiveMQ/ws/trunk/activemq-web-console/target/test-classes>
[INFO] [surefire:test]
[INFO] Surefire report directory: <http://hudson.zones.apache.org/hudson/job/ActiveMQ/ws/trunk/activemq-web-console/target/surefire-reports>

-------------------------------------------------------
 T E S T S
-------------------------------------------------------
There are no tests to run.

Results :

Tests run: 0, Failures: 0, Errors: 0, Skipped: 0

[HUDSON] Recording test results
[INFO] [war:war]
[INFO] Packaging webapp
[INFO] Assembling webapp[activemq-web-console] in [<http://hudson.zones.apache.org/hudson/job/ActiveMQ/ws/trunk/activemq-web-console/target/activemq-web-console-5.4-SNAPSHOT]>
[INFO] Processing war project
[INFO] Copying webapp resources[<http://hudson.zones.apache.org/hudson/job/ActiveMQ/ws/trunk/activemq-web-console/src/main/webapp]>
[INFO] Webapp assembled in[516 msecs]
[INFO] Building war: <http://hudson.zones.apache.org/hudson/job/ActiveMQ/ws/trunk/activemq-web-console/target/activemq-web-console-5.4-SNAPSHOT.war>
[INFO] [ianal:verify-legal-files {execution: default}]
[INFO] Checking legal files in: activemq-web-console-5.4-SNAPSHOT.war
[INFO] [install:install]
[INFO] Installing <http://hudson.zones.apache.org/hudson/job/ActiveMQ/ws/trunk/activemq-web-console/target/activemq-web-console-5.4-SNAPSHOT.war>
to <http://hudson.zones.apache.org/hudson/job/ActiveMQ/ws/.repository/org/apache/activemq/activemq-web-console/5.4-SNAPSHOT/activemq-web-console-5.4-SNAPSHOT.war>
[INFO] Preparing source:jar
[HUDSON] Archiving <http://hudson.zones.apache.org/hudson/job/ActiveMQ/ws/trunk/activemq-web-console/pom.xml>
to /export/home/hudson/hudson/jobs/ActiveMQ/modules/org.apache.activemq$activemq-web-console/builds/2010-01-16_00-25-05/archive/org.apache.activemq/activemq-web-console/5.4-SNAPSHOT/pom.xml
[HUDSON] Archiving <http://hudson.zones.apache.org/hudson/job/ActiveMQ/ws/trunk/activemq-web-console/target/activemq-web-console-5.4-SNAPSHOT.war>
to /export/home/hudson/hudson/jobs/ActiveMQ/modules/org.apache.activemq$activemq-web-console/builds/2010-01-16_00-25-05/archive/org.apache.activemq/activemq-web-console/5.4-SNAPSHOT/activemq-web-console-5.4-SNAPSHOT.war
Sending e-mails to: dev@activemq.apache.org
[locks-and-latches] Releasing all the locks
[locks-and-latches] All the locks released
ERROR: Failed to parse POMs
hudson.util.IOException2: Failed to join the process
	at hudson.Proc$RemoteProc.join(Proc.java:311)
	at hudson.maven.ProcessCache$MavenProcess.call(ProcessCache.java:164)
	at hudson.maven.MavenModuleSetBuild$RunnerImpl.doRun(MavenModuleSetBuild.java:480)
	at hudson.model.AbstractBuild$AbstractRunner.run(AbstractBuild.java:417)
	at hudson.model.Run.run(Run.java:1179)
	at hudson.maven.MavenModuleSetBuild.run(MavenModuleSetBuild.java:304)
	at hudson.model.ResourceController.execute(ResourceController.java:88)
	at hudson.model.Executor.run(Executor.java:122)
Caused by: java.util.concurrent.ExecutionException: hudson.remoting.RequestAbortedException:
java.io.EOFException
	at hudson.remoting.Request$1.get(Request.java:218)
	at hudson.remoting.Request$1.get(Request.java:172)
	at hudson.remoting.FutureAdapter.get(FutureAdapter.java:55)
	at hudson.Proc$RemoteProc.join(Proc.java:303)
	... 7 more
Caused by: hudson.remoting.RequestAbortedException: java.io.EOFException
	at hudson.remoting.Request.abort(Request.java:257)
	at hudson.remoting.Channel.terminate(Channel.java:594)
	at hudson.remoting.Channel$ReaderThread.run(Channel.java:872)
Caused by: java.io.EOFException
	at java.io.ObjectInputStream$BlockDataInputStream.peekByte(ObjectInputStream.java:2554)
	at java.io.ObjectInputStream.readObject0(ObjectInputStream.java:1297)
	at java.io.ObjectInputStream.readObject(ObjectInputStream.java:351)
	at hudson.remoting.Channel$ReaderThread.run(Channel.java:852)
FATAL: channel is already closed
hudson.remoting.ChannelClosedException: channel is already closed
	at hudson.remoting.Channel.send(Channel.java:408)
	at hudson.remoting.Request.call(Request.java:105)
	at hudson.remoting.Channel.call(Channel.java:547)
	at hudson.Launcher$RemoteLauncher.kill(Launcher.java:734)
	at hudson.model.AbstractBuild$AbstractRunner.run(AbstractBuild.java:422)
	at hudson.model.Run.run(Run.java:1179)
	at hudson.maven.MavenModuleSetBuild.run(MavenModuleSetBuild.java:304)
	at hudson.model.ResourceController.execute(ResourceController.java:88)
	at hudson.model.Executor.run(Executor.java:122)


Mime
View raw message