activemq-dev mailing list archives

Site index · List index
Message view « Date » · « Thread »
Top « Date » · « Thread »
From Apache Hudson Server <hud...@hudson.zones.apache.org>
Subject Build failed in Hudson: ActiveMQ Protocol Buffer » ActiveMQ Protocol Buffers POM #5
Date Sat, 19 Sep 2009 15:02:36 GMT
See <http://hudson.zones.apache.org/hudson/job/ActiveMQ%20Protocol%20Buffer/org.apache.activemq.protobuf$activemq-protobuf-pom/5/changes>

Changes:

[dejanb] [maven-release-plugin] prepare for next development iteration

[dejanb] [maven-release-plugin] prepare release activemq-protobuf-1.0

[dejanb] defining plugin in parent pom

[dejanb] fixing version number

[dejanb] adapting to new release process

------------------------------------------
<===[HUDSON REMOTING CAPACITY]===>   channel started
Executing Maven:  -B -f <http://hudson.zones.apache.org/hudson/job/ActiveMQ%20Protocol%20Buffer/org.apache.activemq.protobuf$activemq-protobuf-pom/ws/pom.xml>
-Dmaven.repo.local=/export/home/hudson/hudson/jobs/ActiveMQ Protocol Buffer/workspace/.repository
-fae -B -e -U clean install
+ Error stacktraces are turned on.
[INFO] Scanning for projects...
[INFO] Reactor build order: 
[INFO]   ActiveMQ Protocol Buffers POM
[INFO]   ActiveMQ Protocol Buffers Implementation and Compiler
[INFO]   ActiveMQ Protocol Buffers Tests
[INFO] ------------------------------------------------------------------------
[INFO] Building ActiveMQ Protocol Buffers POM
[INFO]    task-segment: [clean, install]
[INFO] ------------------------------------------------------------------------
Downloading: http://repo1.maven.org/maven2/org/apache/maven/plugins/maven-enforcer-plugin/1.0-beta-1/maven-enforcer-plugin-1.0-beta-1.pom
5K downloaded
Downloading: http://repo1.maven.org/maven2/org/apache/maven/enforcer/enforcer/1.0-beta-1/enforcer-1.0-beta-1.pom
11K downloaded
Downloading: http://repo1.maven.org/maven2/org/apache/maven/plugins/maven-enforcer-plugin/1.0-beta-1/maven-enforcer-plugin-1.0-beta-1.jar
20K downloaded
Downloading: http://repo1.maven.org/maven2/org/codehaus/mojo/ianal-maven-plugin/1.0-alpha-1/ianal-maven-plugin-1.0-alpha-1.pom
17K downloaded
Downloading: http://repo1.maven.org/maven2/org/codehaus/mojo/mojo/15/mojo-15.pom
8K downloaded
Downloading: http://repo1.maven.org/maven2/org/codehaus/mojo/ianal-maven-plugin/1.0-alpha-1/ianal-maven-plugin-1.0-alpha-1.jar
23K downloaded
Downloading: http://repo1.maven.org/maven2/org/apache/maven/plugins/maven-surefire-plugin/2.4.3/maven-surefire-plugin-2.4.3.pom
6K downloaded
Downloading: http://repo1.maven.org/maven2/org/apache/maven/surefire/surefire/2.4.3/surefire-2.4.3.pom
7K downloaded
Downloading: http://repo1.maven.org/maven2/org/apache/maven/plugins/maven-surefire-plugin/2.4.3/maven-surefire-plugin-2.4.3.jar
22K downloaded
Downloading: http://repo1.maven.org/maven2/org/apache/maven/plugins/maven-eclipse-plugin/2.7/maven-eclipse-plugin-2.7.pom
10K downloaded
Downloading: http://repo1.maven.org/maven2/org/apache/maven/plugins/maven-eclipse-plugin/2.7/maven-eclipse-plugin-2.7.jar
201K downloaded
[INFO] [clean:clean]
[INFO] Deleting file set: <http://hudson.zones.apache.org/hudson/job/ActiveMQ%20Protocol%20Buffer/org.apache.activemq.protobuf$activemq-protobuf-pom/ws/target>
(included: [**], excluded: [])
Downloading: http://repo1.maven.org/maven2/org/apache/maven/maven-artifact/2.0.9/maven-artifact-2.0.9.pom
1K downloaded
Downloading: http://repo1.maven.org/maven2/org/apache/maven/maven/2.0.9/maven-2.0.9.pom
18K downloaded
Downloading: http://repo1.maven.org/maven2/org/codehaus/plexus/plexus-utils/1.5.8/plexus-utils-1.5.8.pom
7K downloaded
Downloading: http://repo1.maven.org/maven2/org/apache/maven/maven-plugin-api/2.0.9/maven-plugin-api-2.0.9.pom
1K downloaded
Downloading: http://repo1.maven.org/maven2/org/apache/maven/maven-project/2.0.9/maven-project-2.0.9.pom
2K downloaded
Downloading: http://repo1.maven.org/maven2/org/apache/maven/maven-settings/2.0.9/maven-settings-2.0.9.pom
2K downloaded
Downloading: http://repo1.maven.org/maven2/org/apache/maven/maven-model/2.0.9/maven-model-2.0.9.pom
3K downloaded
Downloading: http://repo1.maven.org/maven2/org/apache/maven/maven-profile/2.0.9/maven-profile-2.0.9.pom
2K downloaded
Downloading: http://repo1.maven.org/maven2/org/apache/maven/maven-artifact-manager/2.0.9/maven-artifact-manager-2.0.9.pom
2K downloaded
Downloading: http://repo1.maven.org/maven2/org/apache/maven/maven-repository-metadata/2.0.9/maven-repository-metadata-2.0.9.pom
1K downloaded
Downloading: http://repo1.maven.org/maven2/org/apache/maven/maven-plugin-registry/2.0.9/maven-plugin-registry-2.0.9.pom
1K downloaded
Downloading: http://repo1.maven.org/maven2/org/apache/maven/maven-core/2.0.9/maven-core-2.0.9.pom
7K downloaded
Downloading: http://repo1.maven.org/maven2/org/apache/maven/maven-plugin-parameter-documenter/2.0.9/maven-plugin-parameter-documenter-2.0.9.pom
1K downloaded
Downloading: http://repo1.maven.org/maven2/org/apache/maven/wagon/wagon-webdav/1.0-beta-2/wagon-webdav-1.0-beta-2.pom
1K downloaded
Downloading: http://repo1.maven.org/maven2/slide/slide-webdavlib/2.1/slide-webdavlib-2.1.pom
648b downloaded
Downloading: http://repo1.maven.org/maven2/commons-httpclient/commons-httpclient/2.0.2/commons-httpclient-2.0.2.pom
6K downloaded
Downloading: http://repo1.maven.org/maven2/jdom/jdom/1.0/jdom-1.0.pom
1K downloaded
Downloading: http://repo1.maven.org/maven2/de/zeigermann/xml/xml-im-exporter/1.1/xml-im-exporter-1.1.pom
248b downloaded
Downloading: http://repo1.maven.org/maven2/org/apache/maven/reporting/maven-reporting-api/2.0.9/maven-reporting-api-2.0.9.pom
1K downloaded
Downloading: http://repo1.maven.org/maven2/org/apache/maven/reporting/maven-reporting/2.0.9/maven-reporting-2.0.9.pom
1K downloaded
Downloading: http://repo1.maven.org/maven2/org/apache/maven/maven-error-diagnostics/2.0.9/maven-error-diagnostics-2.0.9.pom
1K downloaded
Downloading: http://repo1.maven.org/maven2/org/apache/maven/maven-plugin-descriptor/2.0.9/maven-plugin-descriptor-2.0.9.pom
2K downloaded
Downloading: http://repo1.maven.org/maven2/org/apache/maven/maven-monitor/2.0.9/maven-monitor-2.0.9.pom
1K downloaded
Downloading: http://repo1.maven.org/maven2/org/apache/maven/enforcer/enforcer-api/1.0-beta-1/enforcer-api-1.0-beta-1.pom
3K downloaded
Downloading: http://repo1.maven.org/maven2/org/apache/maven/enforcer/enforcer-rules/1.0-beta-1/enforcer-rules-1.0-beta-1.pom
4K downloaded
Downloading: http://repo1.maven.org/maven2/org/beanshell/bsh/2.0b4/bsh-2.0b4.pom
1K downloaded
Downloading: http://repo1.maven.org/maven2/org/beanshell/beanshell/2.0b4/beanshell-2.0b4.pom
1K downloaded
Downloading: http://repo1.maven.org/maven2/org/codehaus/plexus/plexus-utils/1.5.8/plexus-utils-1.5.8.jar
261K downloaded
Downloading: http://repo1.maven.org/maven2/org/apache/maven/enforcer/enforcer-api/1.0-beta-1/enforcer-api-1.0-beta-1.jar
9K downloaded
Downloading: http://repo1.maven.org/maven2/org/apache/maven/enforcer/enforcer-rules/1.0-beta-1/enforcer-rules-1.0-beta-1.jar
52K downloaded
Downloading: http://repo1.maven.org/maven2/org/beanshell/bsh/2.0b4/bsh-2.0b4.jar
275K downloaded
[INFO] [enforcer:enforce {execution: default}]
[WARNING] Rule 0: org.apache.maven.plugins.enforcer.RequireMavenVersion failed with message:
Detected Maven Version: 2.0.9 is not in the allowed range [2.0.10,).
[HUDSON] Archiving <http://hudson.zones.apache.org/hudson/job/ActiveMQ%20Protocol%20Buffer/org.apache.activemq.protobuf$activemq-protobuf-pom/ws/pom.xml>
to /export/home/hudson/hudson/jobs/ActiveMQ Protocol Buffer/modules/org.apache.activemq.protobuf$activemq-protobuf-pom/builds/2009-09-19_15-02-07/archive/org.apache.activemq.protobuf/activemq-protobuf-pom/1.1-SNAPSHOT/pom.xml
[INFO] ------------------------------------------------------------------------
[INFO] SKIPPING ActiveMQ Protocol Buffers Implementation and Compiler
[INFO]    task-segment: [clean, install]
[INFO] This project has been banned from further executions due to previous failures.
[INFO] ------------------------------------------------------------------------
[INFO] ------------------------------------------------------------------------
[INFO] SKIPPING ActiveMQ Protocol Buffers Tests
[INFO]    task-segment: [clean, install]
[INFO] This project has been banned from further executions due to previous failures.
[INFO] ------------------------------------------------------------------------
[INFO] 
[INFO] 
[INFO] ------------------------------------------------------------------------
[INFO] Reactor Summary:
[INFO] ------------------------------------------------------------------------
[INFO] ActiveMQ Protocol Buffers POM ......................... FAILED [18.572s]
[INFO] ActiveMQ Protocol Buffers Implementation and Compiler . SKIPPED (dependency build failed
or was skipped)
[INFO] ActiveMQ Protocol Buffers Tests ....................... SKIPPED (dependency build failed
or was skipped)
[INFO] ------------------------------------------------------------------------
[INFO] Error for project: ActiveMQ Protocol Buffers POM (during install)
[INFO] ------------------------------------------------------------------------
[INFO] Some Enforcer rules have failed. Look above for specific messages explaining why the
rule failed.
[INFO] ------------------------------------------------------------------------
[INFO] Trace
org.apache.maven.lifecycle.LifecycleExecutionException: Some Enforcer rules have failed. Look
above for specific messages explaining why the rule failed.
	at org.apache.maven.lifecycle.DefaultLifecycleExecutor.executeGoals(DefaultLifecycleExecutor.java:583)
	at org.apache.maven.lifecycle.DefaultLifecycleExecutor.executeGoalWithLifecycle(DefaultLifecycleExecutor.java:499)
	at org.apache.maven.lifecycle.DefaultLifecycleExecutor.executeGoal(DefaultLifecycleExecutor.java:478)
	at org.apache.maven.lifecycle.DefaultLifecycleExecutor.executeGoalAndHandleFailures(DefaultLifecycleExecutor.java:330)
	at org.apache.maven.lifecycle.DefaultLifecycleExecutor.executeTaskSegments(DefaultLifecycleExecutor.java:291)
	at org.apache.maven.lifecycle.DefaultLifecycleExecutor.execute(DefaultLifecycleExecutor.java:142)
	at org.apache.maven.lifecycle.LifecycleExecutorInterceptor.execute(LifecycleExecutorInterceptor.java:65)
	at org.apache.maven.DefaultMaven.doExecute(DefaultMaven.java:336)
	at org.apache.maven.DefaultMaven.execute(DefaultMaven.java:129)
	at org.apache.maven.cli.MavenCli.main(MavenCli.java:287)
	at sun.reflect.NativeMethodAccessorImpl.invoke0(Native Method)
	at sun.reflect.NativeMethodAccessorImpl.invoke(NativeMethodAccessorImpl.java:39)
	at sun.reflect.DelegatingMethodAccessorImpl.invoke(DelegatingMethodAccessorImpl.java:25)
	at java.lang.reflect.Method.invoke(Method.java:585)
	at org.codehaus.classworlds.Launcher.launchEnhanced(Launcher.java:315)
	at org.codehaus.classworlds.Launcher.launch(Launcher.java:255)
	at hudson.maven.agent.Main.launch(Main.java:165)
	at hudson.maven.MavenBuilder.call(MavenBuilder.java:159)
	at hudson.maven.MavenModuleSetBuild$Builder.call(MavenModuleSetBuild.java:677)
	at hudson.maven.MavenModuleSetBuild$Builder.call(MavenModuleSetBuild.java:623)
	at hudson.remoting.UserRequest.perform(UserRequest.java:104)
	at hudson.remoting.UserRequest.perform(UserRequest.java:48)
	at hudson.remoting.Request$2.run(Request.java:236)
	at java.util.concurrent.Executors$RunnableAdapter.call(Executors.java:417)
	at java.util.concurrent.FutureTask$Sync.innerRun(FutureTask.java:269)
	at java.util.concurrent.FutureTask.run(FutureTask.java:123)
	at java.util.concurrent.ThreadPoolExecutor$Worker.runTask(ThreadPoolExecutor.java:650)
	at java.util.concurrent.ThreadPoolExecutor$Worker.run(ThreadPoolExecutor.java:675)
	at java.lang.Thread.run(Thread.java:595)
Caused by: org.apache.maven.plugin.MojoExecutionException: Some Enforcer rules have failed.
Look above for specific messages explaining why the rule failed.
	at org.apache.maven.plugins.enforcer.EnforceMojo.execute(EnforceMojo.java:218)
	at org.apache.maven.plugin.DefaultPluginManager.executeMojo(DefaultPluginManager.java:451)
	at hudson.maven.agent.PluginManagerInterceptor.executeMojo(PluginManagerInterceptor.java:182)
	at org.apache.maven.lifecycle.DefaultLifecycleExecutor.executeGoals(DefaultLifecycleExecutor.java:558)
	... 28 more
[INFO] ------------------------------------------------------------------------
[INFO] BUILD ERRORS
[INFO] ------------------------------------------------------------------------
[INFO] Total time: 21 seconds
[INFO] Finished at: Sat Sep 19 15:02:36 UTC 2009
[INFO] Final Memory: 17M/1127M
[INFO] ------------------------------------------------------------------------


Mime
View raw message