activemq-dev mailing list archives

Site index · List index
Message view « Date » · « Thread »
Top « Date » · « Thread »
From "Dejan Bosanac (JIRA)" <j...@apache.org>
Subject [jira] Created: (AMQ-2182) Camel module test failures
Date Wed, 25 Mar 2009 17:35:15 GMT
Camel module test failures
--------------------------

                 Key: AMQ-2182
                 URL: https://issues.apache.org/activemq/browse/AMQ-2182
             Project: ActiveMQ
          Issue Type: Bug
          Components: Broker
    Affects Versions: 5.3.0
            Reporter: Dejan Bosanac
            Assignee: Dejan Bosanac
             Fix For: 5.3.0


Just as a reminder ... there are test failures in activemq-camel module after upgrading to
2.0

target/surefire-reports/org.apache.activemq.camel.component.ActiveMQJmsHeaderRouteTest.txt:Tests
run: 1, Failures: 0, Errors: 1, Skipped: 0, Time elapsed: 3.538 sec <<< FAILURE!
target/surefire-reports/org.apache.activemq.camel.component.InvokeRequestReplyUsingJmsReplyToHeaderTest.txt:Tests
run: 1, Failures: 0, Errors: 1, Skipped: 0, Time elapsed: 22.466 sec <<< FAILURE!
target/surefire-reports/org.apache.activemq.camel.converter.InvokeMessageListenerTest.txt:Tests
run: 1, Failures: 1, Errors: 0, Skipped: 0, Time elapsed: 11.559 sec <<< FAILURE!
target/surefire-reports/org.apache.activemq.camel.converter.InvokeMessageListenerTest.txt:testSendTextMessage(org.apache.activemq.camel.converter.InvokeMessageListenerTest)
 Time elapsed: 11.543 sec  <<< FAILURE!


-- 
This message is automatically generated by JIRA.
-
You can reply to this email to add a comment to the issue online.


Mime
View raw message