activemq-dev mailing list archives

Site index · List index
Message view « Date » · « Thread »
Top « Date » · « Thread »
From "Fritz Oconer" <foco...@exist.com>
Subject Re: Build Problem
Date Fri, 17 Feb 2006 01:58:02 GMT
Hi Li,

There's also an option in maven where you can disable running the unit test.
Execute the command in activemq home directory
"maven -Dmaven.test.skip=true". Can we also have a copy of the maven build
log file? this may provide information why the test-reports are not
generated. The log file can be created by adding additional statement in the
build command. e.g "maven > build.log".

Hope this helps,
Fritz

----- Original Message -----
From: "Li, Fan" <fanli@amazon.com>
To: <activemq-dev@geronimo.apache.org>
Sent: Friday, February 17, 2006 5:08 AM
Subject: RE: Build Problem


> I did not find any occurrence of '[ERROR]' in my activemq directory after
a build fail, although there are some occurrence of 'ERROR', none of them
was in one of the /target/test-reports/TEST-$name.txt files. My platform is
RedHat Linux 7.2
>
> Thanks
> Fan
>
> -----Original Message-----
> From: James Strachan [mailto:james.strachan@gmail.com]
> Sent: Thursday, February 16, 2006 11:17 AM
> To: activemq-dev@geronimo.apache.org
> Subject: Re: Build Problem
>
> That indicates there were some JUnit test failures. We have some tests
that fail on some platforms with timing issues; its amazingly hard to write
highly asynchronous & concurrent message based unit test cases that always
work on every platform.
>
> If you seach for [ERROR] you'll find the actual tests that failed. Then if
you look in "target/test-reports/TEST-$name.txt" (in the module thats being
> built) you'll find the output of the test case. If you could post those
it'd really help us fix it.
>
> James
>
>
> On 2/16/06, Li, Fan <fanli@amazon.com> wrote:
> >
> > I have been trying to build the latest source code with maven 1.0.2
> > and kept getting build failure. This is the build for the latest
> > SNAPSHOT. I am not sure if anyone had similar problem.
> >
> > BUILD FAILED
> > File...... /home/fanli/.maven/cache/maven-multiproject-plugin-1.3.1
> > /plugin.jelly
> > Element... maven:reactor
> > Line...... 217
> > Column.... 9
> > Unable to obtain goal [test:test] --
> > /home/fanli/.maven/cache/maven-test-plugin-
> > 1.6.2/plugin.jelly:181:54: <fail> There were test failures.
> > Total time: 58 minutes 22 seconds
> > Finished at: Thu Feb 16 09:49:19 PST 2006
> >
> > Thanks
> > Fan
> >
> >
> >
>
>
> --
>
> James
> -------
> http://radio.weblogs.com/0112098/


Mime
View raw message