activemq-commits mailing list archives

Site index · List index
Message view « Date » · « Thread »
Top « Date » · « Thread »
From Apache Jenkins Server <jenk...@builds.apache.org>
Subject Build failed in Jenkins: ActiveMQ » ActiveMQ-Artemis-Master-JDK8 #197
Date Thu, 07 Jan 2021 16:11:50 GMT
See <https://ci-builds.apache.org/job/ActiveMQ/job/ActiveMQ-Artemis-Master-JDK8/197/display/redirect?page=changes>

Changes:

[Clebert Suconic] NO-JIRA fixing intermittent failure on QueueAutoDeleteTest


------------------------------------------
[...truncated 1.67 MB...]
	at java.lang.reflect.Method.invoke(Method.java:498)
	at hudson.model.Executor$2.call(Executor.java:932)
	at hudson.util.InterceptingProxy$1.invoke(InterceptingProxy.java:23)
	at com.sun.proxy.$Proxy188.execute(Unknown Source)
	at hudson.maven.MavenBuildProxy$Filter$AsyncInvoker.call(MavenBuildProxy.java:294)
	at hudson.remoting.UserRequest.perform(UserRequest.java:211)
	at hudson.remoting.UserRequest.perform(UserRequest.java:54)
	at hudson.remoting.Request$2.run(Request.java:369)
	at hudson.remoting.InterceptingExecutorService$1.call(InterceptingExecutorService.java:72)
	at org.jenkinsci.remoting.CallableDecorator.call(CallableDecorator.java:18)
	at hudson.remoting.CallableDecoratorList$1.call(CallableDecoratorList.java:21)
	at jenkins.util.ContextResettingExecutorService$2.call(ContextResettingExecutorService.java:46)
	at jenkins.security.ImpersonatingExecutorService$2.call(ImpersonatingExecutorService.java:71)
	... 4 more
	Suppressed: hudson.remoting.Channel$CallSiteStackTrace: Remote call to channel
		at hudson.remoting.Channel.attachCallSiteStackTrace(Channel.java:1788)
		at hudson.remoting.UserRequest$ExceptionResponse.retrieve(UserRequest.java:356)
		at hudson.remoting.Channel$2.adapt(Channel.java:1033)
		at hudson.remoting.Channel$2.adapt(Channel.java:1029)
		at hudson.remoting.FutureAdapter.get(FutureAdapter.java:55)
		at hudson.maven.AbstractMavenBuilder.waitForAsynchronousExecutions(AbstractMavenBuilder.java:186)
		at hudson.maven.Maven3Builder.call(Maven3Builder.java:146)
		at hudson.maven.Maven3Builder.call(Maven3Builder.java:70)
		at hudson.remoting.UserRequest.perform(UserRequest.java:211)
		at hudson.remoting.UserRequest.perform(UserRequest.java:54)
		at hudson.remoting.Request$2.run(Request.java:369)
		at hudson.remoting.InterceptingExecutorService$1.call(InterceptingExecutorService.java:72)
		... 4 more
ERROR: Asynchronous execution failure
java.util.concurrent.ExecutionException: java.io.IOException: Unexpected Fingerprint type.
Expected class hudson.model.Fingerprint or subclass but got class hudson.model.Fingerprint$RangeSet
	at hudson.remoting.Channel$2.adapt(Channel.java:1035)
	at hudson.remoting.Channel$2.adapt(Channel.java:1029)
	at hudson.remoting.FutureAdapter.get(FutureAdapter.java:55)
	at hudson.maven.AbstractMavenBuilder.waitForAsynchronousExecutions(AbstractMavenBuilder.java:186)
	at hudson.maven.Maven3Builder.call(Maven3Builder.java:146)
	at hudson.maven.Maven3Builder.call(Maven3Builder.java:70)
	at hudson.remoting.UserRequest.perform(UserRequest.java:211)
	at hudson.remoting.UserRequest.perform(UserRequest.java:54)
	at hudson.remoting.Request$2.run(Request.java:369)
	at hudson.remoting.InterceptingExecutorService$1.call(InterceptingExecutorService.java:72)
	at java.util.concurrent.FutureTask.run(FutureTask.java:266)
	at java.util.concurrent.ThreadPoolExecutor.runWorker(ThreadPoolExecutor.java:1149)
	at java.util.concurrent.ThreadPoolExecutor$Worker.run(ThreadPoolExecutor.java:624)
	at java.lang.Thread.run(Thread.java:748)
Caused by: java.io.IOException: Unexpected Fingerprint type. Expected class hudson.model.Fingerprint
or subclass but got class hudson.model.Fingerprint$RangeSet
	at hudson.model.Fingerprint.load(Fingerprint.java:1387)
	at hudson.model.Fingerprint.load(Fingerprint.java:1372)
	at hudson.model.FingerprintMap.load(FingerprintMap.java:97)
	at hudson.model.FingerprintMap.load(FingerprintMap.java:47)
	at hudson.util.KeyedDataStorage.get(KeyedDataStorage.java:161)
	at hudson.model.FingerprintMap.get(FingerprintMap.java:82)
	at hudson.model.FingerprintMap.get(FingerprintMap.java:47)
	at hudson.util.KeyedDataStorage.getOrCreate(KeyedDataStorage.java:111)
	at hudson.model.FingerprintMap.getOrCreate(FingerprintMap.java:68)
	at hudson.maven.reporters.MavenFingerprinter$PostBuildCallable.call(MavenFingerprinter.java:249)
	at hudson.maven.reporters.MavenFingerprinter$PostBuildCallable.call(MavenFingerprinter.java:236)
	at hudson.maven.MavenBuild$ProxyImpl.execute(MavenBuild.java:454)
	at hudson.maven.MavenBuild$ProxyImpl2.execute(MavenBuild.java:586)
	at sun.reflect.GeneratedMethodAccessor933.invoke(Unknown Source)
	at sun.reflect.DelegatingMethodAccessorImpl.invoke(DelegatingMethodAccessorImpl.java:43)
	at java.lang.reflect.Method.invoke(Method.java:498)
	at hudson.model.Executor$2.call(Executor.java:932)
	at hudson.util.InterceptingProxy$1.invoke(InterceptingProxy.java:23)
	at com.sun.proxy.$Proxy188.execute(Unknown Source)
	at hudson.maven.MavenBuildProxy$Filter$AsyncInvoker.call(MavenBuildProxy.java:294)
	at hudson.remoting.UserRequest.perform(UserRequest.java:211)
	at hudson.remoting.UserRequest.perform(UserRequest.java:54)
	at hudson.remoting.Request$2.run(Request.java:369)
	at hudson.remoting.InterceptingExecutorService$1.call(InterceptingExecutorService.java:72)
	at org.jenkinsci.remoting.CallableDecorator.call(CallableDecorator.java:18)
	at hudson.remoting.CallableDecoratorList$1.call(CallableDecoratorList.java:21)
	at jenkins.util.ContextResettingExecutorService$2.call(ContextResettingExecutorService.java:46)
	at jenkins.security.ImpersonatingExecutorService$2.call(ImpersonatingExecutorService.java:71)
	... 4 more
	Suppressed: hudson.remoting.Channel$CallSiteStackTrace: Remote call to channel
		at hudson.remoting.Channel.attachCallSiteStackTrace(Channel.java:1788)
		at hudson.remoting.UserRequest$ExceptionResponse.retrieve(UserRequest.java:356)
		at hudson.remoting.Channel$2.adapt(Channel.java:1033)
		at hudson.remoting.Channel$2.adapt(Channel.java:1029)
		at hudson.remoting.FutureAdapter.get(FutureAdapter.java:55)
		at hudson.maven.AbstractMavenBuilder.waitForAsynchronousExecutions(AbstractMavenBuilder.java:186)
		at hudson.maven.Maven3Builder.call(Maven3Builder.java:146)
		at hudson.maven.Maven3Builder.call(Maven3Builder.java:70)
		at hudson.remoting.UserRequest.perform(UserRequest.java:211)
		at hudson.remoting.UserRequest.perform(UserRequest.java:54)
		at hudson.remoting.Request$2.run(Request.java:369)
		at hudson.remoting.InterceptingExecutorService$1.call(InterceptingExecutorService.java:72)
		... 4 more
ERROR: Asynchronous execution failure
java.util.concurrent.ExecutionException: java.io.IOException: Unexpected Fingerprint type.
Expected class hudson.model.Fingerprint or subclass but got class hudson.model.Fingerprint$RangeSet
	at hudson.remoting.Channel$2.adapt(Channel.java:1035)
	at hudson.remoting.Channel$2.adapt(Channel.java:1029)
	at hudson.remoting.FutureAdapter.get(FutureAdapter.java:55)
	at hudson.maven.AbstractMavenBuilder.waitForAsynchronousExecutions(AbstractMavenBuilder.java:186)
	at hudson.maven.Maven3Builder.call(Maven3Builder.java:146)
	at hudson.maven.Maven3Builder.call(Maven3Builder.java:70)
	at hudson.remoting.UserRequest.perform(UserRequest.java:211)
	at hudson.remoting.UserRequest.perform(UserRequest.java:54)
	at hudson.remoting.Request$2.run(Request.java:369)
	at hudson.remoting.InterceptingExecutorService$1.call(InterceptingExecutorService.java:72)
	at java.util.concurrent.FutureTask.run(FutureTask.java:266)
	at java.util.concurrent.ThreadPoolExecutor.runWorker(ThreadPoolExecutor.java:1149)
	at java.util.concurrent.ThreadPoolExecutor$Worker.run(ThreadPoolExecutor.java:624)
	at java.lang.Thread.run(Thread.java:748)
Caused by: java.io.IOException: Unexpected Fingerprint type. Expected class hudson.model.Fingerprint
or subclass but got class hudson.model.Fingerprint$RangeSet
	at hudson.model.Fingerprint.load(Fingerprint.java:1387)
	at hudson.model.Fingerprint.load(Fingerprint.java:1372)
	at hudson.model.FingerprintMap.load(FingerprintMap.java:97)
	at hudson.model.FingerprintMap.load(FingerprintMap.java:47)
	at hudson.util.KeyedDataStorage.get(KeyedDataStorage.java:161)
	at hudson.model.FingerprintMap.get(FingerprintMap.java:82)
	at hudson.model.FingerprintMap.get(FingerprintMap.java:47)
	at hudson.util.KeyedDataStorage.getOrCreate(KeyedDataStorage.java:111)
	at hudson.model.FingerprintMap.getOrCreate(FingerprintMap.java:68)
	at hudson.maven.reporters.MavenFingerprinter$PostBuildCallable.call(MavenFingerprinter.java:249)
	at hudson.maven.reporters.MavenFingerprinter$PostBuildCallable.call(MavenFingerprinter.java:236)
	at hudson.maven.MavenBuild$ProxyImpl.execute(MavenBuild.java:454)
	at hudson.maven.MavenBuild$ProxyImpl2.execute(MavenBuild.java:586)
	at sun.reflect.GeneratedMethodAccessor933.invoke(Unknown Source)
	at sun.reflect.DelegatingMethodAccessorImpl.invoke(DelegatingMethodAccessorImpl.java:43)
	at java.lang.reflect.Method.invoke(Method.java:498)
	at hudson.model.Executor$2.call(Executor.java:932)
	at hudson.util.InterceptingProxy$1.invoke(InterceptingProxy.java:23)
	at com.sun.proxy.$Proxy188.execute(Unknown Source)
	at hudson.maven.MavenBuildProxy$Filter$AsyncInvoker.call(MavenBuildProxy.java:294)
	at hudson.remoting.UserRequest.perform(UserRequest.java:211)
	at hudson.remoting.UserRequest.perform(UserRequest.java:54)
	at hudson.remoting.Request$2.run(Request.java:369)
	at hudson.remoting.InterceptingExecutorService$1.call(InterceptingExecutorService.java:72)
	at org.jenkinsci.remoting.CallableDecorator.call(CallableDecorator.java:18)
	at hudson.remoting.CallableDecoratorList$1.call(CallableDecoratorList.java:21)
	at jenkins.util.ContextResettingExecutorService$2.call(ContextResettingExecutorService.java:46)
	at jenkins.security.ImpersonatingExecutorService$2.call(ImpersonatingExecutorService.java:71)
	... 4 more
	Suppressed: hudson.remoting.Channel$CallSiteStackTrace: Remote call to channel
		at hudson.remoting.Channel.attachCallSiteStackTrace(Channel.java:1788)
		at hudson.remoting.UserRequest$ExceptionResponse.retrieve(UserRequest.java:356)
		at hudson.remoting.Channel$2.adapt(Channel.java:1033)
		at hudson.remoting.Channel$2.adapt(Channel.java:1029)
		at hudson.remoting.FutureAdapter.get(FutureAdapter.java:55)
		at hudson.maven.AbstractMavenBuilder.waitForAsynchronousExecutions(AbstractMavenBuilder.java:186)
		at hudson.maven.Maven3Builder.call(Maven3Builder.java:146)
		at hudson.maven.Maven3Builder.call(Maven3Builder.java:70)
		at hudson.remoting.UserRequest.perform(UserRequest.java:211)
		at hudson.remoting.UserRequest.perform(UserRequest.java:54)
		at hudson.remoting.Request$2.run(Request.java:369)
		at hudson.remoting.InterceptingExecutorService$1.call(InterceptingExecutorService.java:72)
		... 4 more
[JENKINS] Archiving <https://ci-builds.apache.org/job/ActiveMQ/job/ActiveMQ-Artemis-Master-JDK8/ws/artemis-server/pom.xml>
to org.apache.activemq/artemis-server/2.17.0-SNAPSHOT/artemis-server-2.17.0-SNAPSHOT.pom
[JENKINS] Archiving <https://ci-builds.apache.org/job/ActiveMQ/job/ActiveMQ-Artemis-Master-JDK8/ws/artemis-server/target/artemis-server-2.17.0-SNAPSHOT.jar>
to org.apache.activemq/artemis-server/2.17.0-SNAPSHOT/artemis-server-2.17.0-SNAPSHOT.jar
[JENKINS] Archiving <https://ci-builds.apache.org/job/ActiveMQ/job/ActiveMQ-Artemis-Master-JDK8/ws/artemis-server/target/artemis-server-2.17.0-SNAPSHOT-tests.jar>
to org.apache.activemq/artemis-server/2.17.0-SNAPSHOT/artemis-server-2.17.0-SNAPSHOT-tests.jar
[JENKINS] Archiving <https://ci-builds.apache.org/job/ActiveMQ/job/ActiveMQ-Artemis-Master-JDK8/ws/artemis-server/target/artemis-server-2.17.0-SNAPSHOT-sources.jar>
to org.apache.activemq/artemis-server/2.17.0-SNAPSHOT/artemis-server-2.17.0-SNAPSHOT-sources.jar
[Fast Archiver] Compressed 4.63 MB of artifacts by 24.3% relative to #196
[JENKINS] Archiving <https://ci-builds.apache.org/job/ActiveMQ/job/ActiveMQ-Artemis-Master-JDK8/ws/tests/compatibility-tests/pom.xml>
to org.apache.activemq.tests/compatibility-tests/2.17.0-SNAPSHOT/compatibility-tests-2.17.0-SNAPSHOT.pom
[JENKINS] Archiving <https://ci-builds.apache.org/job/ActiveMQ/job/ActiveMQ-Artemis-Master-JDK8/ws/artemis-jms-client/pom.xml>
to org.apache.activemq/artemis-jms-client/2.17.0-SNAPSHOT/artemis-jms-client-2.17.0-SNAPSHOT.pom
[JENKINS] Archiving <https://ci-builds.apache.org/job/ActiveMQ/job/ActiveMQ-Artemis-Master-JDK8/ws/artemis-jms-client/target/artemis-jms-client-2.17.0-SNAPSHOT.jar>
to org.apache.activemq/artemis-jms-client/2.17.0-SNAPSHOT/artemis-jms-client-2.17.0-SNAPSHOT.jar
[JENKINS] Archiving <https://ci-builds.apache.org/job/ActiveMQ/job/ActiveMQ-Artemis-Master-JDK8/ws/artemis-jms-client/target/artemis-jms-client-2.17.0-SNAPSHOT-sources.jar>
to org.apache.activemq/artemis-jms-client/2.17.0-SNAPSHOT/artemis-jms-client-2.17.0-SNAPSHOT-sources.jar
[JENKINS] Archiving <https://ci-builds.apache.org/job/ActiveMQ/job/ActiveMQ-Artemis-Master-JDK8/ws/artemis-hawtio/activemq-branding/pom.xml>
to org.apache.activemq/activemq-branding/2.17.0-SNAPSHOT/activemq-branding-2.17.0-SNAPSHOT.pom
[JENKINS] Archiving <https://ci-builds.apache.org/job/ActiveMQ/job/ActiveMQ-Artemis-Master-JDK8/ws/tests/smoke-tests/pom.xml>
to org.apache.activemq.tests/smoke-tests/2.17.0-SNAPSHOT/smoke-tests-2.17.0-SNAPSHOT.pom
[JENKINS] Archiving <https://ci-builds.apache.org/job/ActiveMQ/job/ActiveMQ-Artemis-Master-JDK8/ws/tests/joram-tests/pom.xml>
to org.apache.activemq.tests/joram-tests/2.17.0-SNAPSHOT/joram-tests-2.17.0-SNAPSHOT.pom
[JENKINS] Archiving <https://ci-builds.apache.org/job/ActiveMQ/job/ActiveMQ-Artemis-Master-JDK8/ws/artemis-jms-server/pom.xml>
to org.apache.activemq/artemis-jms-server/2.17.0-SNAPSHOT/artemis-jms-server-2.17.0-SNAPSHOT.pom
[JENKINS] Archiving <https://ci-builds.apache.org/job/ActiveMQ/job/ActiveMQ-Artemis-Master-JDK8/ws/artemis-jms-server/target/artemis-jms-server-2.17.0-SNAPSHOT.jar>
to org.apache.activemq/artemis-jms-server/2.17.0-SNAPSHOT/artemis-jms-server-2.17.0-SNAPSHOT.jar
[JENKINS] Archiving <https://ci-builds.apache.org/job/ActiveMQ/job/ActiveMQ-Artemis-Master-JDK8/ws/artemis-jms-server/target/artemis-jms-server-2.17.0-SNAPSHOT-sources.jar>
to org.apache.activemq/artemis-jms-server/2.17.0-SNAPSHOT/artemis-jms-server-2.17.0-SNAPSHOT-sources.jar
[JENKINS] Archiving <https://ci-builds.apache.org/job/ActiveMQ/job/ActiveMQ-Artemis-Master-JDK8/ws/artemis-cli/pom.xml>
to org.apache.activemq/artemis-cli/2.17.0-SNAPSHOT/artemis-cli-2.17.0-SNAPSHOT.pom
[JENKINS] Archiving <https://ci-builds.apache.org/job/ActiveMQ/job/ActiveMQ-Artemis-Master-JDK8/ws/artemis-core-client-all/pom.xml>
to org.apache.activemq/artemis-core-client-all/2.17.0-SNAPSHOT/artemis-core-client-all-2.17.0-SNAPSHOT.pom
[JENKINS] Archiving <https://ci-builds.apache.org/job/ActiveMQ/job/ActiveMQ-Artemis-Master-JDK8/ws/tests/pom.xml>
to org.apache.activemq.tests/artemis-tests-pom/2.17.0-SNAPSHOT/artemis-tests-pom-2.17.0-SNAPSHOT.pom
[JENKINS] Archiving <https://ci-builds.apache.org/job/ActiveMQ/job/ActiveMQ-Artemis-Master-JDK8/ws/artemis-protocols/artemis-openwire-protocol/pom.xml>
to org.apache.activemq/artemis-openwire-protocol/2.17.0-SNAPSHOT/artemis-openwire-protocol-2.17.0-SNAPSHOT.pom
[JENKINS] Archiving <https://ci-builds.apache.org/job/ActiveMQ/job/ActiveMQ-Artemis-Master-JDK8/ws/artemis-protocols/artemis-openwire-protocol/target/artemis-openwire-protocol-2.17.0-SNAPSHOT.jar>
to org.apache.activemq/artemis-openwire-protocol/2.17.0-SNAPSHOT/artemis-openwire-protocol-2.17.0-SNAPSHOT.jar
[JENKINS] Archiving <https://ci-builds.apache.org/job/ActiveMQ/job/ActiveMQ-Artemis-Master-JDK8/ws/artemis-protocols/artemis-openwire-protocol/target/artemis-openwire-protocol-2.17.0-SNAPSHOT-sources.jar>
to org.apache.activemq/artemis-openwire-protocol/2.17.0-SNAPSHOT/artemis-openwire-protocol-2.17.0-SNAPSHOT-sources.jar
[Fast Archiver] Compressed 1.39 MB of artifacts by 85.6% relative to #196
[JENKINS] Archiving <https://ci-builds.apache.org/job/ActiveMQ/job/ActiveMQ-Artemis-Master-JDK8/ws/artemis-distribution/pom.xml>
to org.apache.activemq/apache-artemis/2.17.0-SNAPSHOT/apache-artemis-2.17.0-SNAPSHOT.pom
[JENKINS] Archiving <https://ci-builds.apache.org/job/ActiveMQ/job/ActiveMQ-Artemis-Master-JDK8/ws/artemis-hawtio/artemis-console/pom.xml>
to org.apache.activemq/artemis-console/2.17.0-SNAPSHOT/artemis-console-2.17.0-SNAPSHOT.pom
[JENKINS] Archiving <https://ci-builds.apache.org/job/ActiveMQ/job/ActiveMQ-Artemis-Master-JDK8/ws/tests/artemis-test-support/pom.xml>
to org.apache.activemq.tests/artemis-test-support/2.17.0-SNAPSHOT/artemis-test-support-2.17.0-SNAPSHOT.pom
[JENKINS] Archiving <https://ci-builds.apache.org/job/ActiveMQ/job/ActiveMQ-Artemis-Master-JDK8/ws/artemis-selector/pom.xml>
to org.apache.activemq/artemis-selector/2.17.0-SNAPSHOT/artemis-selector-2.17.0-SNAPSHOT.pom
[JENKINS] Archiving <https://ci-builds.apache.org/job/ActiveMQ/job/ActiveMQ-Artemis-Master-JDK8/ws/artemis-selector/target/artemis-selector-2.17.0-SNAPSHOT.jar>
to org.apache.activemq/artemis-selector/2.17.0-SNAPSHOT/artemis-selector-2.17.0-SNAPSHOT.jar
[JENKINS] Archiving <https://ci-builds.apache.org/job/ActiveMQ/job/ActiveMQ-Artemis-Master-JDK8/ws/artemis-selector/target/artemis-selector-2.17.0-SNAPSHOT-sources.jar>
to org.apache.activemq/artemis-selector/2.17.0-SNAPSHOT/artemis-selector-2.17.0-SNAPSHOT-sources.jar
[JENKINS] Archiving <https://ci-builds.apache.org/job/ActiveMQ/job/ActiveMQ-Artemis-Master-JDK8/ws/artemis-jdbc-store/pom.xml>
to org.apache.activemq/artemis-jdbc-store/2.17.0-SNAPSHOT/artemis-jdbc-store-2.17.0-SNAPSHOT.pom
[JENKINS] Archiving <https://ci-builds.apache.org/job/ActiveMQ/job/ActiveMQ-Artemis-Master-JDK8/ws/artemis-jdbc-store/target/artemis-jdbc-store-2.17.0-SNAPSHOT.jar>
to org.apache.activemq/artemis-jdbc-store/2.17.0-SNAPSHOT/artemis-jdbc-store-2.17.0-SNAPSHOT.jar
[JENKINS] Archiving <https://ci-builds.apache.org/job/ActiveMQ/job/ActiveMQ-Artemis-Master-JDK8/ws/artemis-jdbc-store/target/artemis-jdbc-store-2.17.0-SNAPSHOT-sources.jar>
to org.apache.activemq/artemis-jdbc-store/2.17.0-SNAPSHOT/artemis-jdbc-store-2.17.0-SNAPSHOT-sources.jar
[JENKINS] Archiving <https://ci-builds.apache.org/job/ActiveMQ/job/ActiveMQ-Artemis-Master-JDK8/ws/integration/activemq-spring-integration/pom.xml>
to org.apache.activemq/artemis-spring-integration/2.17.0-SNAPSHOT/artemis-spring-integration-2.17.0-SNAPSHOT.pom
[JENKINS] Archiving <https://ci-builds.apache.org/job/ActiveMQ/job/ActiveMQ-Artemis-Master-JDK8/ws/artemis-web/pom.xml>
to org.apache.activemq/artemis-web/2.17.0-SNAPSHOT/artemis-web-2.17.0-SNAPSHOT.pom
[JENKINS] Archiving <https://ci-builds.apache.org/job/ActiveMQ/job/ActiveMQ-Artemis-Master-JDK8/ws/artemis-cdi-client/pom.xml>
to org.apache.activemq/artemis-cdi-client/2.17.0-SNAPSHOT/artemis-cdi-client-2.17.0-SNAPSHOT.pom
[JENKINS] Archiving <https://ci-builds.apache.org/job/ActiveMQ/job/ActiveMQ-Artemis-Master-JDK8/ws/artemis-cdi-client/target/artemis-cdi-client-2.17.0-SNAPSHOT.jar>
to org.apache.activemq/artemis-cdi-client/2.17.0-SNAPSHOT/artemis-cdi-client-2.17.0-SNAPSHOT.jar
[JENKINS] Archiving <https://ci-builds.apache.org/job/ActiveMQ/job/ActiveMQ-Artemis-Master-JDK8/ws/artemis-cdi-client/target/artemis-cdi-client-2.17.0-SNAPSHOT-sources.jar>
to org.apache.activemq/artemis-cdi-client/2.17.0-SNAPSHOT/artemis-cdi-client-2.17.0-SNAPSHOT-sources.jar
[JENKINS] Archiving <https://ci-builds.apache.org/job/ActiveMQ/job/ActiveMQ-Artemis-Master-JDK8/ws/tests/jms-tests/pom.xml>
to org.apache.activemq.tests/jms-tests/2.17.0-SNAPSHOT/jms-tests-2.17.0-SNAPSHOT.pom
[JENKINS] Archiving <https://ci-builds.apache.org/job/ActiveMQ/job/ActiveMQ-Artemis-Master-JDK8/ws/artemis-ra/pom.xml>
to org.apache.activemq/artemis-ra/2.17.0-SNAPSHOT/artemis-ra-2.17.0-SNAPSHOT.pom
[JENKINS] Archiving <https://ci-builds.apache.org/job/ActiveMQ/job/ActiveMQ-Artemis-Master-JDK8/ws/pom.xml>
to org.apache.activemq/artemis-pom/2.17.0-SNAPSHOT/artemis-pom-2.17.0-SNAPSHOT.pom
[Fast Archiver] Compressed 80.40 KB of artifacts by 79.6% relative to #196
[JENKINS] Archiving <https://ci-builds.apache.org/job/ActiveMQ/job/ActiveMQ-Artemis-Master-JDK8/ws/artemis-tools/pom.xml>
to org.apache.activemq/artemis-tools/2.17.0-SNAPSHOT/artemis-tools-2.17.0-SNAPSHOT.pom
[JENKINS] Archiving <https://ci-builds.apache.org/job/ActiveMQ/job/ActiveMQ-Artemis-Master-JDK8/ws/artemis-tools/target/artemis-tools-2.17.0-SNAPSHOT.jar>
to org.apache.activemq/artemis-tools/2.17.0-SNAPSHOT/artemis-tools-2.17.0-SNAPSHOT.jar
[JENKINS] Archiving <https://ci-builds.apache.org/job/ActiveMQ/job/ActiveMQ-Artemis-Master-JDK8/ws/artemis-tools/target/artemis-tools-2.17.0-SNAPSHOT-sources.jar>
to org.apache.activemq/artemis-tools/2.17.0-SNAPSHOT/artemis-tools-2.17.0-SNAPSHOT-sources.jar
[JENKINS] Archiving <https://ci-builds.apache.org/job/ActiveMQ/job/ActiveMQ-Artemis-Master-JDK8/ws/tests/karaf-client-integration-tests/pom.xml>
to org.apache.activemq.tests/karaf-client-integration-tests/2.17.0-SNAPSHOT/karaf-client-integration-tests-2.17.0-SNAPSHOT.pom
[JENKINS] Archiving <https://ci-builds.apache.org/job/ActiveMQ/job/ActiveMQ-Artemis-Master-JDK8/ws/artemis-maven-plugin/pom.xml>
to org.apache.activemq/artemis-maven-plugin/2.17.0-SNAPSHOT/artemis-maven-plugin-2.17.0-SNAPSHOT.pom
[JENKINS] Archiving <https://ci-builds.apache.org/job/ActiveMQ/job/ActiveMQ-Artemis-Master-JDK8/ws/artemis-junit/pom.xml>
to org.apache.activemq/artemis-junit/2.17.0-SNAPSHOT/artemis-junit-2.17.0-SNAPSHOT.pom
[JENKINS] Archiving <https://ci-builds.apache.org/job/ActiveMQ/job/ActiveMQ-Artemis-Master-JDK8/ws/artemis-junit/target/artemis-junit-2.17.0-SNAPSHOT.jar>
to org.apache.activemq/artemis-junit/2.17.0-SNAPSHOT/artemis-junit-2.17.0-SNAPSHOT.jar
[JENKINS] Archiving <https://ci-builds.apache.org/job/ActiveMQ/job/ActiveMQ-Artemis-Master-JDK8/ws/artemis-junit/target/artemis-junit-2.17.0-SNAPSHOT-sources.jar>
to org.apache.activemq/artemis-junit/2.17.0-SNAPSHOT/artemis-junit-2.17.0-SNAPSHOT-sources.jar
[JENKINS] Archiving <https://ci-builds.apache.org/job/ActiveMQ/job/ActiveMQ-Artemis-Master-JDK8/ws/artemis-service-extensions/pom.xml>
to org.apache.activemq/artemis-service-extensions/2.17.0-SNAPSHOT/artemis-service-extensions-2.17.0-SNAPSHOT.pom
[JENKINS] Archiving <https://ci-builds.apache.org/job/ActiveMQ/job/ActiveMQ-Artemis-Master-JDK8/ws/artemis-service-extensions/target/artemis-service-extensions-2.17.0-SNAPSHOT.jar>
to org.apache.activemq/artemis-service-extensions/2.17.0-SNAPSHOT/artemis-service-extensions-2.17.0-SNAPSHOT.jar
[JENKINS] Archiving <https://ci-builds.apache.org/job/ActiveMQ/job/ActiveMQ-Artemis-Master-JDK8/ws/artemis-service-extensions/target/artemis-service-extensions-2.17.0-SNAPSHOT-sources.jar>
to org.apache.activemq/artemis-service-extensions/2.17.0-SNAPSHOT/artemis-service-extensions-2.17.0-SNAPSHOT-sources.jar
[JENKINS] Archiving <https://ci-builds.apache.org/job/ActiveMQ/job/ActiveMQ-Artemis-Master-JDK8/ws/artemis-server-osgi/pom.xml>
to org.apache.activemq/artemis-server-osgi/2.17.0-SNAPSHOT/artemis-server-osgi-2.17.0-SNAPSHOT.pom
[JENKINS] Archiving <https://ci-builds.apache.org/job/ActiveMQ/job/ActiveMQ-Artemis-Master-JDK8/ws/tests/unit-tests/pom.xml>
to org.apache.activemq.tests/unit-tests/2.17.0-SNAPSHOT/unit-tests-2.17.0-SNAPSHOT.pom
[JENKINS] Archiving <https://ci-builds.apache.org/job/ActiveMQ/job/ActiveMQ-Artemis-Master-JDK8/ws/artemis-protocols/artemis-stomp-protocol/pom.xml>
to org.apache.activemq/artemis-stomp-protocol/2.17.0-SNAPSHOT/artemis-stomp-protocol-2.17.0-SNAPSHOT.pom
[JENKINS] Archiving <https://ci-builds.apache.org/job/ActiveMQ/job/ActiveMQ-Artemis-Master-JDK8/ws/artemis-protocols/artemis-stomp-protocol/target/artemis-stomp-protocol-2.17.0-SNAPSHOT.jar>
to org.apache.activemq/artemis-stomp-protocol/2.17.0-SNAPSHOT/artemis-stomp-protocol-2.17.0-SNAPSHOT.jar
[JENKINS] Archiving <https://ci-builds.apache.org/job/ActiveMQ/job/ActiveMQ-Artemis-Master-JDK8/ws/artemis-protocols/artemis-stomp-protocol/target/artemis-stomp-protocol-2.17.0-SNAPSHOT-sources.jar>
to org.apache.activemq/artemis-stomp-protocol/2.17.0-SNAPSHOT/artemis-stomp-protocol-2.17.0-SNAPSHOT-sources.jar
[JENKINS] Archiving <https://ci-builds.apache.org/job/ActiveMQ/job/ActiveMQ-Artemis-Master-JDK8/ws/artemis-rest/pom.xml>
to org.apache.activemq.rest/artemis-rest/2.17.0-SNAPSHOT/artemis-rest-2.17.0-SNAPSHOT.pom
[JENKINS] Archiving <https://ci-builds.apache.org/job/ActiveMQ/job/ActiveMQ-Artemis-Master-JDK8/ws/artemis-protocols/artemis-hornetq-protocol/pom.xml>
to org.apache.activemq/artemis-hornetq-protocol/2.17.0-SNAPSHOT/artemis-hornetq-protocol-2.17.0-SNAPSHOT.pom
[JENKINS] Archiving <https://ci-builds.apache.org/job/ActiveMQ/job/ActiveMQ-Artemis-Master-JDK8/ws/artemis-protocols/artemis-hornetq-protocol/target/artemis-hornetq-protocol-2.17.0-SNAPSHOT.jar>
to org.apache.activemq/artemis-hornetq-protocol/2.17.0-SNAPSHOT/artemis-hornetq-protocol-2.17.0-SNAPSHOT.jar
[JENKINS] Archiving <https://ci-builds.apache.org/job/ActiveMQ/job/ActiveMQ-Artemis-Master-JDK8/ws/artemis-protocols/artemis-hornetq-protocol/target/artemis-hornetq-protocol-2.17.0-SNAPSHOT-sources.jar>
to org.apache.activemq/artemis-hornetq-protocol/2.17.0-SNAPSHOT/artemis-hornetq-protocol-2.17.0-SNAPSHOT-sources.jar
[JENKINS] Archiving <https://ci-builds.apache.org/job/ActiveMQ/job/ActiveMQ-Artemis-Master-JDK8/ws/artemis-core-client-osgi/pom.xml>
to org.apache.activemq/artemis-core-client-osgi/2.17.0-SNAPSHOT/artemis-core-client-osgi-2.17.0-SNAPSHOT.pom
[JENKINS] Archiving <https://ci-builds.apache.org/job/ActiveMQ/job/ActiveMQ-Artemis-Master-JDK8/ws/tests/performance-tests/pom.xml>
to org.apache.activemq.tests/performance-tests/2.17.0-SNAPSHOT/performance-tests-2.17.0-SNAPSHOT.pom
[JENKINS] Archiving <https://ci-builds.apache.org/job/ActiveMQ/job/ActiveMQ-Artemis-Master-JDK8/ws/artemis-features/pom.xml>
to org.apache.activemq/artemis-features/2.17.0-SNAPSHOT/artemis-features-2.17.0-SNAPSHOT.pom
[JENKINS] Archiving <https://ci-builds.apache.org/job/ActiveMQ/job/ActiveMQ-Artemis-Master-JDK8/ws/artemis-commons/pom.xml>
to org.apache.activemq/artemis-commons/2.17.0-SNAPSHOT/artemis-commons-2.17.0-SNAPSHOT.pom
[JENKINS] Archiving <https://ci-builds.apache.org/job/ActiveMQ/job/ActiveMQ-Artemis-Master-JDK8/ws/artemis-commons/target/artemis-commons-2.17.0-SNAPSHOT.jar>
to org.apache.activemq/artemis-commons/2.17.0-SNAPSHOT/artemis-commons-2.17.0-SNAPSHOT.jar
[JENKINS] Archiving <https://ci-builds.apache.org/job/ActiveMQ/job/ActiveMQ-Artemis-Master-JDK8/ws/artemis-commons/target/artemis-commons-2.17.0-SNAPSHOT-tests.jar>
to org.apache.activemq/artemis-commons/2.17.0-SNAPSHOT/artemis-commons-2.17.0-SNAPSHOT-tests.jar
[JENKINS] Archiving <https://ci-builds.apache.org/job/ActiveMQ/job/ActiveMQ-Artemis-Master-JDK8/ws/artemis-commons/target/artemis-commons-2.17.0-SNAPSHOT-sources.jar>
to org.apache.activemq/artemis-commons/2.17.0-SNAPSHOT/artemis-commons-2.17.0-SNAPSHOT-sources.jar
[JENKINS] Archiving <https://ci-builds.apache.org/job/ActiveMQ/job/ActiveMQ-Artemis-Master-JDK8/ws/artemis-journal/pom.xml>
to org.apache.activemq/artemis-journal/2.17.0-SNAPSHOT/artemis-journal-2.17.0-SNAPSHOT.pom
[JENKINS] Archiving <https://ci-builds.apache.org/job/ActiveMQ/job/ActiveMQ-Artemis-Master-JDK8/ws/artemis-journal/target/artemis-journal-2.17.0-SNAPSHOT.jar>
to org.apache.activemq/artemis-journal/2.17.0-SNAPSHOT/artemis-journal-2.17.0-SNAPSHOT.jar
[JENKINS] Archiving <https://ci-builds.apache.org/job/ActiveMQ/job/ActiveMQ-Artemis-Master-JDK8/ws/artemis-journal/target/artemis-journal-2.17.0-SNAPSHOT-sources.jar>
to org.apache.activemq/artemis-journal/2.17.0-SNAPSHOT/artemis-journal-2.17.0-SNAPSHOT-sources.jar
[JENKINS] Archiving <https://ci-builds.apache.org/job/ActiveMQ/job/ActiveMQ-Artemis-Master-JDK8/ws/tests/soak-tests/pom.xml>
to org.apache.activemq.tests/soak-tests/2.17.0-SNAPSHOT/soak-tests-2.17.0-SNAPSHOT.pom
[JENKINS] Archiving <https://ci-builds.apache.org/job/ActiveMQ/job/ActiveMQ-Artemis-Master-JDK8/ws/artemis-core-client/pom.xml>
to org.apache.activemq/artemis-core-client/2.17.0-SNAPSHOT/artemis-core-client-2.17.0-SNAPSHOT.pom
[JENKINS] Archiving <https://ci-builds.apache.org/job/ActiveMQ/job/ActiveMQ-Artemis-Master-JDK8/ws/artemis-core-client/target/artemis-core-client-2.17.0-SNAPSHOT.jar>
to org.apache.activemq/artemis-core-client/2.17.0-SNAPSHOT/artemis-core-client-2.17.0-SNAPSHOT.jar
[JENKINS] Archiving <https://ci-builds.apache.org/job/ActiveMQ/job/ActiveMQ-Artemis-Master-JDK8/ws/artemis-core-client/target/artemis-core-client-2.17.0-SNAPSHOT-tests.jar>
to org.apache.activemq/artemis-core-client/2.17.0-SNAPSHOT/artemis-core-client-2.17.0-SNAPSHOT-tests.jar
[JENKINS] Archiving <https://ci-builds.apache.org/job/ActiveMQ/job/ActiveMQ-Artemis-Master-JDK8/ws/artemis-core-client/target/artemis-core-client-2.17.0-SNAPSHOT-sources.jar>
to org.apache.activemq/artemis-core-client/2.17.0-SNAPSHOT/artemis-core-client-2.17.0-SNAPSHOT-sources.jar
[JENKINS] Archiving <https://ci-builds.apache.org/job/ActiveMQ/job/ActiveMQ-Artemis-Master-JDK8/ws/tests/timing-tests/pom.xml>
to org.apache.activemq.tests/timing-tests/2.17.0-SNAPSHOT/timing-tests-2.17.0-SNAPSHOT.pom
[JENKINS] Archiving <https://ci-builds.apache.org/job/ActiveMQ/job/ActiveMQ-Artemis-Master-JDK8/ws/tests/extra-tests/pom.xml>
to org.apache.activemq.tests/extra-tests/2.17.0-SNAPSHOT/extra-tests-2.17.0-SNAPSHOT.pom
[JENKINS] Archiving <https://ci-builds.apache.org/job/ActiveMQ/job/ActiveMQ-Artemis-Master-JDK8/ws/artemis-jms-client-all/pom.xml>
to org.apache.activemq/artemis-jms-client-all/2.17.0-SNAPSHOT/artemis-jms-client-all-2.17.0-SNAPSHOT.pom
[JENKINS] Archiving <https://ci-builds.apache.org/job/ActiveMQ/job/ActiveMQ-Artemis-Master-JDK8/ws/artemis-protocols/pom.xml>
to org.apache.activemq/artemis-protocols/2.17.0-SNAPSHOT/artemis-protocols-2.17.0-SNAPSHOT.pom
[JENKINS] Archiving <https://ci-builds.apache.org/job/ActiveMQ/job/ActiveMQ-Artemis-Master-JDK8/ws/artemis-hawtio/artemis-plugin/pom.xml>
to org.apache.activemq/artemis-plugin/2.17.0-SNAPSHOT/artemis-plugin-2.17.0-SNAPSHOT.pom
[JENKINS] Archiving <https://ci-builds.apache.org/job/ActiveMQ/job/ActiveMQ-Artemis-Master-JDK8/ws/artemis-dto/pom.xml>
to org.apache.activemq/artemis-dto/2.17.0-SNAPSHOT/artemis-dto-2.17.0-SNAPSHOT.pom
[JENKINS] Archiving <https://ci-builds.apache.org/job/ActiveMQ/job/ActiveMQ-Artemis-Master-JDK8/ws/artemis-dto/target/artemis-dto-2.17.0-SNAPSHOT.jar>
to org.apache.activemq/artemis-dto/2.17.0-SNAPSHOT/artemis-dto-2.17.0-SNAPSHOT.jar
[JENKINS] Archiving <https://ci-builds.apache.org/job/ActiveMQ/job/ActiveMQ-Artemis-Master-JDK8/ws/artemis-dto/target/artemis-dto-2.17.0-SNAPSHOT-sources.jar>
to org.apache.activemq/artemis-dto/2.17.0-SNAPSHOT/artemis-dto-2.17.0-SNAPSHOT-sources.jar
[JENKINS] Archiving <https://ci-builds.apache.org/job/ActiveMQ/job/ActiveMQ-Artemis-Master-JDK8/ws/artemis-protocols/artemis-hqclient-protocol/pom.xml>
to org.apache.activemq/artemis-hqclient-protocol/2.17.0-SNAPSHOT/artemis-hqclient-protocol-2.17.0-SNAPSHOT.pom
[JENKINS] Archiving <https://ci-builds.apache.org/job/ActiveMQ/job/ActiveMQ-Artemis-Master-JDK8/ws/artemis-protocols/artemis-hqclient-protocol/target/artemis-hqclient-protocol-2.17.0-SNAPSHOT.jar>
to org.apache.activemq/artemis-hqclient-protocol/2.17.0-SNAPSHOT/artemis-hqclient-protocol-2.17.0-SNAPSHOT.jar
[JENKINS] Archiving <https://ci-builds.apache.org/job/ActiveMQ/job/ActiveMQ-Artemis-Master-JDK8/ws/artemis-protocols/artemis-hqclient-protocol/target/artemis-hqclient-protocol-2.17.0-SNAPSHOT-sources.jar>
to org.apache.activemq/artemis-hqclient-protocol/2.17.0-SNAPSHOT/artemis-hqclient-protocol-2.17.0-SNAPSHOT-sources.jar
[JENKINS] Archiving <https://ci-builds.apache.org/job/ActiveMQ/job/ActiveMQ-Artemis-Master-JDK8/ws/artemis-jms-client-osgi/pom.xml>
to org.apache.activemq/artemis-jms-client-osgi/2.17.0-SNAPSHOT/artemis-jms-client-osgi-2.17.0-SNAPSHOT.pom
[JENKINS] Archiving <https://ci-builds.apache.org/job/ActiveMQ/job/ActiveMQ-Artemis-Master-JDK8/ws/tests/integration-tests/pom.xml>
to org.apache.activemq.tests/integration-tests/2.17.0-SNAPSHOT/integration-tests-2.17.0-SNAPSHOT.pom
[JENKINS] Archiving <https://ci-builds.apache.org/job/ActiveMQ/job/ActiveMQ-Artemis-Master-JDK8/ws/artemis-boot/pom.xml>
to org.apache.activemq/artemis-boot/2.17.0-SNAPSHOT/artemis-boot-2.17.0-SNAPSHOT.pom
[JENKINS] Archiving <https://ci-builds.apache.org/job/ActiveMQ/job/ActiveMQ-Artemis-Master-JDK8/ws/artemis-boot/target/artemis-boot-2.17.0-SNAPSHOT.jar>
to org.apache.activemq/artemis-boot/2.17.0-SNAPSHOT/artemis-boot-2.17.0-SNAPSHOT.jar
[JENKINS] Archiving <https://ci-builds.apache.org/job/ActiveMQ/job/ActiveMQ-Artemis-Master-JDK8/ws/artemis-boot/target/artemis-boot-2.17.0-SNAPSHOT-sources.jar>
to org.apache.activemq/artemis-boot/2.17.0-SNAPSHOT/artemis-boot-2.17.0-SNAPSHOT-sources.jar
[JENKINS] Archiving <https://ci-builds.apache.org/job/ActiveMQ/job/ActiveMQ-Artemis-Master-JDK8/ws/artemis-website/pom.xml>
to org.apache.activemq/artemis-website/2.17.0-SNAPSHOT/artemis-website-2.17.0-SNAPSHOT.pom
[JENKINS] Archiving <https://ci-builds.apache.org/job/ActiveMQ/job/ActiveMQ-Artemis-Master-JDK8/ws/artemis-protocols/artemis-amqp-protocol/pom.xml>
to org.apache.activemq/artemis-amqp-protocol/2.17.0-SNAPSHOT/artemis-amqp-protocol-2.17.0-SNAPSHOT.pom
[JENKINS] Archiving <https://ci-builds.apache.org/job/ActiveMQ/job/ActiveMQ-Artemis-Master-JDK8/ws/artemis-protocols/artemis-amqp-protocol/target/artemis-amqp-protocol-2.17.0-SNAPSHOT.jar>
to org.apache.activemq/artemis-amqp-protocol/2.17.0-SNAPSHOT/artemis-amqp-protocol-2.17.0-SNAPSHOT.jar
[JENKINS] Archiving <https://ci-builds.apache.org/job/ActiveMQ/job/ActiveMQ-Artemis-Master-JDK8/ws/artemis-protocols/artemis-amqp-protocol/target/artemis-amqp-protocol-2.17.0-SNAPSHOT-sources.jar>
to org.apache.activemq/artemis-amqp-protocol/2.17.0-SNAPSHOT/artemis-amqp-protocol-2.17.0-SNAPSHOT-sources.jar
[JENKINS] Archiving <https://ci-builds.apache.org/job/ActiveMQ/job/ActiveMQ-Artemis-Master-JDK8/ws/artemis-protocols/artemis-mqtt-protocol/pom.xml>
to org.apache.activemq/artemis-mqtt-protocol/2.17.0-SNAPSHOT/artemis-mqtt-protocol-2.17.0-SNAPSHOT.pom
[JENKINS] Archiving <https://ci-builds.apache.org/job/ActiveMQ/job/ActiveMQ-Artemis-Master-JDK8/ws/artemis-protocols/artemis-mqtt-protocol/target/artemis-mqtt-protocol-2.17.0-SNAPSHOT.jar>
to org.apache.activemq/artemis-mqtt-protocol/2.17.0-SNAPSHOT/artemis-mqtt-protocol-2.17.0-SNAPSHOT.jar
[JENKINS] Archiving <https://ci-builds.apache.org/job/ActiveMQ/job/ActiveMQ-Artemis-Master-JDK8/ws/artemis-protocols/artemis-mqtt-protocol/target/artemis-mqtt-protocol-2.17.0-SNAPSHOT-sources.jar>
to org.apache.activemq/artemis-mqtt-protocol/2.17.0-SNAPSHOT/artemis-mqtt-protocol-2.17.0-SNAPSHOT-sources.jar
[JENKINS] Archiving <https://ci-builds.apache.org/job/ActiveMQ/job/ActiveMQ-Artemis-Master-JDK8/ws/artemis-hawtio/pom.xml>
to org.apache.activemq/artemis-hawtio-pom/2.17.0-SNAPSHOT/artemis-hawtio-pom-2.17.0-SNAPSHOT.pom
[JENKINS] Archiving <https://ci-builds.apache.org/job/ActiveMQ/job/ActiveMQ-Artemis-Master-JDK8/ws/tests/stress-tests/pom.xml>
to org.apache.activemq.tests/stress-tests/2.17.0-SNAPSHOT/stress-tests-2.17.0-SNAPSHOT.pom
channel stopped

Mime
View raw message