activemq-commits mailing list archives

Site index · List index
Message view « Date » · « Thread »
Top « Date » · « Thread »
From Apache Jenkins Server <jenk...@builds.apache.org>
Subject Build failed in Jenkins: ActiveMQ » ActiveMQ-Artemis-Master-JDK8 #49
Date Thu, 24 Sep 2020 18:46:01 GMT
See <https://ci-builds.apache.org/job/ActiveMQ/job/ActiveMQ-Artemis-Master-JDK8/49/display/redirect?page=changes>

Changes:

[Clebert Suconic] ARTEMIS-2768 - add warning if wildcard subscription does not have a matching
page-store-name address setting


------------------------------------------
[...truncated 412.51 KB...]
[main] 18:41:15,555 INFO  [org.apache.activemq.artemis.tests.util.ActiveMQTestBase] **** end
#test shouldOtherAcquireExpiredLock[create_tables_prior_test=false]() ***
[main] 18:41:15,555 INFO  [org.apache.activemq.artemis.tests.util.ActiveMQTestBase] **** start
#test shouldRenewAcquiredLock[create_tables_prior_test=false]() ***
[main] 18:41:23,170 INFO  [org.apache.activemq.artemis.tests.util.ActiveMQTestBase] **** end
#test shouldRenewAcquiredLock[create_tables_prior_test=false]() ***
[main] 18:41:23,171 INFO  [org.apache.activemq.artemis.tests.util.ActiveMQTestBase] **** start
#test shouldAcquireLock[create_tables_prior_test=false]() ***
[main] 18:41:31,944 INFO  [org.apache.activemq.artemis.tests.util.ActiveMQTestBase] **** end
#test shouldAcquireLock[create_tables_prior_test=false]() ***
[main] 18:41:31,944 INFO  [org.apache.activemq.artemis.tests.util.ActiveMQTestBase] **** start
#test shouldNotAcquireLockTwice[create_tables_prior_test=false]() ***
[main] 18:41:40,453 INFO  [org.apache.activemq.artemis.tests.util.ActiveMQTestBase] **** end
#test shouldNotAcquireLockTwice[create_tables_prior_test=false]() ***
[main] 18:41:40,454 INFO  [org.apache.activemq.artemis.tests.util.ActiveMQTestBase] **** start
#test shouldAcquireExpiredLock[create_tables_prior_test=false]() ***
[main] 18:41:52,301 INFO  [org.apache.activemq.artemis.tests.util.ActiveMQTestBase] **** end
#test shouldAcquireExpiredLock[create_tables_prior_test=false]() ***
[INFO] Tests run: 20, Failures: 0, Errors: 0, Skipped: 0, Time elapsed: 205.37 s - in org.apache.activemq.artemis.core.server.impl.jdbc.JdbcLeaseLockTest
[INFO] Running org.apache.activemq.artemis.core.server.impl.jdbc.JdbcNodeManagerTest
[main] 18:41:52,309 INFO  [org.apache.activemq.artemis.tests.util.ActiveMQTestBase] **** start
#test shouldStartAndStopGracefullyTest[authentication = false]() ***
[main] 18:41:59,289 WARN  [org.apache.activemq.artemis.jdbc.store.drivers.AbstractJDBCDriver]
Unable to set a network timeout on the JDBC connection: networkTimeoutExecutor is null
[main] 18:42:00,599 INFO  [org.apache.activemq.artemis.tests.util.ActiveMQTestBase] **** end
#test shouldStartAndStopGracefullyTest[authentication = false]() ***
[main] 18:42:00,600 INFO  [org.apache.activemq.artemis.tests.util.ActiveMQTestBase] **** start
#test shouldStartAndStopGracefullyTest[authentication = true]() ***
[main] 18:42:07,661 WARN  [org.apache.activemq.artemis.jdbc.store.drivers.AbstractJDBCDriver]
Unable to set a network timeout on the JDBC connection: networkTimeoutExecutor is null
[main] 18:42:09,041 INFO  [org.apache.activemq.artemis.tests.util.ActiveMQTestBase] **** end
#test shouldStartAndStopGracefullyTest[authentication = true]() ***
[INFO] Tests run: 2, Failures: 0, Errors: 0, Skipped: 0, Time elapsed: 16.734 s - in org.apache.activemq.artemis.core.server.impl.jdbc.JdbcNodeManagerTest
[INFO] Running org.apache.activemq.artemis.core.server.impl.jdbc.JdbcSharedStateManagerTest
[main] 18:42:09,045 INFO  [org.apache.activemq.artemis.tests.util.ActiveMQTestBase] **** start
#test shouldStartTwoIfTableNotExist() ***
[main] 18:42:17,763 INFO  [org.apache.activemq.artemis.tests.util.ActiveMQTestBase] **** end
#test shouldStartTwoIfTableNotExist() ***
[main] 18:42:17,764 INFO  [org.apache.activemq.artemis.tests.util.ActiveMQTestBase] **** start
#test shouldStartIfTableNotExist() ***
[main] 18:42:26,581 INFO  [org.apache.activemq.artemis.tests.util.ActiveMQTestBase] **** end
#test shouldStartIfTableNotExist() ***
[main] 18:42:26,582 INFO  [org.apache.activemq.artemis.tests.util.ActiveMQTestBase] **** start
#test shouldStartIfTableExistInitialized() ***
[main] 18:42:34,421 INFO  [org.apache.activemq.artemis.tests.util.ActiveMQTestBase] **** end
#test shouldStartIfTableExistInitialized() ***
[main] 18:42:34,421 INFO  [org.apache.activemq.artemis.tests.util.ActiveMQTestBase] **** start
#test shouldStartIfTableExistEmpty() ***
[main] 18:42:45,829 INFO  [org.apache.activemq.artemis.tests.util.ActiveMQTestBase] **** end
#test shouldStartIfTableExistEmpty() ***
[ERROR] Tests run: 4, Failures: 0, Errors: 1, Skipped: 0, Time elapsed: 36.789 s <<<
FAILURE! - in org.apache.activemq.artemis.core.server.impl.jdbc.JdbcSharedStateManagerTest
[ERROR] shouldStartIfTableExistEmpty(org.apache.activemq.artemis.core.server.impl.jdbc.JdbcSharedStateManagerTest)
 Time elapsed: 11.416 s  <<< ERROR!
java.lang.Exception: test timed out after 10000 milliseconds
	at org.apache.activemq.artemis.core.server.impl.jdbc.JdbcSharedStateManagerTest.shouldStartIfTableExistEmpty(JdbcSharedStateManagerTest.java:77)

[INFO] Running org.apache.activemq.artemis.core.server.journal.JournalStorageManagerConstantTest
[INFO] Tests run: 1, Failures: 0, Errors: 0, Skipped: 0, Time elapsed: 0 s - in org.apache.activemq.artemis.core.server.journal.JournalStorageManagerConstantTest
[INFO] Running org.apache.activemq.artemis.core.server.management.JMXAccessControlListTest
[INFO] Tests run: 15, Failures: 0, Errors: 0, Skipped: 0, Time elapsed: 0.002 s - in org.apache.activemq.artemis.core.server.management.JMXAccessControlListTest
[INFO] Running org.apache.activemq.artemis.core.server.protocol.websocket.WebSocketFrameEncoderTest
[INFO] Tests run: 4, Failures: 0, Errors: 0, Skipped: 0, Time elapsed: 1.324 s - in org.apache.activemq.artemis.core.server.protocol.websocket.WebSocketFrameEncoderTest
[INFO] Running org.apache.activemq.artemis.core.server.protocol.websocket.WebSocketServerHandlerTest
[INFO] Tests run: 3, Failures: 0, Errors: 0, Skipped: 0, Time elapsed: 0.339 s - in org.apache.activemq.artemis.core.server.protocol.websocket.WebSocketServerHandlerTest
[INFO] Running org.apache.activemq.artemis.core.settings.AddressSettingsTest
[main] 18:42:47,531 INFO  [org.apache.activemq.artemis.tests.util.ActiveMQTestBase] **** start
#test testMultipleMergeAll() ***
[main] 18:42:47,535 INFO  [org.apache.activemq.artemis.tests.util.ActiveMQTestBase] **** end
#test testMultipleMergeAll() ***
[main] 18:42:47,536 INFO  [org.apache.activemq.artemis.tests.util.ActiveMQTestBase] **** start
#test testMultipleMerge() ***
[main] 18:42:47,537 INFO  [org.apache.activemq.artemis.tests.util.ActiveMQTestBase] **** end
#test testMultipleMerge() ***
[main] 18:42:47,538 INFO  [org.apache.activemq.artemis.tests.util.ActiveMQTestBase] **** start
#test testDefaults() ***
[main] 18:42:47,539 INFO  [org.apache.activemq.artemis.tests.util.ActiveMQTestBase] **** end
#test testDefaults() ***
[main] 18:42:47,539 INFO  [org.apache.activemq.artemis.tests.util.ActiveMQTestBase] **** start
#test testSingleMerge() ***
[main] 18:42:47,541 INFO  [org.apache.activemq.artemis.tests.util.ActiveMQTestBase] **** end
#test testSingleMerge() ***
[INFO] Tests run: 4, Failures: 0, Errors: 0, Skipped: 0, Time elapsed: 0.01 s - in org.apache.activemq.artemis.core.settings.AddressSettingsTest
[INFO] Running org.apache.activemq.artemis.core.settings.RepositoryTest
[main] 18:42:47,545 INFO  [org.apache.activemq.artemis.tests.util.ActiveMQTestBase] **** start
#test testMultipleWildcards() ***
[main] 18:42:47,549 INFO  [org.apache.activemq.artemis.tests.util.ActiveMQTestBase] **** end
#test testMultipleWildcards() ***
[main] 18:42:47,550 INFO  [org.apache.activemq.artemis.tests.util.ActiveMQTestBase] **** start
#test testMatchingDocs() ***
[main] 18:42:47,552 INFO  [org.apache.activemq.artemis.tests.util.ActiveMQTestBase] **** end
#test testMatchingDocs() ***
[main] 18:42:47,552 INFO  [org.apache.activemq.artemis.tests.util.ActiveMQTestBase] **** start
#test testWithoutWildcard() ***
[main] 18:42:47,554 INFO  [org.apache.activemq.artemis.tests.util.ActiveMQTestBase] **** end
#test testWithoutWildcard() ***
[main] 18:42:47,554 INFO  [org.apache.activemq.artemis.tests.util.ActiveMQTestBase] **** start
#test testSingletwo() ***
[main] 18:42:47,556 INFO  [org.apache.activemq.artemis.tests.util.ActiveMQTestBase] **** end
#test testSingletwo() ***
[main] 18:42:47,556 INFO  [org.apache.activemq.artemis.tests.util.ActiveMQTestBase] **** start
#test testIllegalMatches() ***
[main] 18:42:47,558 INFO  [org.apache.activemq.artemis.tests.util.ActiveMQTestBase] **** end
#test testIllegalMatches() ***
[main] 18:42:47,559 INFO  [org.apache.activemq.artemis.tests.util.ActiveMQTestBase] **** start
#test testAddListener() ***
[main] 18:42:47,561 INFO  [org.apache.activemq.artemis.tests.util.ActiveMQTestBase] **** end
#test testAddListener() ***
[main] 18:42:47,561 INFO  [org.apache.activemq.artemis.tests.util.ActiveMQTestBase] **** start
#test testCacheWithWildcards() ***
[main] 18:42:47,563 INFO  [org.apache.activemq.artemis.tests.util.ActiveMQTestBase] **** end
#test testCacheWithWildcards() ***
[main] 18:42:47,564 INFO  [org.apache.activemq.artemis.tests.util.ActiveMQTestBase] **** start
#test testDefault() ***
[main] 18:42:47,565 INFO  [org.apache.activemq.artemis.tests.util.ActiveMQTestBase] **** end
#test testDefault() ***
[main] 18:42:47,565 INFO  [org.apache.activemq.artemis.tests.util.ActiveMQTestBase] **** start
#test testMatchingDocsCustomUnderscorDelimiter() ***
[main] 18:42:47,567 INFO  [org.apache.activemq.artemis.tests.util.ActiveMQTestBase] **** end
#test testMatchingDocsCustomUnderscorDelimiter() ***
[main] 18:42:47,568 INFO  [org.apache.activemq.artemis.tests.util.ActiveMQTestBase] **** start
#test testSingleMatch() ***
[main] 18:42:47,569 INFO  [org.apache.activemq.artemis.tests.util.ActiveMQTestBase] **** end
#test testSingleMatch() ***
[main] 18:42:47,570 INFO  [org.apache.activemq.artemis.tests.util.ActiveMQTestBase] **** start
#test testRepositoryMerge() ***
[main] 18:42:47,572 INFO  [org.apache.activemq.artemis.tests.util.ActiveMQTestBase] **** end
#test testRepositoryMerge() ***
[main] 18:42:47,573 INFO  [org.apache.activemq.artemis.tests.util.ActiveMQTestBase] **** start
#test testMatchingDocsCustomForwardSlashDelimiter() ***
[main] 18:42:47,575 INFO  [org.apache.activemq.artemis.tests.util.ActiveMQTestBase] **** end
#test testMatchingDocsCustomForwardSlashDelimiter() ***
[INFO] Tests run: 12, Failures: 0, Errors: 0, Skipped: 0, Time elapsed: 0.03 s - in org.apache.activemq.artemis.core.settings.RepositoryTest
[INFO] Running org.apache.activemq.artemis.core.transaction.impl.TransactionImplTest
[main] 18:42:47,578 INFO  [org.apache.activemq.artemis.tests.util.ActiveMQTestBase] **** start
#test testTimeoutThenRollbackWithRollback() ***
[main] 18:42:47,588 INFO  [org.apache.activemq.artemis.tests.util.ActiveMQTestBase] **** end
#test testTimeoutThenRollbackWithRollback() ***
[main] 18:42:47,589 INFO  [org.apache.activemq.artemis.tests.util.ActiveMQTestBase] **** start
#test testTimeoutAndThenCommitWithARollback() ***
[main] 18:42:47,592 INFO  [org.apache.activemq.artemis.tests.util.ActiveMQTestBase] **** end
#test testTimeoutAndThenCommitWithARollback() ***
[INFO] Tests run: 2, Failures: 0, Errors: 0, Skipped: 0, Time elapsed: 0.013 s - in org.apache.activemq.artemis.core.transaction.impl.TransactionImplTest
[INFO] Running org.apache.activemq.artemis.core.version.impl.VersionImplTest
[INFO] Tests run: 3, Failures: 0, Errors: 0, Skipped: 0, Time elapsed: 0.002 s - in org.apache.activemq.artemis.core.version.impl.VersionImplTest
[INFO] Running org.apache.activemq.artemis.spi.core.security.jaas.Krb5LoginModuleTest
[INFO] Tests run: 2, Failures: 0, Errors: 0, Skipped: 0, Time elapsed: 0 s - in org.apache.activemq.artemis.spi.core.security.jaas.Krb5LoginModuleTest
[INFO] Running org.apache.activemq.artemis.tests.util.SimpleStringTest
[INFO] Tests run: 20, Failures: 0, Errors: 0, Skipped: 0, Time elapsed: 0.677 s - in org.apache.activemq.artemis.tests.util.SimpleStringTest
[INFO] Running org.apache.activemq.artemis.uri.AcceptorParserTest
[INFO] Tests run: 3, Failures: 0, Errors: 0, Skipped: 0, Time elapsed: 0.003 s - in org.apache.activemq.artemis.uri.AcceptorParserTest
[INFO] Running org.apache.activemq.artemis.uri.ClusterConnectionConfigurationTest
[INFO] Tests run: 5, Failures: 0, Errors: 0, Skipped: 0, Time elapsed: 0.003 s - in org.apache.activemq.artemis.uri.ClusterConnectionConfigurationTest
[INFO] 
[INFO] Results:
[INFO] 
[ERROR] Errors: 
[ERROR]   JdbcSharedStateManagerTest.shouldStartIfTableExistEmpty:77 »  test timed out a...
[INFO] 
[ERROR] Tests run: 365, Failures: 0, Errors: 1, Skipped: 0
[INFO] 
[JENKINS] Recording test results
[INFO] ------------------------------------------------------------------------
[INFO] Reactor Summary for ActiveMQ Artemis Parent 2.16.0-SNAPSHOT:
[INFO] 
[INFO] ActiveMQ Artemis Parent ............................ SUCCESS [ 12.737 s]
[INFO] ActiveMQ Artemis Commons ........................... SUCCESS [ 58.381 s]
[INFO] ActiveMQ Artemis Core Client ....................... SUCCESS [ 29.529 s]
[INFO] ActiveMQ Artemis Selector Implementation ........... SUCCESS [ 10.944 s]
[INFO] ActiveMQ Artemis JMS Client ........................ SUCCESS [ 11.636 s]
[INFO] ActiveMQ Artemis Journal ........................... SUCCESS [ 10.283 s]
[INFO] ActiveMQ Artemis JDBC Store ........................ SUCCESS [ 46.297 s]
[INFO] ActiveMQ Artemis Server ............................ FAILURE [07:09 min]
[INFO] ActiveMQ Artemis Protocols ......................... SKIPPED
[INFO] ActiveMQ Artemis AMQP Protocol ..................... SKIPPED
[INFO] ActiveMQ Artemis STOMP Protocol .................... SKIPPED
[INFO] ActiveMQ Artemis OpenWire Protocol ................. SKIPPED
[INFO] ActiveMQ Artemis HQClient Protocol ................. SKIPPED
[INFO] ActiveMQ Artemis HornetQ Protocol .................. SKIPPED
[INFO] ActiveMQ Artemis Service Extensions ................ SKIPPED
[INFO] ActiveMQ Artemis JMS Server ........................ SKIPPED
[INFO] ActiveMQ Artemis JUnit Rules ....................... SKIPPED
[INFO] ActiveMQ Artemis MQTT Protocol ..................... SKIPPED
[INFO] ActiveMQ Artemis DTO ............................... SKIPPED
[INFO] ActiveMQ Artemis CDI Integration ................... SKIPPED
[INFO] ActiveMQ Artemis Boot .............................. SKIPPED
[INFO] ActiveMQ Artemis Tools ............................. SKIPPED
[INFO] ActiveMQ Artemis CLI ............................... SKIPPED
[INFO] ActiveMQ Artemis Web ............................... SKIPPED
[INFO] ActiveMQ Artemis Web ............................... SKIPPED
[INFO] ActiveMQ Artemis Core Client All ................... SKIPPED
[INFO] ActiveMQ Artemis Client OSGi ....................... SKIPPED
[INFO] ActiveMQ Artemis JMS Client All .................... SKIPPED
[INFO] ActiveMQ Artemis JMS Client OSGi ................... SKIPPED
[INFO] ActiveMQ Artemis RAR POM ........................... SKIPPED
[INFO] ActiveMQ Artemis REST Interface Implementation ..... SKIPPED
[INFO] ActiveMQ Artemis Maven Plugin ...................... SKIPPED
[INFO] ActiveMQ Artemis Server OSGi ....................... SKIPPED
[INFO] ActiveMQ Artemis Cons .............................. SKIPPED
[INFO] ActiveMQ Artemis HawtIO Branding ................... SKIPPED
[INFO] ActiveMQ Artemis HawtIO Plugin ..................... SKIPPED
[INFO] ActiveMQ Artemis Console ........................... SKIPPED
[INFO] ActiveMQ Artemis Spring Integration ................ SKIPPED
[INFO] Apache ActiveMQ Artemis Distribution ............... SKIPPED
[INFO] ActiveMQ Artemis Tests POM ......................... SKIPPED
[INFO] ActiveMQ Artemis Test Support ...................... SKIPPED
[INFO] ActiveMQ Artemis Unit Tests ........................ SKIPPED
[INFO] ActiveMQ Artemis Joram Tests ....................... SKIPPED
[INFO] ActiveMQ Artemis timing Tests ...................... SKIPPED
[INFO] ActiveMQ Artemis JMS Tests ......................... SKIPPED
[INFO] ActiveMQ Artemis Features .......................... SKIPPED
[INFO] ActiveMQ Artemis Integration Tests ................. SKIPPED
[INFO] ActiveMQ Artemis Client Integration Tests .......... SKIPPED
[INFO] ActiveMQ Artemis Compatibility Tests ............... SKIPPED
[INFO] ActiveMQ Artemis soak Tests ........................ SKIPPED
[INFO] ActiveMQ Artemis stress Tests ...................... SKIPPED
[INFO] ActiveMQ Artemis performance Tests ................. SKIPPED
[INFO] Smoke Tests ........................................ SKIPPED
[INFO] ActiveMQ Artemis Extra Tests ....................... SKIPPED
[INFO] ------------------------------------------------------------------------
[INFO] BUILD FAILURE
[INFO] ------------------------------------------------------------------------
[INFO] Total time:  11:48 min
[INFO] Finished at: 2020-09-24T18:43:55Z
[INFO] ------------------------------------------------------------------------
Waiting for Jenkins to finish collecting data
[ERROR] Failed to execute goal org.apache.maven.plugins:maven-surefire-plugin:2.22.2:test
(default-test) on project artemis-server: There are test failures.
[ERROR] 
[ERROR] Please refer to <https://ci-builds.apache.org/job/ActiveMQ/job/ActiveMQ-Artemis-Master-JDK8/ws/artemis-server/target/surefire-reports>
for the individual test results.
[ERROR] Please refer to dump files (if any exist) [date].dump, [date]-jvmRun[N].dump and [date].dumpstream.
[ERROR] -> [Help 1]
[ERROR] 
[ERROR] To see the full stack trace of the errors, re-run Maven with the -e switch.
[ERROR] Re-run Maven using the -X switch to enable full debug logging.
[ERROR] 
[ERROR] For more information about the errors and possible solutions, please read the following
articles:
[ERROR] [Help 1] http://cwiki.apache.org/confluence/display/MAVEN/MojoFailureException
[ERROR] 
[ERROR] After correcting the problems, you can resume the build with the command
[ERROR]   mvn <goals> -rf :artemis-server
[JENKINS] Archiving <https://ci-builds.apache.org/job/ActiveMQ/job/ActiveMQ-Artemis-Master-JDK8/ws/artemis-server/pom.xml>
to org.apache.activemq/artemis-server/2.16.0-SNAPSHOT/artemis-server-2.16.0-SNAPSHOT.pom
[JENKINS] Archiving <https://ci-builds.apache.org/job/ActiveMQ/job/ActiveMQ-Artemis-Master-JDK8/ws/tests/compatibility-tests/pom.xml>
to org.apache.activemq.tests/compatibility-tests/2.16.0-SNAPSHOT/compatibility-tests-2.16.0-SNAPSHOT.pom
[JENKINS] Archiving <https://ci-builds.apache.org/job/ActiveMQ/job/ActiveMQ-Artemis-Master-JDK8/ws/artemis-jms-client/pom.xml>
to org.apache.activemq/artemis-jms-client/2.16.0-SNAPSHOT/artemis-jms-client-2.16.0-SNAPSHOT.pom
[JENKINS] Archiving <https://ci-builds.apache.org/job/ActiveMQ/job/ActiveMQ-Artemis-Master-JDK8/ws/artemis-jms-client/target/artemis-jms-client-2.16.0-SNAPSHOT.jar>
to org.apache.activemq/artemis-jms-client/2.16.0-SNAPSHOT/artemis-jms-client-2.16.0-SNAPSHOT.jar
[JENKINS] Archiving <https://ci-builds.apache.org/job/ActiveMQ/job/ActiveMQ-Artemis-Master-JDK8/ws/artemis-jms-client/target/artemis-jms-client-2.16.0-SNAPSHOT-sources.jar>
to org.apache.activemq/artemis-jms-client/2.16.0-SNAPSHOT/artemis-jms-client-2.16.0-SNAPSHOT-sources.jar
[JENKINS] Archiving <https://ci-builds.apache.org/job/ActiveMQ/job/ActiveMQ-Artemis-Master-JDK8/ws/artemis-hawtio/activemq-branding/pom.xml>
to org.apache.activemq/activemq-branding/2.16.0-SNAPSHOT/activemq-branding-2.16.0-SNAPSHOT.pom
[JENKINS] Archiving <https://ci-builds.apache.org/job/ActiveMQ/job/ActiveMQ-Artemis-Master-JDK8/ws/tests/smoke-tests/pom.xml>
to org.apache.activemq.tests/smoke-tests/2.16.0-SNAPSHOT/smoke-tests-2.16.0-SNAPSHOT.pom
[JENKINS] Archiving <https://ci-builds.apache.org/job/ActiveMQ/job/ActiveMQ-Artemis-Master-JDK8/ws/tests/joram-tests/pom.xml>
to org.apache.activemq.tests/joram-tests/2.16.0-SNAPSHOT/joram-tests-2.16.0-SNAPSHOT.pom
[JENKINS] Archiving <https://ci-builds.apache.org/job/ActiveMQ/job/ActiveMQ-Artemis-Master-JDK8/ws/artemis-jms-server/pom.xml>
to org.apache.activemq/artemis-jms-server/2.16.0-SNAPSHOT/artemis-jms-server-2.16.0-SNAPSHOT.pom
[JENKINS] Archiving <https://ci-builds.apache.org/job/ActiveMQ/job/ActiveMQ-Artemis-Master-JDK8/ws/artemis-cli/pom.xml>
to org.apache.activemq/artemis-cli/2.16.0-SNAPSHOT/artemis-cli-2.16.0-SNAPSHOT.pom
[JENKINS] Archiving <https://ci-builds.apache.org/job/ActiveMQ/job/ActiveMQ-Artemis-Master-JDK8/ws/artemis-core-client-all/pom.xml>
to org.apache.activemq/artemis-core-client-all/2.16.0-SNAPSHOT/artemis-core-client-all-2.16.0-SNAPSHOT.pom
[JENKINS] Archiving <https://ci-builds.apache.org/job/ActiveMQ/job/ActiveMQ-Artemis-Master-JDK8/ws/tests/pom.xml>
to org.apache.activemq.tests/artemis-tests-pom/2.16.0-SNAPSHOT/artemis-tests-pom-2.16.0-SNAPSHOT.pom
[JENKINS] Archiving <https://ci-builds.apache.org/job/ActiveMQ/job/ActiveMQ-Artemis-Master-JDK8/ws/artemis-protocols/artemis-openwire-protocol/pom.xml>
to org.apache.activemq/artemis-openwire-protocol/2.16.0-SNAPSHOT/artemis-openwire-protocol-2.16.0-SNAPSHOT.pom
[JENKINS] Archiving <https://ci-builds.apache.org/job/ActiveMQ/job/ActiveMQ-Artemis-Master-JDK8/ws/artemis-distribution/pom.xml>
to org.apache.activemq/apache-artemis/2.16.0-SNAPSHOT/apache-artemis-2.16.0-SNAPSHOT.pom
[JENKINS] Archiving <https://ci-builds.apache.org/job/ActiveMQ/job/ActiveMQ-Artemis-Master-JDK8/ws/artemis-hawtio/artemis-console/pom.xml>
to org.apache.activemq/artemis-console/2.16.0-SNAPSHOT/artemis-console-2.16.0-SNAPSHOT.pom
[JENKINS] Archiving <https://ci-builds.apache.org/job/ActiveMQ/job/ActiveMQ-Artemis-Master-JDK8/ws/tests/artemis-test-support/pom.xml>
to org.apache.activemq.tests/artemis-test-support/2.16.0-SNAPSHOT/artemis-test-support-2.16.0-SNAPSHOT.pom
[JENKINS] Archiving <https://ci-builds.apache.org/job/ActiveMQ/job/ActiveMQ-Artemis-Master-JDK8/ws/artemis-selector/pom.xml>
to org.apache.activemq/artemis-selector/2.16.0-SNAPSHOT/artemis-selector-2.16.0-SNAPSHOT.pom
[JENKINS] Archiving <https://ci-builds.apache.org/job/ActiveMQ/job/ActiveMQ-Artemis-Master-JDK8/ws/artemis-selector/target/artemis-selector-2.16.0-SNAPSHOT.jar>
to org.apache.activemq/artemis-selector/2.16.0-SNAPSHOT/artemis-selector-2.16.0-SNAPSHOT.jar
[JENKINS] Archiving <https://ci-builds.apache.org/job/ActiveMQ/job/ActiveMQ-Artemis-Master-JDK8/ws/artemis-selector/target/artemis-selector-2.16.0-SNAPSHOT-sources.jar>
to org.apache.activemq/artemis-selector/2.16.0-SNAPSHOT/artemis-selector-2.16.0-SNAPSHOT-sources.jar
[JENKINS] Archiving <https://ci-builds.apache.org/job/ActiveMQ/job/ActiveMQ-Artemis-Master-JDK8/ws/artemis-jdbc-store/pom.xml>
to org.apache.activemq/artemis-jdbc-store/2.16.0-SNAPSHOT/artemis-jdbc-store-2.16.0-SNAPSHOT.pom
[JENKINS] Archiving <https://ci-builds.apache.org/job/ActiveMQ/job/ActiveMQ-Artemis-Master-JDK8/ws/artemis-jdbc-store/target/artemis-jdbc-store-2.16.0-SNAPSHOT.jar>
to org.apache.activemq/artemis-jdbc-store/2.16.0-SNAPSHOT/artemis-jdbc-store-2.16.0-SNAPSHOT.jar
[JENKINS] Archiving <https://ci-builds.apache.org/job/ActiveMQ/job/ActiveMQ-Artemis-Master-JDK8/ws/artemis-jdbc-store/target/artemis-jdbc-store-2.16.0-SNAPSHOT-sources.jar>
to org.apache.activemq/artemis-jdbc-store/2.16.0-SNAPSHOT/artemis-jdbc-store-2.16.0-SNAPSHOT-sources.jar
[JENKINS] Archiving <https://ci-builds.apache.org/job/ActiveMQ/job/ActiveMQ-Artemis-Master-JDK8/ws/integration/activemq-spring-integration/pom.xml>
to org.apache.activemq/artemis-spring-integration/2.16.0-SNAPSHOT/artemis-spring-integration-2.16.0-SNAPSHOT.pom
[JENKINS] Archiving <https://ci-builds.apache.org/job/ActiveMQ/job/ActiveMQ-Artemis-Master-JDK8/ws/artemis-web/pom.xml>
to org.apache.activemq/artemis-web/2.16.0-SNAPSHOT/artemis-web-2.16.0-SNAPSHOT.pom
[JENKINS] Archiving <https://ci-builds.apache.org/job/ActiveMQ/job/ActiveMQ-Artemis-Master-JDK8/ws/artemis-cdi-client/pom.xml>
to org.apache.activemq/artemis-cdi-client/2.16.0-SNAPSHOT/artemis-cdi-client-2.16.0-SNAPSHOT.pom
[JENKINS] Archiving <https://ci-builds.apache.org/job/ActiveMQ/job/ActiveMQ-Artemis-Master-JDK8/ws/tests/jms-tests/pom.xml>
to org.apache.activemq.tests/jms-tests/2.16.0-SNAPSHOT/jms-tests-2.16.0-SNAPSHOT.pom
[JENKINS] Archiving <https://ci-builds.apache.org/job/ActiveMQ/job/ActiveMQ-Artemis-Master-JDK8/ws/artemis-ra/pom.xml>
to org.apache.activemq/artemis-ra/2.16.0-SNAPSHOT/artemis-ra-2.16.0-SNAPSHOT.pom
[JENKINS] Archiving <https://ci-builds.apache.org/job/ActiveMQ/job/ActiveMQ-Artemis-Master-JDK8/ws/pom.xml>
to org.apache.activemq/artemis-pom/2.16.0-SNAPSHOT/artemis-pom-2.16.0-SNAPSHOT.pom
[Fast Archiver] Compressed 79.58 KB of artifacts by 80.4% relative to #48
[JENKINS] Archiving <https://ci-builds.apache.org/job/ActiveMQ/job/ActiveMQ-Artemis-Master-JDK8/ws/artemis-tools/pom.xml>
to org.apache.activemq/artemis-tools/2.16.0-SNAPSHOT/artemis-tools-2.16.0-SNAPSHOT.pom
[JENKINS] Archiving <https://ci-builds.apache.org/job/ActiveMQ/job/ActiveMQ-Artemis-Master-JDK8/ws/tests/karaf-client-integration-tests/pom.xml>
to org.apache.activemq.tests/karaf-client-integration-tests/2.16.0-SNAPSHOT/karaf-client-integration-tests-2.16.0-SNAPSHOT.pom
[JENKINS] Archiving <https://ci-builds.apache.org/job/ActiveMQ/job/ActiveMQ-Artemis-Master-JDK8/ws/artemis-maven-plugin/pom.xml>
to org.apache.activemq/artemis-maven-plugin/2.16.0-SNAPSHOT/artemis-maven-plugin-2.16.0-SNAPSHOT.pom
[JENKINS] Archiving <https://ci-builds.apache.org/job/ActiveMQ/job/ActiveMQ-Artemis-Master-JDK8/ws/artemis-junit/pom.xml>
to org.apache.activemq/artemis-junit/2.16.0-SNAPSHOT/artemis-junit-2.16.0-SNAPSHOT.pom
[JENKINS] Archiving <https://ci-builds.apache.org/job/ActiveMQ/job/ActiveMQ-Artemis-Master-JDK8/ws/artemis-service-extensions/pom.xml>
to org.apache.activemq/artemis-service-extensions/2.16.0-SNAPSHOT/artemis-service-extensions-2.16.0-SNAPSHOT.pom
[JENKINS] Archiving <https://ci-builds.apache.org/job/ActiveMQ/job/ActiveMQ-Artemis-Master-JDK8/ws/artemis-server-osgi/pom.xml>
to org.apache.activemq/artemis-server-osgi/2.16.0-SNAPSHOT/artemis-server-osgi-2.16.0-SNAPSHOT.pom
[JENKINS] Archiving <https://ci-builds.apache.org/job/ActiveMQ/job/ActiveMQ-Artemis-Master-JDK8/ws/tests/unit-tests/pom.xml>
to org.apache.activemq.tests/unit-tests/2.16.0-SNAPSHOT/unit-tests-2.16.0-SNAPSHOT.pom
[JENKINS] Archiving <https://ci-builds.apache.org/job/ActiveMQ/job/ActiveMQ-Artemis-Master-JDK8/ws/artemis-protocols/artemis-stomp-protocol/pom.xml>
to org.apache.activemq/artemis-stomp-protocol/2.16.0-SNAPSHOT/artemis-stomp-protocol-2.16.0-SNAPSHOT.pom
[JENKINS] Archiving <https://ci-builds.apache.org/job/ActiveMQ/job/ActiveMQ-Artemis-Master-JDK8/ws/artemis-rest/pom.xml>
to org.apache.activemq.rest/artemis-rest/2.16.0-SNAPSHOT/artemis-rest-2.16.0-SNAPSHOT.pom
[JENKINS] Archiving <https://ci-builds.apache.org/job/ActiveMQ/job/ActiveMQ-Artemis-Master-JDK8/ws/artemis-protocols/artemis-hornetq-protocol/pom.xml>
to org.apache.activemq/artemis-hornetq-protocol/2.16.0-SNAPSHOT/artemis-hornetq-protocol-2.16.0-SNAPSHOT.pom
[JENKINS] Archiving <https://ci-builds.apache.org/job/ActiveMQ/job/ActiveMQ-Artemis-Master-JDK8/ws/artemis-core-client-osgi/pom.xml>
to org.apache.activemq/artemis-core-client-osgi/2.16.0-SNAPSHOT/artemis-core-client-osgi-2.16.0-SNAPSHOT.pom
[JENKINS] Archiving <https://ci-builds.apache.org/job/ActiveMQ/job/ActiveMQ-Artemis-Master-JDK8/ws/tests/performance-tests/pom.xml>
to org.apache.activemq.tests/performance-tests/2.16.0-SNAPSHOT/performance-tests-2.16.0-SNAPSHOT.pom
[JENKINS] Archiving <https://ci-builds.apache.org/job/ActiveMQ/job/ActiveMQ-Artemis-Master-JDK8/ws/artemis-features/pom.xml>
to org.apache.activemq/artemis-features/2.16.0-SNAPSHOT/artemis-features-2.16.0-SNAPSHOT.pom
[JENKINS] Archiving <https://ci-builds.apache.org/job/ActiveMQ/job/ActiveMQ-Artemis-Master-JDK8/ws/artemis-commons/pom.xml>
to org.apache.activemq/artemis-commons/2.16.0-SNAPSHOT/artemis-commons-2.16.0-SNAPSHOT.pom
[JENKINS] Archiving <https://ci-builds.apache.org/job/ActiveMQ/job/ActiveMQ-Artemis-Master-JDK8/ws/artemis-commons/target/artemis-commons-2.16.0-SNAPSHOT.jar>
to org.apache.activemq/artemis-commons/2.16.0-SNAPSHOT/artemis-commons-2.16.0-SNAPSHOT.jar
[JENKINS] Archiving <https://ci-builds.apache.org/job/ActiveMQ/job/ActiveMQ-Artemis-Master-JDK8/ws/artemis-commons/target/artemis-commons-2.16.0-SNAPSHOT-tests.jar>
to org.apache.activemq/artemis-commons/2.16.0-SNAPSHOT/artemis-commons-2.16.0-SNAPSHOT-tests.jar
[JENKINS] Archiving <https://ci-builds.apache.org/job/ActiveMQ/job/ActiveMQ-Artemis-Master-JDK8/ws/artemis-commons/target/artemis-commons-2.16.0-SNAPSHOT-sources.jar>
to org.apache.activemq/artemis-commons/2.16.0-SNAPSHOT/artemis-commons-2.16.0-SNAPSHOT-sources.jar
[JENKINS] Archiving <https://ci-builds.apache.org/job/ActiveMQ/job/ActiveMQ-Artemis-Master-JDK8/ws/artemis-journal/pom.xml>
to org.apache.activemq/artemis-journal/2.16.0-SNAPSHOT/artemis-journal-2.16.0-SNAPSHOT.pom
[JENKINS] Archiving <https://ci-builds.apache.org/job/ActiveMQ/job/ActiveMQ-Artemis-Master-JDK8/ws/artemis-journal/target/artemis-journal-2.16.0-SNAPSHOT.jar>
to org.apache.activemq/artemis-journal/2.16.0-SNAPSHOT/artemis-journal-2.16.0-SNAPSHOT.jar
[JENKINS] Archiving <https://ci-builds.apache.org/job/ActiveMQ/job/ActiveMQ-Artemis-Master-JDK8/ws/artemis-journal/target/artemis-journal-2.16.0-SNAPSHOT-sources.jar>
to org.apache.activemq/artemis-journal/2.16.0-SNAPSHOT/artemis-journal-2.16.0-SNAPSHOT-sources.jar
[JENKINS] Archiving <https://ci-builds.apache.org/job/ActiveMQ/job/ActiveMQ-Artemis-Master-JDK8/ws/tests/soak-tests/pom.xml>
to org.apache.activemq.tests/soak-tests/2.16.0-SNAPSHOT/soak-tests-2.16.0-SNAPSHOT.pom
[JENKINS] Archiving <https://ci-builds.apache.org/job/ActiveMQ/job/ActiveMQ-Artemis-Master-JDK8/ws/artemis-core-client/pom.xml>
to org.apache.activemq/artemis-core-client/2.16.0-SNAPSHOT/artemis-core-client-2.16.0-SNAPSHOT.pom
[JENKINS] Archiving <https://ci-builds.apache.org/job/ActiveMQ/job/ActiveMQ-Artemis-Master-JDK8/ws/artemis-core-client/target/artemis-core-client-2.16.0-SNAPSHOT.jar>
to org.apache.activemq/artemis-core-client/2.16.0-SNAPSHOT/artemis-core-client-2.16.0-SNAPSHOT.jar
[JENKINS] Archiving <https://ci-builds.apache.org/job/ActiveMQ/job/ActiveMQ-Artemis-Master-JDK8/ws/artemis-core-client/target/artemis-core-client-2.16.0-SNAPSHOT-tests.jar>
to org.apache.activemq/artemis-core-client/2.16.0-SNAPSHOT/artemis-core-client-2.16.0-SNAPSHOT-tests.jar
[JENKINS] Archiving <https://ci-builds.apache.org/job/ActiveMQ/job/ActiveMQ-Artemis-Master-JDK8/ws/artemis-core-client/target/artemis-core-client-2.16.0-SNAPSHOT-sources.jar>
to org.apache.activemq/artemis-core-client/2.16.0-SNAPSHOT/artemis-core-client-2.16.0-SNAPSHOT-sources.jar
[JENKINS] Archiving <https://ci-builds.apache.org/job/ActiveMQ/job/ActiveMQ-Artemis-Master-JDK8/ws/tests/timing-tests/pom.xml>
to org.apache.activemq.tests/timing-tests/2.16.0-SNAPSHOT/timing-tests-2.16.0-SNAPSHOT.pom
[JENKINS] Archiving <https://ci-builds.apache.org/job/ActiveMQ/job/ActiveMQ-Artemis-Master-JDK8/ws/tests/extra-tests/pom.xml>
to org.apache.activemq.tests/extra-tests/2.16.0-SNAPSHOT/extra-tests-2.16.0-SNAPSHOT.pom
[JENKINS] Archiving <https://ci-builds.apache.org/job/ActiveMQ/job/ActiveMQ-Artemis-Master-JDK8/ws/artemis-jms-client-all/pom.xml>
to org.apache.activemq/artemis-jms-client-all/2.16.0-SNAPSHOT/artemis-jms-client-all-2.16.0-SNAPSHOT.pom
[JENKINS] Archiving <https://ci-builds.apache.org/job/ActiveMQ/job/ActiveMQ-Artemis-Master-JDK8/ws/artemis-protocols/pom.xml>
to org.apache.activemq/artemis-protocols/2.16.0-SNAPSHOT/artemis-protocols-2.16.0-SNAPSHOT.pom
[JENKINS] Archiving <https://ci-builds.apache.org/job/ActiveMQ/job/ActiveMQ-Artemis-Master-JDK8/ws/artemis-hawtio/artemis-plugin/pom.xml>
to org.apache.activemq/artemis-plugin/2.16.0-SNAPSHOT/artemis-plugin-2.16.0-SNAPSHOT.pom
[JENKINS] Archiving <https://ci-builds.apache.org/job/ActiveMQ/job/ActiveMQ-Artemis-Master-JDK8/ws/artemis-dto/pom.xml>
to org.apache.activemq/artemis-dto/2.16.0-SNAPSHOT/artemis-dto-2.16.0-SNAPSHOT.pom
[JENKINS] Archiving <https://ci-builds.apache.org/job/ActiveMQ/job/ActiveMQ-Artemis-Master-JDK8/ws/artemis-protocols/artemis-hqclient-protocol/pom.xml>
to org.apache.activemq/artemis-hqclient-protocol/2.16.0-SNAPSHOT/artemis-hqclient-protocol-2.16.0-SNAPSHOT.pom
[JENKINS] Archiving <https://ci-builds.apache.org/job/ActiveMQ/job/ActiveMQ-Artemis-Master-JDK8/ws/artemis-jms-client-osgi/pom.xml>
to org.apache.activemq/artemis-jms-client-osgi/2.16.0-SNAPSHOT/artemis-jms-client-osgi-2.16.0-SNAPSHOT.pom
[JENKINS] Archiving <https://ci-builds.apache.org/job/ActiveMQ/job/ActiveMQ-Artemis-Master-JDK8/ws/tests/integration-tests/pom.xml>
to org.apache.activemq.tests/integration-tests/2.16.0-SNAPSHOT/integration-tests-2.16.0-SNAPSHOT.pom
[JENKINS] Archiving <https://ci-builds.apache.org/job/ActiveMQ/job/ActiveMQ-Artemis-Master-JDK8/ws/artemis-boot/pom.xml>
to org.apache.activemq/artemis-boot/2.16.0-SNAPSHOT/artemis-boot-2.16.0-SNAPSHOT.pom
[JENKINS] Archiving <https://ci-builds.apache.org/job/ActiveMQ/job/ActiveMQ-Artemis-Master-JDK8/ws/artemis-website/pom.xml>
to org.apache.activemq/artemis-website/2.16.0-SNAPSHOT/artemis-website-2.16.0-SNAPSHOT.pom
[JENKINS] Archiving <https://ci-builds.apache.org/job/ActiveMQ/job/ActiveMQ-Artemis-Master-JDK8/ws/artemis-protocols/artemis-amqp-protocol/pom.xml>
to org.apache.activemq/artemis-amqp-protocol/2.16.0-SNAPSHOT/artemis-amqp-protocol-2.16.0-SNAPSHOT.pom
[JENKINS] Archiving <https://ci-builds.apache.org/job/ActiveMQ/job/ActiveMQ-Artemis-Master-JDK8/ws/artemis-protocols/artemis-mqtt-protocol/pom.xml>
to org.apache.activemq/artemis-mqtt-protocol/2.16.0-SNAPSHOT/artemis-mqtt-protocol-2.16.0-SNAPSHOT.pom
[JENKINS] Archiving <https://ci-builds.apache.org/job/ActiveMQ/job/ActiveMQ-Artemis-Master-JDK8/ws/artemis-hawtio/pom.xml>
to org.apache.activemq/artemis-hawtio-pom/2.16.0-SNAPSHOT/artemis-hawtio-pom-2.16.0-SNAPSHOT.pom
[JENKINS] Archiving <https://ci-builds.apache.org/job/ActiveMQ/job/ActiveMQ-Artemis-Master-JDK8/ws/tests/stress-tests/pom.xml>
to org.apache.activemq.tests/stress-tests/2.16.0-SNAPSHOT/stress-tests-2.16.0-SNAPSHOT.pom
channel stopped

Mime
View raw message