activemq-commits mailing list archives

Site index · List index
Message view « Date » · « Thread »
Top « Date » · « Thread »
From Apache Jenkins Server <jenk...@builds.apache.org>
Subject Build failed in Jenkins: ActiveMQ » ActiveMQ-Artemis-Master-JDK8 #2
Date Fri, 31 Jul 2020 06:34:26 GMT
See <https://ci-builds.apache.org/job/ActiveMQ/job/ActiveMQ-Artemis-Master-JDK8/2/display/redirect>

Changes:


------------------------------------------
[...truncated 3.83 MB...]
[INFO] ActiveMQ Artemis Parent ............................ SUCCESS [ 12.746 s]
[INFO] ActiveMQ Artemis Commons ........................... SUCCESS [02:17 min]
[INFO] ActiveMQ Artemis Core Client ....................... SUCCESS [ 28.854 s]
[INFO] ActiveMQ Artemis Selector Implementation ........... SUCCESS [ 10.042 s]
[INFO] ActiveMQ Artemis JMS Client ........................ SUCCESS [ 11.027 s]
[INFO] ActiveMQ Artemis Journal ........................... SUCCESS [  9.680 s]
[INFO] ActiveMQ Artemis JDBC Store ........................ SUCCESS [ 45.568 s]
[INFO] ActiveMQ Artemis Server ............................ SUCCESS [06:49 min]
[INFO] ActiveMQ Artemis Protocols ......................... SUCCESS [  3.838 s]
[INFO] ActiveMQ Artemis AMQP Protocol ..................... SUCCESS [ 19.153 s]
[INFO] ActiveMQ Artemis STOMP Protocol .................... SUCCESS [  8.479 s]
[INFO] ActiveMQ Artemis OpenWire Protocol ................. SUCCESS [ 11.902 s]
[INFO] ActiveMQ Artemis HQClient Protocol ................. SUCCESS [  6.646 s]
[INFO] ActiveMQ Artemis HornetQ Protocol .................. SUCCESS [  8.624 s]
[INFO] ActiveMQ Artemis Service Extensions ................ SUCCESS [  7.443 s]
[INFO] ActiveMQ Artemis JMS Server ........................ SUCCESS [  7.105 s]
[INFO] ActiveMQ Artemis JUnit Rules ....................... SUCCESS [ 12.664 s]
[INFO] ActiveMQ Artemis MQTT Protocol ..................... SUCCESS [ 18.065 s]
[INFO] ActiveMQ Artemis DTO ............................... SUCCESS [  8.694 s]
[INFO] ActiveMQ Artemis CDI Integration ................... SUCCESS [ 10.799 s]
[INFO] ActiveMQ Artemis Boot .............................. SUCCESS [  5.784 s]
[INFO] ActiveMQ Artemis Tools ............................. SUCCESS [  7.259 s]
[INFO] ActiveMQ Artemis CLI ............................... SUCCESS [01:50 min]
[INFO] ActiveMQ Artemis Web ............................... SUCCESS [ 17.590 s]
[INFO] ActiveMQ Artemis Web ............................... SUCCESS [ 19.364 s]
[INFO] ActiveMQ Artemis Core Client All ................... SUCCESS [ 17.162 s]
[INFO] ActiveMQ Artemis Client OSGi ....................... SUCCESS [  6.869 s]
[INFO] ActiveMQ Artemis JMS Client All .................... SUCCESS [ 17.094 s]
[INFO] ActiveMQ Artemis JMS Client OSGi ................... SUCCESS [  7.611 s]
[INFO] ActiveMQ Artemis RAR POM ........................... SUCCESS [  8.395 s]
[INFO] ActiveMQ Artemis REST Interface Implementation ..... SUCCESS [  8.939 s]
[INFO] ActiveMQ Artemis Maven Plugin ...................... SUCCESS [  8.905 s]
[INFO] ActiveMQ Artemis Server OSGi ....................... SUCCESS [ 10.191 s]
[INFO] ActiveMQ Artemis Cons .............................. SUCCESS [  3.959 s]
[INFO] ActiveMQ Artemis HawtIO Branding ................... SUCCESS [ 10.047 s]
[INFO] ActiveMQ Artemis HawtIO Plugin ..................... SUCCESS [  7.403 s]
[INFO] ActiveMQ Artemis Console ........................... SUCCESS [  9.258 s]
[INFO] ActiveMQ Artemis Spring Integration ................ SUCCESS [  6.704 s]
[INFO] Apache ActiveMQ Artemis Distribution ............... SUCCESS [ 34.888 s]
[INFO] ActiveMQ Artemis Tests POM ......................... SUCCESS [  4.060 s]
[INFO] ActiveMQ Artemis Test Support ...................... SUCCESS [  6.719 s]
[INFO] ActiveMQ Artemis Unit Tests ........................ SUCCESS [49:39 min]
[INFO] ActiveMQ Artemis Joram Tests ....................... SUCCESS [ 30.985 s]
[INFO] ActiveMQ Artemis timing Tests ...................... SUCCESS [  7.520 s]
[INFO] ActiveMQ Artemis JMS Tests ......................... SUCCESS [04:48 min]
[INFO] ActiveMQ Artemis Features .......................... SUCCESS [ 27.181 s]
[INFO] ActiveMQ Artemis Integration Tests ................. SUCCESS [ 32.709 s]
[INFO] ActiveMQ Artemis Client Integration Tests .......... SUCCESS [  8.573 s]
[INFO] ActiveMQ Artemis Compatibility Tests ............... FAILURE [06:18 min]
[INFO] ActiveMQ Artemis soak Tests ........................ SKIPPED
[INFO] ActiveMQ Artemis stress Tests ...................... SKIPPED
[INFO] ActiveMQ Artemis performance Tests ................. SKIPPED
[INFO] Smoke Tests ........................................ SKIPPED
[INFO] ActiveMQ Artemis Extra Tests ....................... SKIPPED
[INFO] ------------------------------------------------------------------------
[INFO] BUILD FAILURE
[INFO] ------------------------------------------------------------------------
[INFO] Total time:  01:25 h
[INFO] Finished at: 2020-07-31T06:32:07Z
[INFO] ------------------------------------------------------------------------
Waiting for Jenkins to finish collecting data
[ERROR] Failed to execute goal org.apache.maven.plugins:maven-surefire-plugin:2.22.2:test
(default-test) on project compatibility-tests: There are test failures.
[ERROR] 
[ERROR] Please refer to <https://ci-builds.apache.org/job/ActiveMQ/job/ActiveMQ-Artemis-Master-JDK8/ws/tests/compatibility-tests/target/surefire-reports>
for the individual test results.
[ERROR] Please refer to dump files (if any exist) [date].dump, [date]-jvmRun[N].dump and [date].dumpstream.
[ERROR] -> [Help 1]
[ERROR] 
[ERROR] To see the full stack trace of the errors, re-run Maven with the -e switch.
[ERROR] Re-run Maven using the -X switch to enable full debug logging.
[ERROR] 
[ERROR] For more information about the errors and possible solutions, please read the following
articles:
[ERROR] [Help 1] http://cwiki.apache.org/confluence/display/MAVEN/MojoFailureException
[ERROR] 
[ERROR] After correcting the problems, you can resume the build with the command
[ERROR]   mvn <goals> -rf :compatibility-tests
[JENKINS] Archiving <https://ci-builds.apache.org/job/ActiveMQ/job/ActiveMQ-Artemis-Master-JDK8/ws/artemis-server/pom.xml>
to org.apache.activemq/artemis-server/2.15.0-SNAPSHOT/artemis-server-2.15.0-SNAPSHOT.pom
[JENKINS] Archiving <https://ci-builds.apache.org/job/ActiveMQ/job/ActiveMQ-Artemis-Master-JDK8/ws/artemis-server/target/artemis-server-2.15.0-SNAPSHOT.jar>
to org.apache.activemq/artemis-server/2.15.0-SNAPSHOT/artemis-server-2.15.0-SNAPSHOT.jar
[JENKINS] Archiving <https://ci-builds.apache.org/job/ActiveMQ/job/ActiveMQ-Artemis-Master-JDK8/ws/artemis-server/target/artemis-server-2.15.0-SNAPSHOT-tests.jar>
to org.apache.activemq/artemis-server/2.15.0-SNAPSHOT/artemis-server-2.15.0-SNAPSHOT-tests.jar
[JENKINS] Archiving <https://ci-builds.apache.org/job/ActiveMQ/job/ActiveMQ-Artemis-Master-JDK8/ws/artemis-server/target/artemis-server-2.15.0-SNAPSHOT-sources.jar>
to org.apache.activemq/artemis-server/2.15.0-SNAPSHOT/artemis-server-2.15.0-SNAPSHOT-sources.jar
[Fast Archiver] Compressed 4.49 MB of artifacts by 24.3% relative to #1
[JENKINS] Archiving <https://ci-builds.apache.org/job/ActiveMQ/job/ActiveMQ-Artemis-Master-JDK8/ws/tests/compatibility-tests/pom.xml>
to org.apache.activemq.tests/compatibility-tests/2.15.0-SNAPSHOT/compatibility-tests-2.15.0-SNAPSHOT.pom
[Fast Archiver] No prior successful build to compare, so performing full copy of artifacts
[JENKINS] Archiving <https://ci-builds.apache.org/job/ActiveMQ/job/ActiveMQ-Artemis-Master-JDK8/ws/artemis-jms-client/pom.xml>
to org.apache.activemq/artemis-jms-client/2.15.0-SNAPSHOT/artemis-jms-client-2.15.0-SNAPSHOT.pom
[JENKINS] Archiving <https://ci-builds.apache.org/job/ActiveMQ/job/ActiveMQ-Artemis-Master-JDK8/ws/artemis-jms-client/target/artemis-jms-client-2.15.0-SNAPSHOT.jar>
to org.apache.activemq/artemis-jms-client/2.15.0-SNAPSHOT/artemis-jms-client-2.15.0-SNAPSHOT.jar
[JENKINS] Archiving <https://ci-builds.apache.org/job/ActiveMQ/job/ActiveMQ-Artemis-Master-JDK8/ws/artemis-jms-client/target/artemis-jms-client-2.15.0-SNAPSHOT-sources.jar>
to org.apache.activemq/artemis-jms-client/2.15.0-SNAPSHOT/artemis-jms-client-2.15.0-SNAPSHOT-sources.jar
[JENKINS] Archiving <https://ci-builds.apache.org/job/ActiveMQ/job/ActiveMQ-Artemis-Master-JDK8/ws/artemis-hawtio/activemq-branding/pom.xml>
to org.apache.activemq/activemq-branding/2.15.0-SNAPSHOT/activemq-branding-2.15.0-SNAPSHOT.pom
[JENKINS] Archiving <https://ci-builds.apache.org/job/ActiveMQ/job/ActiveMQ-Artemis-Master-JDK8/ws/artemis-hawtio/activemq-branding/target/activemq-branding-2.15.0-SNAPSHOT.war>
to org.apache.activemq/activemq-branding/2.15.0-SNAPSHOT/activemq-branding-2.15.0-SNAPSHOT.war
[JENKINS] Archiving <https://ci-builds.apache.org/job/ActiveMQ/job/ActiveMQ-Artemis-Master-JDK8/ws/artemis-hawtio/activemq-branding/target/activemq-branding-2.15.0-SNAPSHOT-sources.jar>
to org.apache.activemq/activemq-branding/2.15.0-SNAPSHOT/activemq-branding-2.15.0-SNAPSHOT-sources.jar
[Fast Archiver] Compressed 947.50 KB of artifacts by 81.1% relative to #1
[JENKINS] Archiving <https://ci-builds.apache.org/job/ActiveMQ/job/ActiveMQ-Artemis-Master-JDK8/ws/tests/smoke-tests/pom.xml>
to org.apache.activemq.tests/smoke-tests/2.15.0-SNAPSHOT/smoke-tests-2.15.0-SNAPSHOT.pom
[Fast Archiver] No prior successful build to compare, so performing full copy of artifacts
[JENKINS] Archiving <https://ci-builds.apache.org/job/ActiveMQ/job/ActiveMQ-Artemis-Master-JDK8/ws/tests/joram-tests/pom.xml>
to org.apache.activemq.tests/joram-tests/2.15.0-SNAPSHOT/joram-tests-2.15.0-SNAPSHOT.pom
[JENKINS] Archiving <https://ci-builds.apache.org/job/ActiveMQ/job/ActiveMQ-Artemis-Master-JDK8/ws/tests/joram-tests/target/joram-tests-2.15.0-SNAPSHOT.jar>
to org.apache.activemq.tests/joram-tests/2.15.0-SNAPSHOT/joram-tests-2.15.0-SNAPSHOT.jar
[JENKINS] Archiving <https://ci-builds.apache.org/job/ActiveMQ/job/ActiveMQ-Artemis-Master-JDK8/ws/tests/joram-tests/target/joram-tests-2.15.0-SNAPSHOT-tests.jar>
to org.apache.activemq.tests/joram-tests/2.15.0-SNAPSHOT/joram-tests-2.15.0-SNAPSHOT-tests.jar
[JENKINS] Archiving <https://ci-builds.apache.org/job/ActiveMQ/job/ActiveMQ-Artemis-Master-JDK8/ws/tests/joram-tests/target/joram-tests-2.15.0-SNAPSHOT-sources.jar>
to org.apache.activemq.tests/joram-tests/2.15.0-SNAPSHOT/joram-tests-2.15.0-SNAPSHOT-sources.jar
[JENKINS] Archiving <https://ci-builds.apache.org/job/ActiveMQ/job/ActiveMQ-Artemis-Master-JDK8/ws/artemis-jms-server/pom.xml>
to org.apache.activemq/artemis-jms-server/2.15.0-SNAPSHOT/artemis-jms-server-2.15.0-SNAPSHOT.pom
[JENKINS] Archiving <https://ci-builds.apache.org/job/ActiveMQ/job/ActiveMQ-Artemis-Master-JDK8/ws/artemis-jms-server/target/artemis-jms-server-2.15.0-SNAPSHOT.jar>
to org.apache.activemq/artemis-jms-server/2.15.0-SNAPSHOT/artemis-jms-server-2.15.0-SNAPSHOT.jar
[JENKINS] Archiving <https://ci-builds.apache.org/job/ActiveMQ/job/ActiveMQ-Artemis-Master-JDK8/ws/artemis-jms-server/target/artemis-jms-server-2.15.0-SNAPSHOT-sources.jar>
to org.apache.activemq/artemis-jms-server/2.15.0-SNAPSHOT/artemis-jms-server-2.15.0-SNAPSHOT-sources.jar
[JENKINS] Archiving <https://ci-builds.apache.org/job/ActiveMQ/job/ActiveMQ-Artemis-Master-JDK8/ws/artemis-cli/pom.xml>
to org.apache.activemq/artemis-cli/2.15.0-SNAPSHOT/artemis-cli-2.15.0-SNAPSHOT.pom
[JENKINS] Archiving <https://ci-builds.apache.org/job/ActiveMQ/job/ActiveMQ-Artemis-Master-JDK8/ws/artemis-cli/target/artemis-cli-2.15.0-SNAPSHOT.jar>
to org.apache.activemq/artemis-cli/2.15.0-SNAPSHOT/artemis-cli-2.15.0-SNAPSHOT.jar
[JENKINS] Archiving <https://ci-builds.apache.org/job/ActiveMQ/job/ActiveMQ-Artemis-Master-JDK8/ws/artemis-cli/target/artemis-cli-2.15.0-SNAPSHOT-sources.jar>
to org.apache.activemq/artemis-cli/2.15.0-SNAPSHOT/artemis-cli-2.15.0-SNAPSHOT-sources.jar
[Fast Archiver] Compressed 713.14 KB of artifacts by 26.9% relative to #1
[JENKINS] Archiving <https://ci-builds.apache.org/job/ActiveMQ/job/ActiveMQ-Artemis-Master-JDK8/ws/artemis-core-client-all/dependency-reduced-pom.xml>
to org.apache.activemq/artemis-core-client-all/2.15.0-SNAPSHOT/artemis-core-client-all-2.15.0-SNAPSHOT.pom
[JENKINS] Archiving <https://ci-builds.apache.org/job/ActiveMQ/job/ActiveMQ-Artemis-Master-JDK8/ws/artemis-core-client-all/target/artemis-core-client-all-2.15.0-SNAPSHOT.jar>
to org.apache.activemq/artemis-core-client-all/2.15.0-SNAPSHOT/artemis-core-client-all-2.15.0-SNAPSHOT.jar
[JENKINS] Archiving <https://ci-builds.apache.org/job/ActiveMQ/job/ActiveMQ-Artemis-Master-JDK8/ws/artemis-core-client-all/target/artemis-core-client-all-2.15.0-SNAPSHOT-sources.jar>
to org.apache.activemq/artemis-core-client-all/2.15.0-SNAPSHOT/artemis-core-client-all-2.15.0-SNAPSHOT-sources.jar
[Fast Archiver] Compressed 13.65 MB of artifacts by 49.2% relative to #1
[JENKINS] Archiving <https://ci-builds.apache.org/job/ActiveMQ/job/ActiveMQ-Artemis-Master-JDK8/ws/tests/pom.xml>
to org.apache.activemq.tests/artemis-tests-pom/2.15.0-SNAPSHOT/artemis-tests-pom-2.15.0-SNAPSHOT.pom
[JENKINS] Archiving <https://ci-builds.apache.org/job/ActiveMQ/job/ActiveMQ-Artemis-Master-JDK8/ws/artemis-protocols/artemis-openwire-protocol/pom.xml>
to org.apache.activemq/artemis-openwire-protocol/2.15.0-SNAPSHOT/artemis-openwire-protocol-2.15.0-SNAPSHOT.pom
[JENKINS] Archiving <https://ci-builds.apache.org/job/ActiveMQ/job/ActiveMQ-Artemis-Master-JDK8/ws/artemis-protocols/artemis-openwire-protocol/target/artemis-openwire-protocol-2.15.0-SNAPSHOT.jar>
to org.apache.activemq/artemis-openwire-protocol/2.15.0-SNAPSHOT/artemis-openwire-protocol-2.15.0-SNAPSHOT.jar
[JENKINS] Archiving <https://ci-builds.apache.org/job/ActiveMQ/job/ActiveMQ-Artemis-Master-JDK8/ws/artemis-protocols/artemis-openwire-protocol/target/artemis-openwire-protocol-2.15.0-SNAPSHOT-sources.jar>
to org.apache.activemq/artemis-openwire-protocol/2.15.0-SNAPSHOT/artemis-openwire-protocol-2.15.0-SNAPSHOT-sources.jar
[Fast Archiver] Compressed 1.38 MB of artifacts by 84.0% relative to #1
[JENKINS] Archiving <https://ci-builds.apache.org/job/ActiveMQ/job/ActiveMQ-Artemis-Master-JDK8/ws/artemis-distribution/pom.xml>
to org.apache.activemq/apache-artemis/2.15.0-SNAPSHOT/apache-artemis-2.15.0-SNAPSHOT.pom
[JENKINS] Archiving <https://ci-builds.apache.org/job/ActiveMQ/job/ActiveMQ-Artemis-Master-JDK8/ws/artemis-distribution/target/apache-artemis-2.15.0-SNAPSHOT-source-release.zip>
to org.apache.activemq/apache-artemis/2.15.0-SNAPSHOT/apache-artemis-2.15.0-SNAPSHOT-source-release.zip
[JENKINS] Archiving <https://ci-builds.apache.org/job/ActiveMQ/job/ActiveMQ-Artemis-Master-JDK8/ws/artemis-distribution/target/apache-artemis-2.15.0-SNAPSHOT-source-release.tar.gz>
to org.apache.activemq/apache-artemis/2.15.0-SNAPSHOT/apache-artemis-2.15.0-SNAPSHOT-source-release.tar.gz
[JENKINS] Archiving <https://ci-builds.apache.org/job/ActiveMQ/job/ActiveMQ-Artemis-Master-JDK8/ws/artemis-distribution/target/apache-artemis-2.15.0-SNAPSHOT-bin.zip>
to org.apache.activemq/apache-artemis/2.15.0-SNAPSHOT/apache-artemis-2.15.0-SNAPSHOT-bin.zip
[JENKINS] Archiving <https://ci-builds.apache.org/job/ActiveMQ/job/ActiveMQ-Artemis-Master-JDK8/ws/artemis-distribution/target/apache-artemis-2.15.0-SNAPSHOT-bin.tar.gz>
to org.apache.activemq/apache-artemis/2.15.0-SNAPSHOT/apache-artemis-2.15.0-SNAPSHOT-bin.tar.gz
[Fast Archiver] Compressed 132.04 MB of artifacts by 33.9% relative to #1
[JENKINS] Archiving <https://ci-builds.apache.org/job/ActiveMQ/job/ActiveMQ-Artemis-Master-JDK8/ws/artemis-hawtio/artemis-console/pom.xml>
to org.apache.activemq/artemis-console/2.15.0-SNAPSHOT/artemis-console-2.15.0-SNAPSHOT.pom
[JENKINS] Archiving <https://ci-builds.apache.org/job/ActiveMQ/job/ActiveMQ-Artemis-Master-JDK8/ws/artemis-hawtio/artemis-console/target/artemis-console-2.15.0-SNAPSHOT.war>
to org.apache.activemq/artemis-console/2.15.0-SNAPSHOT/artemis-console-2.15.0-SNAPSHOT.war
[JENKINS] Archiving <https://ci-builds.apache.org/job/ActiveMQ/job/ActiveMQ-Artemis-Master-JDK8/ws/artemis-hawtio/artemis-console/target/artemis-console-2.15.0-SNAPSHOT-sources.jar>
to org.apache.activemq/artemis-console/2.15.0-SNAPSHOT/artemis-console-2.15.0-SNAPSHOT-sources.jar
[Fast Archiver] Compressed 12.57 MB of artifacts by 70.9% relative to #1
[JENKINS] Archiving <https://ci-builds.apache.org/job/ActiveMQ/job/ActiveMQ-Artemis-Master-JDK8/ws/tests/artemis-test-support/pom.xml>
to org.apache.activemq.tests/artemis-test-support/2.15.0-SNAPSHOT/artemis-test-support-2.15.0-SNAPSHOT.pom
[JENKINS] Archiving <https://ci-builds.apache.org/job/ActiveMQ/job/ActiveMQ-Artemis-Master-JDK8/ws/tests/artemis-test-support/target/artemis-test-support-2.15.0-SNAPSHOT.jar>
to org.apache.activemq.tests/artemis-test-support/2.15.0-SNAPSHOT/artemis-test-support-2.15.0-SNAPSHOT.jar
[JENKINS] Archiving <https://ci-builds.apache.org/job/ActiveMQ/job/ActiveMQ-Artemis-Master-JDK8/ws/tests/artemis-test-support/target/artemis-test-support-2.15.0-SNAPSHOT-sources.jar>
to org.apache.activemq.tests/artemis-test-support/2.15.0-SNAPSHOT/artemis-test-support-2.15.0-SNAPSHOT-sources.jar
[JENKINS] Archiving <https://ci-builds.apache.org/job/ActiveMQ/job/ActiveMQ-Artemis-Master-JDK8/ws/artemis-selector/pom.xml>
to org.apache.activemq/artemis-selector/2.15.0-SNAPSHOT/artemis-selector-2.15.0-SNAPSHOT.pom
[JENKINS] Archiving <https://ci-builds.apache.org/job/ActiveMQ/job/ActiveMQ-Artemis-Master-JDK8/ws/artemis-selector/target/artemis-selector-2.15.0-SNAPSHOT.jar>
to org.apache.activemq/artemis-selector/2.15.0-SNAPSHOT/artemis-selector-2.15.0-SNAPSHOT.jar
[JENKINS] Archiving <https://ci-builds.apache.org/job/ActiveMQ/job/ActiveMQ-Artemis-Master-JDK8/ws/artemis-selector/target/artemis-selector-2.15.0-SNAPSHOT-sources.jar>
to org.apache.activemq/artemis-selector/2.15.0-SNAPSHOT/artemis-selector-2.15.0-SNAPSHOT-sources.jar
[JENKINS] Archiving <https://ci-builds.apache.org/job/ActiveMQ/job/ActiveMQ-Artemis-Master-JDK8/ws/artemis-jdbc-store/pom.xml>
to org.apache.activemq/artemis-jdbc-store/2.15.0-SNAPSHOT/artemis-jdbc-store-2.15.0-SNAPSHOT.pom
[JENKINS] Archiving <https://ci-builds.apache.org/job/ActiveMQ/job/ActiveMQ-Artemis-Master-JDK8/ws/artemis-jdbc-store/target/artemis-jdbc-store-2.15.0-SNAPSHOT.jar>
to org.apache.activemq/artemis-jdbc-store/2.15.0-SNAPSHOT/artemis-jdbc-store-2.15.0-SNAPSHOT.jar
[JENKINS] Archiving <https://ci-builds.apache.org/job/ActiveMQ/job/ActiveMQ-Artemis-Master-JDK8/ws/artemis-jdbc-store/target/artemis-jdbc-store-2.15.0-SNAPSHOT-sources.jar>
to org.apache.activemq/artemis-jdbc-store/2.15.0-SNAPSHOT/artemis-jdbc-store-2.15.0-SNAPSHOT-sources.jar
[JENKINS] Archiving <https://ci-builds.apache.org/job/ActiveMQ/job/ActiveMQ-Artemis-Master-JDK8/ws/integration/activemq-spring-integration/pom.xml>
to org.apache.activemq/artemis-spring-integration/2.15.0-SNAPSHOT/artemis-spring-integration-2.15.0-SNAPSHOT.pom
[JENKINS] Archiving <https://ci-builds.apache.org/job/ActiveMQ/job/ActiveMQ-Artemis-Master-JDK8/ws/integration/activemq-spring-integration/target/artemis-spring-integration-2.15.0-SNAPSHOT.jar>
to org.apache.activemq/artemis-spring-integration/2.15.0-SNAPSHOT/artemis-spring-integration-2.15.0-SNAPSHOT.jar
[JENKINS] Archiving <https://ci-builds.apache.org/job/ActiveMQ/job/ActiveMQ-Artemis-Master-JDK8/ws/integration/activemq-spring-integration/target/artemis-spring-integration-2.15.0-SNAPSHOT-sources.jar>
to org.apache.activemq/artemis-spring-integration/2.15.0-SNAPSHOT/artemis-spring-integration-2.15.0-SNAPSHOT-sources.jar
[JENKINS] Archiving <https://ci-builds.apache.org/job/ActiveMQ/job/ActiveMQ-Artemis-Master-JDK8/ws/artemis-web/pom.xml>
to org.apache.activemq/artemis-web/2.15.0-SNAPSHOT/artemis-web-2.15.0-SNAPSHOT.pom
[JENKINS] Archiving <https://ci-builds.apache.org/job/ActiveMQ/job/ActiveMQ-Artemis-Master-JDK8/ws/artemis-web/target/artemis-web-2.15.0-SNAPSHOT.jar>
to org.apache.activemq/artemis-web/2.15.0-SNAPSHOT/artemis-web-2.15.0-SNAPSHOT.jar
[JENKINS] Archiving <https://ci-builds.apache.org/job/ActiveMQ/job/ActiveMQ-Artemis-Master-JDK8/ws/artemis-web/target/artemis-web-2.15.0-SNAPSHOT-sources.jar>
to org.apache.activemq/artemis-web/2.15.0-SNAPSHOT/artemis-web-2.15.0-SNAPSHOT-sources.jar
[JENKINS] Archiving <https://ci-builds.apache.org/job/ActiveMQ/job/ActiveMQ-Artemis-Master-JDK8/ws/artemis-cdi-client/pom.xml>
to org.apache.activemq/artemis-cdi-client/2.15.0-SNAPSHOT/artemis-cdi-client-2.15.0-SNAPSHOT.pom
[JENKINS] Archiving <https://ci-builds.apache.org/job/ActiveMQ/job/ActiveMQ-Artemis-Master-JDK8/ws/artemis-cdi-client/target/artemis-cdi-client-2.15.0-SNAPSHOT.jar>
to org.apache.activemq/artemis-cdi-client/2.15.0-SNAPSHOT/artemis-cdi-client-2.15.0-SNAPSHOT.jar
[JENKINS] Archiving <https://ci-builds.apache.org/job/ActiveMQ/job/ActiveMQ-Artemis-Master-JDK8/ws/artemis-cdi-client/target/artemis-cdi-client-2.15.0-SNAPSHOT-sources.jar>
to org.apache.activemq/artemis-cdi-client/2.15.0-SNAPSHOT/artemis-cdi-client-2.15.0-SNAPSHOT-sources.jar
[JENKINS] Archiving <https://ci-builds.apache.org/job/ActiveMQ/job/ActiveMQ-Artemis-Master-JDK8/ws/tests/jms-tests/pom.xml>
to org.apache.activemq.tests/jms-tests/2.15.0-SNAPSHOT/jms-tests-2.15.0-SNAPSHOT.pom
[JENKINS] Archiving <https://ci-builds.apache.org/job/ActiveMQ/job/ActiveMQ-Artemis-Master-JDK8/ws/tests/jms-tests/target/jms-tests-2.15.0-SNAPSHOT.jar>
to org.apache.activemq.tests/jms-tests/2.15.0-SNAPSHOT/jms-tests-2.15.0-SNAPSHOT.jar
[JENKINS] Archiving <https://ci-builds.apache.org/job/ActiveMQ/job/ActiveMQ-Artemis-Master-JDK8/ws/tests/jms-tests/target/jms-tests-2.15.0-SNAPSHOT-tests.jar>
to org.apache.activemq.tests/jms-tests/2.15.0-SNAPSHOT/jms-tests-2.15.0-SNAPSHOT-tests.jar
[JENKINS] Archiving <https://ci-builds.apache.org/job/ActiveMQ/job/ActiveMQ-Artemis-Master-JDK8/ws/tests/jms-tests/target/jms-tests-2.15.0-SNAPSHOT-sources.jar>
to org.apache.activemq.tests/jms-tests/2.15.0-SNAPSHOT/jms-tests-2.15.0-SNAPSHOT-sources.jar
[Fast Archiver] No prior successful build to compare, so performing full copy of artifacts
[JENKINS] Archiving <https://ci-builds.apache.org/job/ActiveMQ/job/ActiveMQ-Artemis-Master-JDK8/ws/artemis-ra/pom.xml>
to org.apache.activemq/artemis-ra/2.15.0-SNAPSHOT/artemis-ra-2.15.0-SNAPSHOT.pom
[JENKINS] Archiving <https://ci-builds.apache.org/job/ActiveMQ/job/ActiveMQ-Artemis-Master-JDK8/ws/artemis-ra/target/artemis-ra-2.15.0-SNAPSHOT.jar>
to org.apache.activemq/artemis-ra/2.15.0-SNAPSHOT/artemis-ra-2.15.0-SNAPSHOT.jar
[JENKINS] Archiving <https://ci-builds.apache.org/job/ActiveMQ/job/ActiveMQ-Artemis-Master-JDK8/ws/artemis-ra/target/artemis-ra-2.15.0-SNAPSHOT-sources.jar>
to org.apache.activemq/artemis-ra/2.15.0-SNAPSHOT/artemis-ra-2.15.0-SNAPSHOT-sources.jar
[JENKINS] Archiving <https://ci-builds.apache.org/job/ActiveMQ/job/ActiveMQ-Artemis-Master-JDK8/ws/pom.xml>
to org.apache.activemq/artemis-pom/2.15.0-SNAPSHOT/artemis-pom-2.15.0-SNAPSHOT.pom
[Fast Archiver] Compressed 79.53 KB of artifacts by 80.5% relative to #1
[JENKINS] Archiving <https://ci-builds.apache.org/job/ActiveMQ/job/ActiveMQ-Artemis-Master-JDK8/ws/artemis-tools/pom.xml>
to org.apache.activemq/artemis-tools/2.15.0-SNAPSHOT/artemis-tools-2.15.0-SNAPSHOT.pom
[JENKINS] Archiving <https://ci-builds.apache.org/job/ActiveMQ/job/ActiveMQ-Artemis-Master-JDK8/ws/artemis-tools/target/artemis-tools-2.15.0-SNAPSHOT.jar>
to org.apache.activemq/artemis-tools/2.15.0-SNAPSHOT/artemis-tools-2.15.0-SNAPSHOT.jar
[JENKINS] Archiving <https://ci-builds.apache.org/job/ActiveMQ/job/ActiveMQ-Artemis-Master-JDK8/ws/artemis-tools/target/artemis-tools-2.15.0-SNAPSHOT-sources.jar>
to org.apache.activemq/artemis-tools/2.15.0-SNAPSHOT/artemis-tools-2.15.0-SNAPSHOT-sources.jar
[JENKINS] Archiving <https://ci-builds.apache.org/job/ActiveMQ/job/ActiveMQ-Artemis-Master-JDK8/ws/tests/karaf-client-integration-tests/pom.xml>
to org.apache.activemq.tests/karaf-client-integration-tests/2.15.0-SNAPSHOT/karaf-client-integration-tests-2.15.0-SNAPSHOT.pom
[JENKINS] Archiving <https://ci-builds.apache.org/job/ActiveMQ/job/ActiveMQ-Artemis-Master-JDK8/ws/tests/karaf-client-integration-tests/target/karaf-client-integration-tests-2.15.0-SNAPSHOT.jar>
to org.apache.activemq.tests/karaf-client-integration-tests/2.15.0-SNAPSHOT/karaf-client-integration-tests-2.15.0-SNAPSHOT.jar
[JENKINS] Archiving <https://ci-builds.apache.org/job/ActiveMQ/job/ActiveMQ-Artemis-Master-JDK8/ws/tests/karaf-client-integration-tests/target/karaf-client-integration-tests-2.15.0-SNAPSHOT-sources.jar>
to org.apache.activemq.tests/karaf-client-integration-tests/2.15.0-SNAPSHOT/karaf-client-integration-tests-2.15.0-SNAPSHOT-sources.jar
[Fast Archiver] No prior successful build to compare, so performing full copy of artifacts
[JENKINS] Archiving <https://ci-builds.apache.org/job/ActiveMQ/job/ActiveMQ-Artemis-Master-JDK8/ws/artemis-maven-plugin/pom.xml>
to org.apache.activemq/artemis-maven-plugin/2.15.0-SNAPSHOT/artemis-maven-plugin-2.15.0-SNAPSHOT.pom
[JENKINS] Archiving <https://ci-builds.apache.org/job/ActiveMQ/job/ActiveMQ-Artemis-Master-JDK8/ws/artemis-maven-plugin/target/artemis-maven-plugin-2.15.0-SNAPSHOT.jar>
to org.apache.activemq/artemis-maven-plugin/2.15.0-SNAPSHOT/artemis-maven-plugin-2.15.0-SNAPSHOT.jar
[JENKINS] Archiving <https://ci-builds.apache.org/job/ActiveMQ/job/ActiveMQ-Artemis-Master-JDK8/ws/artemis-maven-plugin/target/artemis-maven-plugin-2.15.0-SNAPSHOT-sources.jar>
to org.apache.activemq/artemis-maven-plugin/2.15.0-SNAPSHOT/artemis-maven-plugin-2.15.0-SNAPSHOT-sources.jar
[JENKINS] Archiving <https://ci-builds.apache.org/job/ActiveMQ/job/ActiveMQ-Artemis-Master-JDK8/ws/artemis-junit/pom.xml>
to org.apache.activemq/artemis-junit/2.15.0-SNAPSHOT/artemis-junit-2.15.0-SNAPSHOT.pom
[JENKINS] Archiving <https://ci-builds.apache.org/job/ActiveMQ/job/ActiveMQ-Artemis-Master-JDK8/ws/artemis-junit/target/artemis-junit-2.15.0-SNAPSHOT.jar>
to org.apache.activemq/artemis-junit/2.15.0-SNAPSHOT/artemis-junit-2.15.0-SNAPSHOT.jar
[JENKINS] Archiving <https://ci-builds.apache.org/job/ActiveMQ/job/ActiveMQ-Artemis-Master-JDK8/ws/artemis-junit/target/artemis-junit-2.15.0-SNAPSHOT-sources.jar>
to org.apache.activemq/artemis-junit/2.15.0-SNAPSHOT/artemis-junit-2.15.0-SNAPSHOT-sources.jar
[JENKINS] Archiving <https://ci-builds.apache.org/job/ActiveMQ/job/ActiveMQ-Artemis-Master-JDK8/ws/artemis-service-extensions/pom.xml>
to org.apache.activemq/artemis-service-extensions/2.15.0-SNAPSHOT/artemis-service-extensions-2.15.0-SNAPSHOT.pom
[JENKINS] Archiving <https://ci-builds.apache.org/job/ActiveMQ/job/ActiveMQ-Artemis-Master-JDK8/ws/artemis-service-extensions/target/artemis-service-extensions-2.15.0-SNAPSHOT.jar>
to org.apache.activemq/artemis-service-extensions/2.15.0-SNAPSHOT/artemis-service-extensions-2.15.0-SNAPSHOT.jar
[JENKINS] Archiving <https://ci-builds.apache.org/job/ActiveMQ/job/ActiveMQ-Artemis-Master-JDK8/ws/artemis-service-extensions/target/artemis-service-extensions-2.15.0-SNAPSHOT-sources.jar>
to org.apache.activemq/artemis-service-extensions/2.15.0-SNAPSHOT/artemis-service-extensions-2.15.0-SNAPSHOT-sources.jar
[JENKINS] Archiving <https://ci-builds.apache.org/job/ActiveMQ/job/ActiveMQ-Artemis-Master-JDK8/ws/artemis-server-osgi/pom.xml>
to org.apache.activemq/artemis-server-osgi/2.15.0-SNAPSHOT/artemis-server-osgi-2.15.0-SNAPSHOT.pom
[JENKINS] Archiving <https://ci-builds.apache.org/job/ActiveMQ/job/ActiveMQ-Artemis-Master-JDK8/ws/artemis-server-osgi/target/artemis-server-osgi-2.15.0-SNAPSHOT.jar>
to org.apache.activemq/artemis-server-osgi/2.15.0-SNAPSHOT/artemis-server-osgi-2.15.0-SNAPSHOT.jar
[JENKINS] Archiving <https://ci-builds.apache.org/job/ActiveMQ/job/ActiveMQ-Artemis-Master-JDK8/ws/artemis-server-osgi/target/artemis-server-osgi-2.15.0-SNAPSHOT-sources.jar>
to org.apache.activemq/artemis-server-osgi/2.15.0-SNAPSHOT/artemis-server-osgi-2.15.0-SNAPSHOT-sources.jar
[JENKINS] Archiving <https://ci-builds.apache.org/job/ActiveMQ/job/ActiveMQ-Artemis-Master-JDK8/ws/tests/unit-tests/pom.xml>
to org.apache.activemq.tests/unit-tests/2.15.0-SNAPSHOT/unit-tests-2.15.0-SNAPSHOT.pom
[JENKINS] Archiving <https://ci-builds.apache.org/job/ActiveMQ/job/ActiveMQ-Artemis-Master-JDK8/ws/tests/unit-tests/target/unit-tests-2.15.0-SNAPSHOT.jar>
to org.apache.activemq.tests/unit-tests/2.15.0-SNAPSHOT/unit-tests-2.15.0-SNAPSHOT.jar
[JENKINS] Archiving <https://ci-builds.apache.org/job/ActiveMQ/job/ActiveMQ-Artemis-Master-JDK8/ws/tests/unit-tests/target/unit-tests-2.15.0-SNAPSHOT-tests.jar>
to org.apache.activemq.tests/unit-tests/2.15.0-SNAPSHOT/unit-tests-2.15.0-SNAPSHOT-tests.jar
[JENKINS] Archiving <https://ci-builds.apache.org/job/ActiveMQ/job/ActiveMQ-Artemis-Master-JDK8/ws/tests/unit-tests/target/unit-tests-2.15.0-SNAPSHOT-sources.jar>
to org.apache.activemq.tests/unit-tests/2.15.0-SNAPSHOT/unit-tests-2.15.0-SNAPSHOT-sources.jar
[JENKINS] Archiving <https://ci-builds.apache.org/job/ActiveMQ/job/ActiveMQ-Artemis-Master-JDK8/ws/artemis-protocols/artemis-stomp-protocol/pom.xml>
to org.apache.activemq/artemis-stomp-protocol/2.15.0-SNAPSHOT/artemis-stomp-protocol-2.15.0-SNAPSHOT.pom
[JENKINS] Archiving <https://ci-builds.apache.org/job/ActiveMQ/job/ActiveMQ-Artemis-Master-JDK8/ws/artemis-protocols/artemis-stomp-protocol/target/artemis-stomp-protocol-2.15.0-SNAPSHOT.jar>
to org.apache.activemq/artemis-stomp-protocol/2.15.0-SNAPSHOT/artemis-stomp-protocol-2.15.0-SNAPSHOT.jar
[JENKINS] Archiving <https://ci-builds.apache.org/job/ActiveMQ/job/ActiveMQ-Artemis-Master-JDK8/ws/artemis-protocols/artemis-stomp-protocol/target/artemis-stomp-protocol-2.15.0-SNAPSHOT-sources.jar>
to org.apache.activemq/artemis-stomp-protocol/2.15.0-SNAPSHOT/artemis-stomp-protocol-2.15.0-SNAPSHOT-sources.jar
[JENKINS] Archiving <https://ci-builds.apache.org/job/ActiveMQ/job/ActiveMQ-Artemis-Master-JDK8/ws/artemis-rest/pom.xml>
to org.apache.activemq.rest/artemis-rest/2.15.0-SNAPSHOT/artemis-rest-2.15.0-SNAPSHOT.pom
[JENKINS] Archiving <https://ci-builds.apache.org/job/ActiveMQ/job/ActiveMQ-Artemis-Master-JDK8/ws/artemis-rest/target/artemis-rest-2.15.0-SNAPSHOT.jar>
to org.apache.activemq.rest/artemis-rest/2.15.0-SNAPSHOT/artemis-rest-2.15.0-SNAPSHOT.jar
[JENKINS] Archiving <https://ci-builds.apache.org/job/ActiveMQ/job/ActiveMQ-Artemis-Master-JDK8/ws/artemis-rest/target/artemis-rest-2.15.0-SNAPSHOT-sources.jar>
to org.apache.activemq.rest/artemis-rest/2.15.0-SNAPSHOT/artemis-rest-2.15.0-SNAPSHOT-sources.jar
[JENKINS] Archiving <https://ci-builds.apache.org/job/ActiveMQ/job/ActiveMQ-Artemis-Master-JDK8/ws/artemis-protocols/artemis-hornetq-protocol/pom.xml>
to org.apache.activemq/artemis-hornetq-protocol/2.15.0-SNAPSHOT/artemis-hornetq-protocol-2.15.0-SNAPSHOT.pom
[JENKINS] Archiving <https://ci-builds.apache.org/job/ActiveMQ/job/ActiveMQ-Artemis-Master-JDK8/ws/artemis-protocols/artemis-hornetq-protocol/target/artemis-hornetq-protocol-2.15.0-SNAPSHOT.jar>
to org.apache.activemq/artemis-hornetq-protocol/2.15.0-SNAPSHOT/artemis-hornetq-protocol-2.15.0-SNAPSHOT.jar
[JENKINS] Archiving <https://ci-builds.apache.org/job/ActiveMQ/job/ActiveMQ-Artemis-Master-JDK8/ws/artemis-protocols/artemis-hornetq-protocol/target/artemis-hornetq-protocol-2.15.0-SNAPSHOT-sources.jar>
to org.apache.activemq/artemis-hornetq-protocol/2.15.0-SNAPSHOT/artemis-hornetq-protocol-2.15.0-SNAPSHOT-sources.jar
[JENKINS] Archiving <https://ci-builds.apache.org/job/ActiveMQ/job/ActiveMQ-Artemis-Master-JDK8/ws/artemis-core-client-osgi/pom.xml>
to org.apache.activemq/artemis-core-client-osgi/2.15.0-SNAPSHOT/artemis-core-client-osgi-2.15.0-SNAPSHOT.pom
[JENKINS] Archiving <https://ci-builds.apache.org/job/ActiveMQ/job/ActiveMQ-Artemis-Master-JDK8/ws/artemis-core-client-osgi/target/artemis-core-client-osgi-2.15.0-SNAPSHOT.jar>
to org.apache.activemq/artemis-core-client-osgi/2.15.0-SNAPSHOT/artemis-core-client-osgi-2.15.0-SNAPSHOT.jar
[JENKINS] Archiving <https://ci-builds.apache.org/job/ActiveMQ/job/ActiveMQ-Artemis-Master-JDK8/ws/artemis-core-client-osgi/target/artemis-core-client-osgi-2.15.0-SNAPSHOT-sources.jar>
to org.apache.activemq/artemis-core-client-osgi/2.15.0-SNAPSHOT/artemis-core-client-osgi-2.15.0-SNAPSHOT-sources.jar
[JENKINS] Archiving <https://ci-builds.apache.org/job/ActiveMQ/job/ActiveMQ-Artemis-Master-JDK8/ws/tests/performance-tests/pom.xml>
to org.apache.activemq.tests/performance-tests/2.15.0-SNAPSHOT/performance-tests-2.15.0-SNAPSHOT.pom
[Fast Archiver] No prior successful build to compare, so performing full copy of artifacts
[JENKINS] Archiving <https://ci-builds.apache.org/job/ActiveMQ/job/ActiveMQ-Artemis-Master-JDK8/ws/artemis-features/pom.xml>
to org.apache.activemq/artemis-features/2.15.0-SNAPSHOT/artemis-features-2.15.0-SNAPSHOT.pom
[JENKINS] Archiving <https://ci-builds.apache.org/job/ActiveMQ/job/ActiveMQ-Artemis-Master-JDK8/ws/artemis-features/target/classes/features.xml>
to org.apache.activemq/artemis-features/2.15.0-SNAPSHOT/artemis-features-2.15.0-SNAPSHOT-features.xml
[JENKINS] Archiving <https://ci-builds.apache.org/job/ActiveMQ/job/ActiveMQ-Artemis-Master-JDK8/ws/artemis-features/target/classes/artemis.xml>
to org.apache.activemq/artemis-features/2.15.0-SNAPSHOT/artemis-features-2.15.0-SNAPSHOT-artemis.xml
[JENKINS] Archiving <https://ci-builds.apache.org/job/ActiveMQ/job/ActiveMQ-Artemis-Master-JDK8/ws/artemis-features/target/classes/org.apache.activemq.artemis.cfg>
to org.apache.activemq/artemis-features/2.15.0-SNAPSHOT/artemis-features-2.15.0-SNAPSHOT.cfg
[Fast Archiver] No prior successful build to compare, so performing full copy of artifacts
[JENKINS] Archiving <https://ci-builds.apache.org/job/ActiveMQ/job/ActiveMQ-Artemis-Master-JDK8/ws/artemis-commons/pom.xml>
to org.apache.activemq/artemis-commons/2.15.0-SNAPSHOT/artemis-commons-2.15.0-SNAPSHOT.pom
[JENKINS] Archiving <https://ci-builds.apache.org/job/ActiveMQ/job/ActiveMQ-Artemis-Master-JDK8/ws/artemis-commons/target/artemis-commons-2.15.0-SNAPSHOT.jar>
to org.apache.activemq/artemis-commons/2.15.0-SNAPSHOT/artemis-commons-2.15.0-SNAPSHOT.jar
[JENKINS] Archiving <https://ci-builds.apache.org/job/ActiveMQ/job/ActiveMQ-Artemis-Master-JDK8/ws/artemis-commons/target/artemis-commons-2.15.0-SNAPSHOT-tests.jar>
to org.apache.activemq/artemis-commons/2.15.0-SNAPSHOT/artemis-commons-2.15.0-SNAPSHOT-tests.jar
[JENKINS] Archiving <https://ci-builds.apache.org/job/ActiveMQ/job/ActiveMQ-Artemis-Master-JDK8/ws/artemis-commons/target/artemis-commons-2.15.0-SNAPSHOT-sources.jar>
to org.apache.activemq/artemis-commons/2.15.0-SNAPSHOT/artemis-commons-2.15.0-SNAPSHOT-sources.jar
[JENKINS] Archiving <https://ci-builds.apache.org/job/ActiveMQ/job/ActiveMQ-Artemis-Master-JDK8/ws/artemis-journal/pom.xml>
to org.apache.activemq/artemis-journal/2.15.0-SNAPSHOT/artemis-journal-2.15.0-SNAPSHOT.pom
[JENKINS] Archiving <https://ci-builds.apache.org/job/ActiveMQ/job/ActiveMQ-Artemis-Master-JDK8/ws/artemis-journal/target/artemis-journal-2.15.0-SNAPSHOT.jar>
to org.apache.activemq/artemis-journal/2.15.0-SNAPSHOT/artemis-journal-2.15.0-SNAPSHOT.jar
[JENKINS] Archiving <https://ci-builds.apache.org/job/ActiveMQ/job/ActiveMQ-Artemis-Master-JDK8/ws/artemis-journal/target/artemis-journal-2.15.0-SNAPSHOT-sources.jar>
to org.apache.activemq/artemis-journal/2.15.0-SNAPSHOT/artemis-journal-2.15.0-SNAPSHOT-sources.jar
[JENKINS] Archiving <https://ci-builds.apache.org/job/ActiveMQ/job/ActiveMQ-Artemis-Master-JDK8/ws/tests/soak-tests/pom.xml>
to org.apache.activemq.tests/soak-tests/2.15.0-SNAPSHOT/soak-tests-2.15.0-SNAPSHOT.pom
[Fast Archiver] No prior successful build to compare, so performing full copy of artifacts
[JENKINS] Archiving <https://ci-builds.apache.org/job/ActiveMQ/job/ActiveMQ-Artemis-Master-JDK8/ws/artemis-core-client/pom.xml>
to org.apache.activemq/artemis-core-client/2.15.0-SNAPSHOT/artemis-core-client-2.15.0-SNAPSHOT.pom
[JENKINS] Archiving <https://ci-builds.apache.org/job/ActiveMQ/job/ActiveMQ-Artemis-Master-JDK8/ws/artemis-core-client/target/artemis-core-client-2.15.0-SNAPSHOT.jar>
to org.apache.activemq/artemis-core-client/2.15.0-SNAPSHOT/artemis-core-client-2.15.0-SNAPSHOT.jar
[JENKINS] Archiving <https://ci-builds.apache.org/job/ActiveMQ/job/ActiveMQ-Artemis-Master-JDK8/ws/artemis-core-client/target/artemis-core-client-2.15.0-SNAPSHOT-tests.jar>
to org.apache.activemq/artemis-core-client/2.15.0-SNAPSHOT/artemis-core-client-2.15.0-SNAPSHOT-tests.jar
[JENKINS] Archiving <https://ci-builds.apache.org/job/ActiveMQ/job/ActiveMQ-Artemis-Master-JDK8/ws/artemis-core-client/target/artemis-core-client-2.15.0-SNAPSHOT-sources.jar>
to org.apache.activemq/artemis-core-client/2.15.0-SNAPSHOT/artemis-core-client-2.15.0-SNAPSHOT-sources.jar
[JENKINS] Archiving <https://ci-builds.apache.org/job/ActiveMQ/job/ActiveMQ-Artemis-Master-JDK8/ws/tests/timing-tests/pom.xml>
to org.apache.activemq.tests/timing-tests/2.15.0-SNAPSHOT/timing-tests-2.15.0-SNAPSHOT.pom
[JENKINS] Archiving <https://ci-builds.apache.org/job/ActiveMQ/job/ActiveMQ-Artemis-Master-JDK8/ws/tests/timing-tests/target/timing-tests-2.15.0-SNAPSHOT.jar>
to org.apache.activemq.tests/timing-tests/2.15.0-SNAPSHOT/timing-tests-2.15.0-SNAPSHOT.jar
[JENKINS] Archiving <https://ci-builds.apache.org/job/ActiveMQ/job/ActiveMQ-Artemis-Master-JDK8/ws/tests/timing-tests/target/timing-tests-2.15.0-SNAPSHOT-sources.jar>
to org.apache.activemq.tests/timing-tests/2.15.0-SNAPSHOT/timing-tests-2.15.0-SNAPSHOT-sources.jar
[JENKINS] Archiving <https://ci-builds.apache.org/job/ActiveMQ/job/ActiveMQ-Artemis-Master-JDK8/ws/tests/extra-tests/pom.xml>
to org.apache.activemq.tests/extra-tests/2.15.0-SNAPSHOT/extra-tests-2.15.0-SNAPSHOT.pom
[Fast Archiver] No prior successful build to compare, so performing full copy of artifacts
[JENKINS] Archiving <https://ci-builds.apache.org/job/ActiveMQ/job/ActiveMQ-Artemis-Master-JDK8/ws/artemis-jms-client-all/dependency-reduced-pom.xml>
to org.apache.activemq/artemis-jms-client-all/2.15.0-SNAPSHOT/artemis-jms-client-all-2.15.0-SNAPSHOT.pom
[JENKINS] Archiving <https://ci-builds.apache.org/job/ActiveMQ/job/ActiveMQ-Artemis-Master-JDK8/ws/artemis-jms-client-all/target/artemis-jms-client-all-2.15.0-SNAPSHOT.jar>
to org.apache.activemq/artemis-jms-client-all/2.15.0-SNAPSHOT/artemis-jms-client-all-2.15.0-SNAPSHOT.jar
[JENKINS] Archiving <https://ci-builds.apache.org/job/ActiveMQ/job/ActiveMQ-Artemis-Master-JDK8/ws/artemis-jms-client-all/target/artemis-jms-client-all-2.15.0-SNAPSHOT-sources.jar>
to org.apache.activemq/artemis-jms-client-all/2.15.0-SNAPSHOT/artemis-jms-client-all-2.15.0-SNAPSHOT-sources.jar
[Fast Archiver] Compressed 13.88 MB of artifacts by 62.4% relative to #1
[JENKINS] Archiving <https://ci-builds.apache.org/job/ActiveMQ/job/ActiveMQ-Artemis-Master-JDK8/ws/artemis-protocols/pom.xml>
to org.apache.activemq/artemis-protocols/2.15.0-SNAPSHOT/artemis-protocols-2.15.0-SNAPSHOT.pom
[JENKINS] Archiving <https://ci-builds.apache.org/job/ActiveMQ/job/ActiveMQ-Artemis-Master-JDK8/ws/artemis-hawtio/artemis-plugin/pom.xml>
to org.apache.activemq/artemis-plugin/2.15.0-SNAPSHOT/artemis-plugin-2.15.0-SNAPSHOT.pom
[JENKINS] Archiving <https://ci-builds.apache.org/job/ActiveMQ/job/ActiveMQ-Artemis-Master-JDK8/ws/artemis-hawtio/artemis-plugin/target/artemis-plugin-2.15.0-SNAPSHOT.war>
to org.apache.activemq/artemis-plugin/2.15.0-SNAPSHOT/artemis-plugin-2.15.0-SNAPSHOT.war
[JENKINS] Archiving <https://ci-builds.apache.org/job/ActiveMQ/job/ActiveMQ-Artemis-Master-JDK8/ws/artemis-hawtio/artemis-plugin/target/artemis-plugin-2.15.0-SNAPSHOT-sources.jar>
to org.apache.activemq/artemis-plugin/2.15.0-SNAPSHOT/artemis-plugin-2.15.0-SNAPSHOT-sources.jar
[JENKINS] Archiving <https://ci-builds.apache.org/job/ActiveMQ/job/ActiveMQ-Artemis-Master-JDK8/ws/artemis-dto/pom.xml>
to org.apache.activemq/artemis-dto/2.15.0-SNAPSHOT/artemis-dto-2.15.0-SNAPSHOT.pom
[JENKINS] Archiving <https://ci-builds.apache.org/job/ActiveMQ/job/ActiveMQ-Artemis-Master-JDK8/ws/artemis-dto/target/artemis-dto-2.15.0-SNAPSHOT.jar>
to org.apache.activemq/artemis-dto/2.15.0-SNAPSHOT/artemis-dto-2.15.0-SNAPSHOT.jar
[JENKINS] Archiving <https://ci-builds.apache.org/job/ActiveMQ/job/ActiveMQ-Artemis-Master-JDK8/ws/artemis-dto/target/artemis-dto-2.15.0-SNAPSHOT-sources.jar>
to org.apache.activemq/artemis-dto/2.15.0-SNAPSHOT/artemis-dto-2.15.0-SNAPSHOT-sources.jar
[JENKINS] Archiving <https://ci-builds.apache.org/job/ActiveMQ/job/ActiveMQ-Artemis-Master-JDK8/ws/artemis-protocols/artemis-hqclient-protocol/pom.xml>
to org.apache.activemq/artemis-hqclient-protocol/2.15.0-SNAPSHOT/artemis-hqclient-protocol-2.15.0-SNAPSHOT.pom
[JENKINS] Archiving <https://ci-builds.apache.org/job/ActiveMQ/job/ActiveMQ-Artemis-Master-JDK8/ws/artemis-protocols/artemis-hqclient-protocol/target/artemis-hqclient-protocol-2.15.0-SNAPSHOT.jar>
to org.apache.activemq/artemis-hqclient-protocol/2.15.0-SNAPSHOT/artemis-hqclient-protocol-2.15.0-SNAPSHOT.jar
[JENKINS] Archiving <https://ci-builds.apache.org/job/ActiveMQ/job/ActiveMQ-Artemis-Master-JDK8/ws/artemis-protocols/artemis-hqclient-protocol/target/artemis-hqclient-protocol-2.15.0-SNAPSHOT-sources.jar>
to org.apache.activemq/artemis-hqclient-protocol/2.15.0-SNAPSHOT/artemis-hqclient-protocol-2.15.0-SNAPSHOT-sources.jar
[JENKINS] Archiving <https://ci-builds.apache.org/job/ActiveMQ/job/ActiveMQ-Artemis-Master-JDK8/ws/artemis-jms-client-osgi/pom.xml>
to org.apache.activemq/artemis-jms-client-osgi/2.15.0-SNAPSHOT/artemis-jms-client-osgi-2.15.0-SNAPSHOT.pom
[JENKINS] Archiving <https://ci-builds.apache.org/job/ActiveMQ/job/ActiveMQ-Artemis-Master-JDK8/ws/artemis-jms-client-osgi/target/artemis-jms-client-osgi-2.15.0-SNAPSHOT.jar>
to org.apache.activemq/artemis-jms-client-osgi/2.15.0-SNAPSHOT/artemis-jms-client-osgi-2.15.0-SNAPSHOT.jar
[JENKINS] Archiving <https://ci-builds.apache.org/job/ActiveMQ/job/ActiveMQ-Artemis-Master-JDK8/ws/artemis-jms-client-osgi/target/artemis-jms-client-osgi-2.15.0-SNAPSHOT-sources.jar>
to org.apache.activemq/artemis-jms-client-osgi/2.15.0-SNAPSHOT/artemis-jms-client-osgi-2.15.0-SNAPSHOT-sources.jar
[JENKINS] Archiving <https://ci-builds.apache.org/job/ActiveMQ/job/ActiveMQ-Artemis-Master-JDK8/ws/tests/integration-tests/pom.xml>
to org.apache.activemq.tests/integration-tests/2.15.0-SNAPSHOT/integration-tests-2.15.0-SNAPSHOT.pom
[JENKINS] Archiving <https://ci-builds.apache.org/job/ActiveMQ/job/ActiveMQ-Artemis-Master-JDK8/ws/tests/integration-tests/target/integration-tests-2.15.0-SNAPSHOT.jar>
to org.apache.activemq.tests/integration-tests/2.15.0-SNAPSHOT/integration-tests-2.15.0-SNAPSHOT.jar
[JENKINS] Archiving <https://ci-builds.apache.org/job/ActiveMQ/job/ActiveMQ-Artemis-Master-JDK8/ws/tests/integration-tests/target/test-classes/rest/rest-test.war>
to org.apache.activemq.tests/integration-tests/2.15.0-SNAPSHOT/integration-tests-2.15.0-SNAPSHOT.war
[JENKINS] Archiving <https://ci-builds.apache.org/job/ActiveMQ/job/ActiveMQ-Artemis-Master-JDK8/ws/tests/integration-tests/target/integration-tests-2.15.0-SNAPSHOT-tests.jar>
to org.apache.activemq.tests/integration-tests/2.15.0-SNAPSHOT/integration-tests-2.15.0-SNAPSHOT-tests.jar
[JENKINS] Archiving <https://ci-builds.apache.org/job/ActiveMQ/job/ActiveMQ-Artemis-Master-JDK8/ws/tests/integration-tests/target/integration-tests-2.15.0-SNAPSHOT-sources.jar>
to org.apache.activemq.tests/integration-tests/2.15.0-SNAPSHOT/integration-tests-2.15.0-SNAPSHOT-sources.jar
[Fast Archiver] No prior successful build to compare, so performing full copy of artifacts
[JENKINS] Archiving <https://ci-builds.apache.org/job/ActiveMQ/job/ActiveMQ-Artemis-Master-JDK8/ws/artemis-boot/pom.xml>
to org.apache.activemq/artemis-boot/2.15.0-SNAPSHOT/artemis-boot-2.15.0-SNAPSHOT.pom
[JENKINS] Archiving <https://ci-builds.apache.org/job/ActiveMQ/job/ActiveMQ-Artemis-Master-JDK8/ws/artemis-boot/target/artemis-boot-2.15.0-SNAPSHOT.jar>
to org.apache.activemq/artemis-boot/2.15.0-SNAPSHOT/artemis-boot-2.15.0-SNAPSHOT.jar
[JENKINS] Archiving <https://ci-builds.apache.org/job/ActiveMQ/job/ActiveMQ-Artemis-Master-JDK8/ws/artemis-boot/target/artemis-boot-2.15.0-SNAPSHOT-sources.jar>
to org.apache.activemq/artemis-boot/2.15.0-SNAPSHOT/artemis-boot-2.15.0-SNAPSHOT-sources.jar
[JENKINS] Archiving <https://ci-builds.apache.org/job/ActiveMQ/job/ActiveMQ-Artemis-Master-JDK8/ws/artemis-website/pom.xml>
to org.apache.activemq/artemis-website/2.15.0-SNAPSHOT/artemis-website-2.15.0-SNAPSHOT.pom
[JENKINS] Archiving <https://ci-builds.apache.org/job/ActiveMQ/job/ActiveMQ-Artemis-Master-JDK8/ws/artemis-website/target/artemis-website-2.15.0-SNAPSHOT.jar>
to org.apache.activemq/artemis-website/2.15.0-SNAPSHOT/artemis-website-2.15.0-SNAPSHOT.jar
[JENKINS] Archiving <https://ci-builds.apache.org/job/ActiveMQ/job/ActiveMQ-Artemis-Master-JDK8/ws/artemis-website/target/artemis-website-2.15.0-SNAPSHOT-javadoc.jar>
to org.apache.activemq/artemis-website/2.15.0-SNAPSHOT/artemis-website-2.15.0-SNAPSHOT-javadoc.jar
[JENKINS] Archiving <https://ci-builds.apache.org/job/ActiveMQ/job/ActiveMQ-Artemis-Master-JDK8/ws/artemis-website/target/artemis-website-2.15.0-SNAPSHOT-sources.jar>
to org.apache.activemq/artemis-website/2.15.0-SNAPSHOT/artemis-website-2.15.0-SNAPSHOT-sources.jar
[JENKINS] Archiving <https://ci-builds.apache.org/job/ActiveMQ/job/ActiveMQ-Artemis-Master-JDK8/ws/artemis-protocols/artemis-amqp-protocol/pom.xml>
to org.apache.activemq/artemis-amqp-protocol/2.15.0-SNAPSHOT/artemis-amqp-protocol-2.15.0-SNAPSHOT.pom
[JENKINS] Archiving <https://ci-builds.apache.org/job/ActiveMQ/job/ActiveMQ-Artemis-Master-JDK8/ws/artemis-protocols/artemis-amqp-protocol/target/artemis-amqp-protocol-2.15.0-SNAPSHOT.jar>
to org.apache.activemq/artemis-amqp-protocol/2.15.0-SNAPSHOT/artemis-amqp-protocol-2.15.0-SNAPSHOT.jar
[JENKINS] Archiving <https://ci-builds.apache.org/job/ActiveMQ/job/ActiveMQ-Artemis-Master-JDK8/ws/artemis-protocols/artemis-amqp-protocol/target/artemis-amqp-protocol-2.15.0-SNAPSHOT-sources.jar>
to org.apache.activemq/artemis-amqp-protocol/2.15.0-SNAPSHOT/artemis-amqp-protocol-2.15.0-SNAPSHOT-sources.jar
[JENKINS] Archiving <https://ci-builds.apache.org/job/ActiveMQ/job/ActiveMQ-Artemis-Master-JDK8/ws/artemis-protocols/artemis-mqtt-protocol/pom.xml>
to org.apache.activemq/artemis-mqtt-protocol/2.15.0-SNAPSHOT/artemis-mqtt-protocol-2.15.0-SNAPSHOT.pom
[JENKINS] Archiving <https://ci-builds.apache.org/job/ActiveMQ/job/ActiveMQ-Artemis-Master-JDK8/ws/artemis-protocols/artemis-mqtt-protocol/target/artemis-mqtt-protocol-2.15.0-SNAPSHOT.jar>
to org.apache.activemq/artemis-mqtt-protocol/2.15.0-SNAPSHOT/artemis-mqtt-protocol-2.15.0-SNAPSHOT.jar
[JENKINS] Archiving <https://ci-builds.apache.org/job/ActiveMQ/job/ActiveMQ-Artemis-Master-JDK8/ws/artemis-protocols/artemis-mqtt-protocol/target/artemis-mqtt-protocol-2.15.0-SNAPSHOT-sources.jar>
to org.apache.activemq/artemis-mqtt-protocol/2.15.0-SNAPSHOT/artemis-mqtt-protocol-2.15.0-SNAPSHOT-sources.jar
[JENKINS] Archiving <https://ci-builds.apache.org/job/ActiveMQ/job/ActiveMQ-Artemis-Master-JDK8/ws/artemis-hawtio/pom.xml>
to org.apache.activemq/artemis-hawtio-pom/2.15.0-SNAPSHOT/artemis-hawtio-pom-2.15.0-SNAPSHOT.pom
[JENKINS] Archiving <https://ci-builds.apache.org/job/ActiveMQ/job/ActiveMQ-Artemis-Master-JDK8/ws/tests/stress-tests/pom.xml>
to org.apache.activemq.tests/stress-tests/2.15.0-SNAPSHOT/stress-tests-2.15.0-SNAPSHOT.pom
[Fast Archiver] No prior successful build to compare, so performing full copy of artifacts
channel stopped


Mime
View raw message