activemq-commits mailing list archives

Site index · List index
Message view « Date » · « Thread »
Top « Date » · « Thread »
From Apache Jenkins Server <jenk...@builds.apache.org>
Subject Build failed in Jenkins: ActiveMQ-Java8-5.15.x #483
Date Sat, 09 May 2020 05:42:14 GMT
See <https://builds.apache.org/job/ActiveMQ-Java8-5.15.x/483/display/redirect?page=changes>

Changes:

[jbonofre] conn.start deprecated, id argument necessary by conn.subscribe


------------------------------------------
[...truncated 35.74 KB...]
    at java.lang.reflect.Method.invoke (Method.java:498)
    at hudson.maven.Maven3Builder.call (Maven3Builder.java:139)
    at hudson.maven.Maven3Builder.call (Maven3Builder.java:70)
    at hudson.remoting.UserRequest.perform (UserRequest.java:212)
    at hudson.remoting.UserRequest.perform (UserRequest.java:54)
    at hudson.remoting.Request$2.run (Request.java:369)
    at hudson.remoting.InterceptingExecutorService$1.call (InterceptingExecutorService.java:72)
    at java.util.concurrent.FutureTask.run (FutureTask.java:266)
    at java.util.concurrent.ThreadPoolExecutor.runWorker (ThreadPoolExecutor.java:1149)
    at java.util.concurrent.ThreadPoolExecutor$Worker.run (ThreadPoolExecutor.java:624)
    at java.lang.Thread.run (Thread.java:748)
Caused by: org.eclipse.aether.deployment.DeploymentException: Failed to retrieve remote metadata
org.apache.activemq:activemq-parent:5.15.13-SNAPSHOT/maven-metadata.xml: Could not transfer
metadata org.apache.activemq:activemq-parent:5.15.13-SNAPSHOT/maven-metadata.xml from/to apache.snapshots.https
(https://repository.apache.org/content/repositories/snapshots): Transfer failed for https://repository.apache.org/content/repositories/snapshots/org/apache/activemq/activemq-parent/5.15.13-SNAPSHOT/maven-metadata.xml
500 Server Error
    at org.eclipse.aether.internal.impl.DefaultDeployer.upload (DefaultDeployer.java:426)
    at org.eclipse.aether.internal.impl.DefaultDeployer.deploy (DefaultDeployer.java:256)
    at org.eclipse.aether.internal.impl.DefaultDeployer.deploy (DefaultDeployer.java:213)
    at org.eclipse.aether.internal.impl.DefaultRepositorySystem.deploy (DefaultRepositorySystem.java:386)
    at org.apache.maven.artifact.deployer.DefaultArtifactDeployer.deploy (DefaultArtifactDeployer.java:142)
    at org.apache.maven.plugin.deploy.AbstractDeployMojo.deploy (AbstractDeployMojo.java:171)
    at org.apache.maven.plugin.deploy.DeployMojo.deployProject (DeployMojo.java:242)
    at org.apache.maven.plugin.deploy.DeployMojo.execute (DeployMojo.java:169)
    at org.apache.maven.plugin.DefaultBuildPluginManager.executeMojo (DefaultBuildPluginManager.java:137)
    at org.apache.maven.lifecycle.internal.MojoExecutor.execute (MojoExecutor.java:210)
    at org.apache.maven.lifecycle.internal.MojoExecutor.execute (MojoExecutor.java:156)
    at org.apache.maven.lifecycle.internal.MojoExecutor.execute (MojoExecutor.java:148)
    at org.apache.maven.lifecycle.internal.LifecycleModuleBuilder.buildProject (LifecycleModuleBuilder.java:117)
    at org.apache.maven.lifecycle.internal.LifecycleModuleBuilder.buildProject (LifecycleModuleBuilder.java:81)
    at org.apache.maven.lifecycle.internal.builder.singlethreaded.SingleThreadedBuilder.build
(SingleThreadedBuilder.java:56)
    at org.apache.maven.lifecycle.internal.LifecycleStarter.execute (LifecycleStarter.java:128)
    at org.apache.maven.DefaultMaven.doExecute (DefaultMaven.java:305)
    at org.apache.maven.DefaultMaven.doExecute (DefaultMaven.java:192)
    at org.apache.maven.DefaultMaven.execute (DefaultMaven.java:105)
    at org.jvnet.hudson.maven3.launcher.Maven35Launcher.main (Maven35Launcher.java:130)
    at sun.reflect.NativeMethodAccessorImpl.invoke0 (Native Method)
    at sun.reflect.NativeMethodAccessorImpl.invoke (NativeMethodAccessorImpl.java:62)
    at sun.reflect.DelegatingMethodAccessorImpl.invoke (DelegatingMethodAccessorImpl.java:43)
    at java.lang.reflect.Method.invoke (Method.java:498)
    at org.codehaus.plexus.classworlds.launcher.Launcher.launchEnhanced (Launcher.java:282)
    at org.codehaus.plexus.classworlds.launcher.Launcher.launch (Launcher.java:225)
    at jenkins.maven3.agent.Maven35Main.launch (Maven35Main.java:178)
    at sun.reflect.NativeMethodAccessorImpl.invoke0 (Native Method)
    at sun.reflect.NativeMethodAccessorImpl.invoke (NativeMethodAccessorImpl.java:62)
    at sun.reflect.DelegatingMethodAccessorImpl.invoke (DelegatingMethodAccessorImpl.java:43)
    at java.lang.reflect.Method.invoke (Method.java:498)
    at hudson.maven.Maven3Builder.call (Maven3Builder.java:139)
    at hudson.maven.Maven3Builder.call (Maven3Builder.java:70)
    at hudson.remoting.UserRequest.perform (UserRequest.java:212)
    at hudson.remoting.UserRequest.perform (UserRequest.java:54)
    at hudson.remoting.Request$2.run (Request.java:369)
    at hudson.remoting.InterceptingExecutorService$1.call (InterceptingExecutorService.java:72)
    at java.util.concurrent.FutureTask.run (FutureTask.java:266)
    at java.util.concurrent.ThreadPoolExecutor.runWorker (ThreadPoolExecutor.java:1149)
    at java.util.concurrent.ThreadPoolExecutor$Worker.run (ThreadPoolExecutor.java:624)
    at java.lang.Thread.run (Thread.java:748)
Caused by: org.eclipse.aether.transfer.MetadataTransferException: Could not transfer metadata
org.apache.activemq:activemq-parent:5.15.13-SNAPSHOT/maven-metadata.xml from/to apache.snapshots.https
(https://repository.apache.org/content/repositories/snapshots): Transfer failed for https://repository.apache.org/content/repositories/snapshots/org/apache/activemq/activemq-parent/5.15.13-SNAPSHOT/maven-metadata.xml
500 Server Error
    at org.eclipse.aether.connector.basic.MetadataTransportListener.transferFailed (MetadataTransportListener.java:52)
    at org.eclipse.aether.connector.basic.BasicRepositoryConnector$TaskRunner.run (BasicRepositoryConnector.java:369)
    at org.eclipse.aether.util.concurrency.RunnableErrorForwarder$1.run (RunnableErrorForwarder.java:75)
    at org.eclipse.aether.connector.basic.BasicRepositoryConnector$DirectExecutor.execute
(BasicRepositoryConnector.java:644)
    at org.eclipse.aether.connector.basic.BasicRepositoryConnector.get (BasicRepositoryConnector.java:235)
    at org.eclipse.aether.internal.impl.DefaultDeployer.upload (DefaultDeployer.java:399)
    at org.eclipse.aether.internal.impl.DefaultDeployer.deploy (DefaultDeployer.java:256)
    at org.eclipse.aether.internal.impl.DefaultDeployer.deploy (DefaultDeployer.java:213)
    at org.eclipse.aether.internal.impl.DefaultRepositorySystem.deploy (DefaultRepositorySystem.java:386)
    at org.apache.maven.artifact.deployer.DefaultArtifactDeployer.deploy (DefaultArtifactDeployer.java:142)
    at org.apache.maven.plugin.deploy.AbstractDeployMojo.deploy (AbstractDeployMojo.java:171)
    at org.apache.maven.plugin.deploy.DeployMojo.deployProject (DeployMojo.java:242)
    at org.apache.maven.plugin.deploy.DeployMojo.execute (DeployMojo.java:169)
    at org.apache.maven.plugin.DefaultBuildPluginManager.executeMojo (DefaultBuildPluginManager.java:137)
    at org.apache.maven.lifecycle.internal.MojoExecutor.execute (MojoExecutor.java:210)
    at org.apache.maven.lifecycle.internal.MojoExecutor.execute (MojoExecutor.java:156)
    at org.apache.maven.lifecycle.internal.MojoExecutor.execute (MojoExecutor.java:148)
    at org.apache.maven.lifecycle.internal.LifecycleModuleBuilder.buildProject (LifecycleModuleBuilder.java:117)
    at org.apache.maven.lifecycle.internal.LifecycleModuleBuilder.buildProject (LifecycleModuleBuilder.java:81)
    at org.apache.maven.lifecycle.internal.builder.singlethreaded.SingleThreadedBuilder.build
(SingleThreadedBuilder.java:56)
    at org.apache.maven.lifecycle.internal.LifecycleStarter.execute (LifecycleStarter.java:128)
    at org.apache.maven.DefaultMaven.doExecute (DefaultMaven.java:305)
    at org.apache.maven.DefaultMaven.doExecute (DefaultMaven.java:192)
    at org.apache.maven.DefaultMaven.execute (DefaultMaven.java:105)
    at org.jvnet.hudson.maven3.launcher.Maven35Launcher.main (Maven35Launcher.java:130)
    at sun.reflect.NativeMethodAccessorImpl.invoke0 (Native Method)
    at sun.reflect.NativeMethodAccessorImpl.invoke (NativeMethodAccessorImpl.java:62)
    at sun.reflect.DelegatingMethodAccessorImpl.invoke (DelegatingMethodAccessorImpl.java:43)
    at java.lang.reflect.Method.invoke (Method.java:498)
    at org.codehaus.plexus.classworlds.launcher.Launcher.launchEnhanced (Launcher.java:282)
    at org.codehaus.plexus.classworlds.launcher.Launcher.launch (Launcher.java:225)
    at jenkins.maven3.agent.Maven35Main.launch (Maven35Main.java:178)
    at sun.reflect.NativeMethodAccessorImpl.invoke0 (Native Method)
    at sun.reflect.NativeMethodAccessorImpl.invoke (NativeMethodAccessorImpl.java:62)
    at sun.reflect.DelegatingMethodAccessorImpl.invoke (DelegatingMethodAccessorImpl.java:43)
    at java.lang.reflect.Method.invoke (Method.java:498)
    at hudson.maven.Maven3Builder.call (Maven3Builder.java:139)
    at hudson.maven.Maven3Builder.call (Maven3Builder.java:70)
    at hudson.remoting.UserRequest.perform (UserRequest.java:212)
    at hudson.remoting.UserRequest.perform (UserRequest.java:54)
    at hudson.remoting.Request$2.run (Request.java:369)
    at hudson.remoting.InterceptingExecutorService$1.call (InterceptingExecutorService.java:72)
    at java.util.concurrent.FutureTask.run (FutureTask.java:266)
    at java.util.concurrent.ThreadPoolExecutor.runWorker (ThreadPoolExecutor.java:1149)
    at java.util.concurrent.ThreadPoolExecutor$Worker.run (ThreadPoolExecutor.java:624)
    at java.lang.Thread.run (Thread.java:748)
Caused by: org.apache.maven.wagon.TransferFailedException: Transfer failed for https://repository.apache.org/content/repositories/snapshots/org/apache/activemq/activemq-parent/5.15.13-SNAPSHOT/maven-metadata.xml
500 Server Error
    at org.apache.maven.wagon.providers.http.wagon.shared.AbstractHttpClientWagon.fillInputData
(AbstractHttpClientWagon.java:1196)
    at org.apache.maven.wagon.providers.http.wagon.shared.AbstractHttpClientWagon.fillInputData
(AbstractHttpClientWagon.java:1138)
    at org.apache.maven.wagon.StreamWagon.getInputStream (StreamWagon.java:126)
    at org.apache.maven.wagon.StreamWagon.getIfNewer (StreamWagon.java:88)
    at org.apache.maven.wagon.StreamWagon.get (StreamWagon.java:61)
    at org.eclipse.aether.transport.wagon.WagonTransporter$GetTaskRunner.run (WagonTransporter.java:567)
    at org.eclipse.aether.transport.wagon.WagonTransporter.execute (WagonTransporter.java:435)
    at org.eclipse.aether.transport.wagon.WagonTransporter.get (WagonTransporter.java:412)
    at org.eclipse.aether.connector.basic.BasicRepositoryConnector$GetTaskRunner.runTask (BasicRepositoryConnector.java:457)
    at org.eclipse.aether.connector.basic.BasicRepositoryConnector$TaskRunner.run (BasicRepositoryConnector.java:364)
    at org.eclipse.aether.util.concurrency.RunnableErrorForwarder$1.run (RunnableErrorForwarder.java:75)
    at org.eclipse.aether.connector.basic.BasicRepositoryConnector$DirectExecutor.execute
(BasicRepositoryConnector.java:644)
    at org.eclipse.aether.connector.basic.BasicRepositoryConnector.get (BasicRepositoryConnector.java:235)
    at org.eclipse.aether.internal.impl.DefaultDeployer.upload (DefaultDeployer.java:399)
    at org.eclipse.aether.internal.impl.DefaultDeployer.deploy (DefaultDeployer.java:256)
    at org.eclipse.aether.internal.impl.DefaultDeployer.deploy (DefaultDeployer.java:213)
    at org.eclipse.aether.internal.impl.DefaultRepositorySystem.deploy (DefaultRepositorySystem.java:386)
    at org.apache.maven.artifact.deployer.DefaultArtifactDeployer.deploy (DefaultArtifactDeployer.java:142)
    at org.apache.maven.plugin.deploy.AbstractDeployMojo.deploy (AbstractDeployMojo.java:171)
    at org.apache.maven.plugin.deploy.DeployMojo.deployProject (DeployMojo.java:242)
    at org.apache.maven.plugin.deploy.DeployMojo.execute (DeployMojo.java:169)
    at org.apache.maven.plugin.DefaultBuildPluginManager.executeMojo (DefaultBuildPluginManager.java:137)
    at org.apache.maven.lifecycle.internal.MojoExecutor.execute (MojoExecutor.java:210)
    at org.apache.maven.lifecycle.internal.MojoExecutor.execute (MojoExecutor.java:156)
    at org.apache.maven.lifecycle.internal.MojoExecutor.execute (MojoExecutor.java:148)
    at org.apache.maven.lifecycle.internal.LifecycleModuleBuilder.buildProject (LifecycleModuleBuilder.java:117)
    at org.apache.maven.lifecycle.internal.LifecycleModuleBuilder.buildProject (LifecycleModuleBuilder.java:81)
    at org.apache.maven.lifecycle.internal.builder.singlethreaded.SingleThreadedBuilder.build
(SingleThreadedBuilder.java:56)
    at org.apache.maven.lifecycle.internal.LifecycleStarter.execute (LifecycleStarter.java:128)
    at org.apache.maven.DefaultMaven.doExecute (DefaultMaven.java:305)
    at org.apache.maven.DefaultMaven.doExecute (DefaultMaven.java:192)
    at org.apache.maven.DefaultMaven.execute (DefaultMaven.java:105)
    at org.jvnet.hudson.maven3.launcher.Maven35Launcher.main (Maven35Launcher.java:130)
    at sun.reflect.NativeMethodAccessorImpl.invoke0 (Native Method)
    at sun.reflect.NativeMethodAccessorImpl.invoke (NativeMethodAccessorImpl.java:62)
    at sun.reflect.DelegatingMethodAccessorImpl.invoke (DelegatingMethodAccessorImpl.java:43)
    at java.lang.reflect.Method.invoke (Method.java:498)
    at org.codehaus.plexus.classworlds.launcher.Launcher.launchEnhanced (Launcher.java:282)
    at org.codehaus.plexus.classworlds.launcher.Launcher.launch (Launcher.java:225)
    at jenkins.maven3.agent.Maven35Main.launch (Maven35Main.java:178)
    at sun.reflect.NativeMethodAccessorImpl.invoke0 (Native Method)
    at sun.reflect.NativeMethodAccessorImpl.invoke (NativeMethodAccessorImpl.java:62)
    at sun.reflect.DelegatingMethodAccessorImpl.invoke (DelegatingMethodAccessorImpl.java:43)
    at java.lang.reflect.Method.invoke (Method.java:498)
    at hudson.maven.Maven3Builder.call (Maven3Builder.java:139)
    at hudson.maven.Maven3Builder.call (Maven3Builder.java:70)
    at hudson.remoting.UserRequest.perform (UserRequest.java:212)
    at hudson.remoting.UserRequest.perform (UserRequest.java:54)
    at hudson.remoting.Request$2.run (Request.java:369)
    at hudson.remoting.InterceptingExecutorService$1.call (InterceptingExecutorService.java:72)
    at java.util.concurrent.FutureTask.run (FutureTask.java:266)
    at java.util.concurrent.ThreadPoolExecutor.runWorker (ThreadPoolExecutor.java:1149)
    at java.util.concurrent.ThreadPoolExecutor$Worker.run (ThreadPoolExecutor.java:624)
    at java.lang.Thread.run (Thread.java:748)
[ERROR] 
[ERROR] Re-run Maven using the -X switch to enable full debug logging.
[ERROR] 
[ERROR] For more information about the errors and possible solutions, please read the following
articles:
[ERROR] [Help 1] http://cwiki.apache.org/confluence/display/MAVEN/MojoExecutionException
[JENKINS] Archiving <https://builds.apache.org/job/ActiveMQ-Java8-5.15.x/ws/activemq-kahadb-store/pom.xml>
to org.apache.activemq/activemq-kahadb-store/5.15.13-SNAPSHOT/activemq-kahadb-store-5.15.13-SNAPSHOT.pom
[JENKINS] Archiving <https://builds.apache.org/job/ActiveMQ-Java8-5.15.x/ws/activemq-osgi/pom.xml>
to org.apache.activemq/activemq-osgi/5.15.13-SNAPSHOT/activemq-osgi-5.15.13-SNAPSHOT.pom
[JENKINS] Archiving <https://builds.apache.org/job/ActiveMQ-Java8-5.15.x/ws/activemq-unit-tests/pom.xml>
to org.apache.activemq/activemq-unit-tests/5.15.13-SNAPSHOT/activemq-unit-tests-5.15.13-SNAPSHOT.pom
[Fast Archiver] Compressed 71.84 KB of artifacts by 44.5% relative to #481
[JENKINS] Archiving <https://builds.apache.org/job/ActiveMQ-Java8-5.15.x/ws/activemq-openwire-legacy/pom.xml>
to org.apache.activemq/activemq-openwire-legacy/5.15.13-SNAPSHOT/activemq-openwire-legacy-5.15.13-SNAPSHOT.pom
[JENKINS] Archiving <https://builds.apache.org/job/ActiveMQ-Java8-5.15.x/ws/activemq-karaf-itest/pom.xml>
to org.apache.activemq/activemq-karaf-itest/5.15.13-SNAPSHOT/activemq-karaf-itest-5.15.13-SNAPSHOT.pom
[JENKINS] Archiving <https://builds.apache.org/job/ActiveMQ-Java8-5.15.x/ws/activemq-rar/pom.xml>
to org.apache.activemq/activemq-rar/5.15.13-SNAPSHOT/activemq-rar-5.15.13-SNAPSHOT.pom
[JENKINS] Archiving <https://builds.apache.org/job/ActiveMQ-Java8-5.15.x/ws/activemq-http/pom.xml>
to org.apache.activemq/activemq-http/5.15.13-SNAPSHOT/activemq-http-5.15.13-SNAPSHOT.pom
[JENKINS] Archiving <https://builds.apache.org/job/ActiveMQ-Java8-5.15.x/ws/activemq-amqp/pom.xml>
to org.apache.activemq/activemq-amqp/5.15.13-SNAPSHOT/activemq-amqp-5.15.13-SNAPSHOT.pom
[JENKINS] Archiving <https://builds.apache.org/job/ActiveMQ-Java8-5.15.x/ws/activemq-client/pom.xml>
to org.apache.activemq/activemq-client/5.15.13-SNAPSHOT/activemq-client-5.15.13-SNAPSHOT.pom
[JENKINS] Archiving <https://builds.apache.org/job/ActiveMQ-Java8-5.15.x/ws/activemq-blueprint/pom.xml>
to org.apache.activemq/activemq-blueprint/5.15.13-SNAPSHOT/activemq-blueprint-5.15.13-SNAPSHOT.pom
[JENKINS] Archiving <https://builds.apache.org/job/ActiveMQ-Java8-5.15.x/ws/activemq-tooling/activemq-junit/pom.xml>
to org.apache.activemq.tooling/activemq-junit/5.15.13-SNAPSHOT/activemq-junit-5.15.13-SNAPSHOT.pom
[JENKINS] Archiving <https://builds.apache.org/job/ActiveMQ-Java8-5.15.x/ws/activemq-tooling/pom.xml>
to org.apache.activemq.tooling/activemq-tooling/5.15.13-SNAPSHOT/activemq-tooling-5.15.13-SNAPSHOT.pom
[JENKINS] Archiving <https://builds.apache.org/job/ActiveMQ-Java8-5.15.x/ws/activemq-jms-pool/pom.xml>
to org.apache.activemq/activemq-jms-pool/5.15.13-SNAPSHOT/activemq-jms-pool-5.15.13-SNAPSHOT.pom
[JENKINS] Archiving <https://builds.apache.org/job/ActiveMQ-Java8-5.15.x/ws/activemq-pool/pom.xml>
to org.apache.activemq/activemq-pool/5.15.13-SNAPSHOT/activemq-pool-5.15.13-SNAPSHOT.pom
[JENKINS] Archiving <https://builds.apache.org/job/ActiveMQ-Java8-5.15.x/ws/activemq-jdbc-store/pom.xml>
to org.apache.activemq/activemq-jdbc-store/5.15.13-SNAPSHOT/activemq-jdbc-store-5.15.13-SNAPSHOT.pom
[JENKINS] Archiving <https://builds.apache.org/job/ActiveMQ-Java8-5.15.x/ws/activemq-camel/pom.xml>
to org.apache.activemq/activemq-camel/5.15.13-SNAPSHOT/activemq-camel-5.15.13-SNAPSHOT.pom
[JENKINS] Archiving <https://builds.apache.org/job/ActiveMQ-Java8-5.15.x/ws/activemq-runtime-config/pom.xml>
to org.apache.activemq/activemq-runtime-config/5.15.13-SNAPSHOT/activemq-runtime-config-5.15.13-SNAPSHOT.pom
[JENKINS] Archiving <https://builds.apache.org/job/ActiveMQ-Java8-5.15.x/ws/pom.xml>
to org.apache.activemq/activemq-parent/5.15.13-SNAPSHOT/activemq-parent-5.15.13-SNAPSHOT.pom
[Fast Archiver] Compressed 61.49 KB of artifacts by 52.0% relative to #481
[JENKINS] Archiving <https://builds.apache.org/job/ActiveMQ-Java8-5.15.x/ws/activemq-stomp/pom.xml>
to org.apache.activemq/activemq-stomp/5.15.13-SNAPSHOT/activemq-stomp-5.15.13-SNAPSHOT.pom
[JENKINS] Archiving <https://builds.apache.org/job/ActiveMQ-Java8-5.15.x/ws/activemq-openwire-generator/pom.xml>
to org.apache.activemq/activemq-openwire-generator/5.15.13-SNAPSHOT/activemq-openwire-generator-5.15.13-SNAPSHOT.pom
[JENKINS] Archiving <https://builds.apache.org/job/ActiveMQ-Java8-5.15.x/ws/activemq-broker/pom.xml>
to org.apache.activemq/activemq-broker/5.15.13-SNAPSHOT/activemq-broker-5.15.13-SNAPSHOT.pom
[JENKINS] Archiving <https://builds.apache.org/job/ActiveMQ-Java8-5.15.x/ws/activemq-web-demo/pom.xml>
to org.apache.activemq/activemq-web-demo/5.15.13-SNAPSHOT/activemq-web-demo-5.15.13-SNAPSHOT.pom
[JENKINS] Archiving <https://builds.apache.org/job/ActiveMQ-Java8-5.15.x/ws/activemq-mqtt/pom.xml>
to org.apache.activemq/activemq-mqtt/5.15.13-SNAPSHOT/activemq-mqtt-5.15.13-SNAPSHOT.pom
[JENKINS] Archiving <https://builds.apache.org/job/ActiveMQ-Java8-5.15.x/ws/activemq-shiro/pom.xml>
to org.apache.activemq/activemq-shiro/5.15.13-SNAPSHOT/activemq-shiro-5.15.13-SNAPSHOT.pom
[JENKINS] Archiving <https://builds.apache.org/job/ActiveMQ-Java8-5.15.x/ws/activemq-tooling/activemq-perf-maven-plugin/pom.xml>
to org.apache.activemq.tooling/activemq-perf-maven-plugin/5.15.13-SNAPSHOT/activemq-perf-maven-plugin-5.15.13-SNAPSHOT.pom
[JENKINS] Archiving <https://builds.apache.org/job/ActiveMQ-Java8-5.15.x/ws/activemq-run/pom.xml>
to org.apache.activemq/activemq-run/5.15.13-SNAPSHOT/activemq-run-5.15.13-SNAPSHOT.pom
[JENKINS] Archiving <https://builds.apache.org/job/ActiveMQ-Java8-5.15.x/ws/activemq-tooling/activemq-maven-plugin/pom.xml>
to org.apache.activemq.tooling/activemq-maven-plugin/5.15.13-SNAPSHOT/activemq-maven-plugin-5.15.13-SNAPSHOT.pom
[JENKINS] Archiving <https://builds.apache.org/job/ActiveMQ-Java8-5.15.x/ws/activemq-karaf/pom.xml>
to org.apache.activemq/activemq-karaf/5.15.13-SNAPSHOT/activemq-karaf-5.15.13-SNAPSHOT.pom
[JENKINS] Archiving <https://builds.apache.org/job/ActiveMQ-Java8-5.15.x/ws/activemq-web-console/pom.xml>
to org.apache.activemq/activemq-web-console/5.15.13-SNAPSHOT/activemq-web-console-5.15.13-SNAPSHOT.pom
[JENKINS] Archiving <https://builds.apache.org/job/ActiveMQ-Java8-5.15.x/ws/activemq-jaas/pom.xml>
to org.apache.activemq/activemq-jaas/5.15.13-SNAPSHOT/activemq-jaas-5.15.13-SNAPSHOT.pom
[JENKINS] Archiving <https://builds.apache.org/job/ActiveMQ-Java8-5.15.x/ws/activemq-itests-spring31/pom.xml>
to org.apache.activemq/activemq-itests-spring31/5.15.13-SNAPSHOT/activemq-itests-spring31-5.15.13-SNAPSHOT.pom
[JENKINS] Archiving <https://builds.apache.org/job/ActiveMQ-Java8-5.15.x/ws/activemq-tooling/activemq-memtest-maven-plugin/pom.xml>
to org.apache.activemq.tooling/activemq-memtest-maven-plugin/5.15.13-SNAPSHOT/activemq-memtest-maven-plugin-5.15.13-SNAPSHOT.pom
[JENKINS] Archiving <https://builds.apache.org/job/ActiveMQ-Java8-5.15.x/ws/activemq-ra/pom.xml>
to org.apache.activemq/activemq-ra/5.15.13-SNAPSHOT/activemq-ra-5.15.13-SNAPSHOT.pom
[JENKINS] Archiving <https://builds.apache.org/job/ActiveMQ-Java8-5.15.x/ws/activemq-partition/pom.xml>
to org.apache.activemq/activemq-partition/5.15.13-SNAPSHOT/activemq-partition-5.15.13-SNAPSHOT.pom
[JENKINS] Archiving <https://builds.apache.org/job/ActiveMQ-Java8-5.15.x/ws/activemq-all/pom.xml>
to org.apache.activemq/activemq-all/5.15.13-SNAPSHOT/activemq-all-5.15.13-SNAPSHOT.pom
[JENKINS] Archiving <https://builds.apache.org/job/ActiveMQ-Java8-5.15.x/ws/assembly/pom.xml>
to org.apache.activemq/apache-activemq/5.15.13-SNAPSHOT/apache-activemq-5.15.13-SNAPSHOT.pom
[JENKINS] Archiving <https://builds.apache.org/job/ActiveMQ-Java8-5.15.x/ws/activemq-console/pom.xml>
to org.apache.activemq/activemq-console/5.15.13-SNAPSHOT/activemq-console-5.15.13-SNAPSHOT.pom
[JENKINS] Archiving <https://builds.apache.org/job/ActiveMQ-Java8-5.15.x/ws/activemq-spring/pom.xml>
to org.apache.activemq/activemq-spring/5.15.13-SNAPSHOT/activemq-spring-5.15.13-SNAPSHOT.pom
[JENKINS] Archiving <https://builds.apache.org/job/ActiveMQ-Java8-5.15.x/ws/activemq-cf/pom.xml>
to org.apache.activemq/activemq-cf/5.15.13-SNAPSHOT/activemq-cf-5.15.13-SNAPSHOT.pom
[JENKINS] Archiving <https://builds.apache.org/job/ActiveMQ-Java8-5.15.x/ws/activemq-leveldb-store/pom.xml>
to org.apache.activemq/activemq-leveldb-store/5.15.13-SNAPSHOT/activemq-leveldb-store-5.15.13-SNAPSHOT.pom
[JENKINS] Archiving <https://builds.apache.org/job/ActiveMQ-Java8-5.15.x/ws/activemq-web/pom.xml>
to org.apache.activemq/activemq-web/5.15.13-SNAPSHOT/activemq-web-5.15.13-SNAPSHOT.pom
[JENKINS] Archiving <https://builds.apache.org/job/ActiveMQ-Java8-5.15.x/ws/activemq-log4j-appender/pom.xml>
to org.apache.activemq/activemq-log4j-appender/5.15.13-SNAPSHOT/activemq-log4j-appender-5.15.13-SNAPSHOT.pom
No mail will be sent out, as 'ActiveMQ-Java8-5.15.x » ActiveMQ :: KahaDB Store #483' does
not have a result yet. Please make sure you set a proper result in case of pipeline/build
scripts.
No mail will be sent out, as 'ActiveMQ-Java8-5.15.x » ActiveMQ :: OSGi bundle #483' does
not have a result yet. Please make sure you set a proper result in case of pipeline/build
scripts.
No mail will be sent out, as 'ActiveMQ-Java8-5.15.x » ActiveMQ :: Unit Tests #483' does
not have a result yet. Please make sure you set a proper result in case of pipeline/build
scripts.
No mail will be sent out, as 'ActiveMQ-Java8-5.15.x » ActiveMQ :: Openwire Legacy Support
#483' does not have a result yet. Please make sure you set a proper result in case of pipeline/build
scripts.
No mail will be sent out, as 'ActiveMQ-Java8-5.15.x » ActiveMQ :: Karaf Integration Tests
#483' does not have a result yet. Please make sure you set a proper result in case of pipeline/build
scripts.
No mail will be sent out, as 'ActiveMQ-Java8-5.15.x » ActiveMQ :: RAR #483' does not have
a result yet. Please make sure you set a proper result in case of pipeline/build scripts.
No mail will be sent out, as 'ActiveMQ-Java8-5.15.x » ActiveMQ :: HTTP Protocol Support
#483' does not have a result yet. Please make sure you set a proper result in case of pipeline/build
scripts.
No mail will be sent out, as 'ActiveMQ-Java8-5.15.x » ActiveMQ :: AMQP #483' does not have
a result yet. Please make sure you set a proper result in case of pipeline/build scripts.
No mail will be sent out, as 'ActiveMQ-Java8-5.15.x » ActiveMQ :: Client #483' does not
have a result yet. Please make sure you set a proper result in case of pipeline/build scripts.
No mail will be sent out, as 'ActiveMQ-Java8-5.15.x » ActiveMQ :: Blueprint #483' does
not have a result yet. Please make sure you set a proper result in case of pipeline/build
scripts.
No mail will be sent out, as 'ActiveMQ-Java8-5.15.x » ActiveMQ :: JUnit Rule #483' does
not have a result yet. Please make sure you set a proper result in case of pipeline/build
scripts.
No mail will be sent out, as 'ActiveMQ-Java8-5.15.x » ActiveMQ :: Tooling #483' does not
have a result yet. Please make sure you set a proper result in case of pipeline/build scripts.
No mail will be sent out, as 'ActiveMQ-Java8-5.15.x » ActiveMQ :: Generic JMS Pool #483'
does not have a result yet. Please make sure you set a proper result in case of pipeline/build
scripts.
No mail will be sent out, as 'ActiveMQ-Java8-5.15.x » ActiveMQ :: Pool #483' does not have
a result yet. Please make sure you set a proper result in case of pipeline/build scripts.
No mail will be sent out, as 'ActiveMQ-Java8-5.15.x » ActiveMQ :: JDBC Store #483' does
not have a result yet. Please make sure you set a proper result in case of pipeline/build
scripts.
No mail will be sent out, as 'ActiveMQ-Java8-5.15.x » ActiveMQ :: Camel #483' does not
have a result yet. Please make sure you set a proper result in case of pipeline/build scripts.
No mail will be sent out, as 'ActiveMQ-Java8-5.15.x » ActiveMQ :: Runtime Configuration
#483' does not have a result yet. Please make sure you set a proper result in case of pipeline/build
scripts.
Sending e-mails to: commits@activemq.apache.org
No mail will be sent out, as 'ActiveMQ-Java8-5.15.x » ActiveMQ :: STOMP Protocol #483'
does not have a result yet. Please make sure you set a proper result in case of pipeline/build
scripts.
No mail will be sent out, as 'ActiveMQ-Java8-5.15.x » ActiveMQ :: Openwire Generator #483'
does not have a result yet. Please make sure you set a proper result in case of pipeline/build
scripts.
No mail will be sent out, as 'ActiveMQ-Java8-5.15.x » ActiveMQ :: Broker #483' does not
have a result yet. Please make sure you set a proper result in case of pipeline/build scripts.
No mail will be sent out, as 'ActiveMQ-Java8-5.15.x » ActiveMQ :: Web Demo #483' does not
have a result yet. Please make sure you set a proper result in case of pipeline/build scripts.
No mail will be sent out, as 'ActiveMQ-Java8-5.15.x » ActiveMQ :: MQTT Protocol #483' does
not have a result yet. Please make sure you set a proper result in case of pipeline/build
scripts.
No mail will be sent out, as 'ActiveMQ-Java8-5.15.x » ActiveMQ :: Shiro #483' does not
have a result yet. Please make sure you set a proper result in case of pipeline/build scripts.
No mail will be sent out, as 'ActiveMQ-Java8-5.15.x » ActiveMQ :: Performance Test Plugin
#483' does not have a result yet. Please make sure you set a proper result in case of pipeline/build
scripts.
No mail will be sent out, as 'ActiveMQ-Java8-5.15.x » ActiveMQ :: Run Jar #483' does not
have a result yet. Please make sure you set a proper result in case of pipeline/build scripts.
No mail will be sent out, as 'ActiveMQ-Java8-5.15.x » ActiveMQ :: StartUp/Stop Plugin #483'
does not have a result yet. Please make sure you set a proper result in case of pipeline/build
scripts.
No mail will be sent out, as 'ActiveMQ-Java8-5.15.x » ActiveMQ :: Apache Karaf #483' does
not have a result yet. Please make sure you set a proper result in case of pipeline/build
scripts.
No mail will be sent out, as 'ActiveMQ-Java8-5.15.x » ActiveMQ :: Web Console #483' does
not have a result yet. Please make sure you set a proper result in case of pipeline/build
scripts.
No mail will be sent out, as 'ActiveMQ-Java8-5.15.x » ActiveMQ :: JAAS #483' does not have
a result yet. Please make sure you set a proper result in case of pipeline/build scripts.
No mail will be sent out, as 'ActiveMQ-Java8-5.15.x » ActiveMQ :: Integration Test :: Spring
3.1 #483' does not have a result yet. Please make sure you set a proper result in case of
pipeline/build scripts.
No mail will be sent out, as 'ActiveMQ-Java8-5.15.x » ActiveMQ :: Memory Usage Test Plugin
#483' does not have a result yet. Please make sure you set a proper result in case of pipeline/build
scripts.
No mail will be sent out, as 'ActiveMQ-Java8-5.15.x » ActiveMQ :: RA #483' does not have
a result yet. Please make sure you set a proper result in case of pipeline/build scripts.
No mail will be sent out, as 'ActiveMQ-Java8-5.15.x » ActiveMQ :: Partition Management
#483' does not have a result yet. Please make sure you set a proper result in case of pipeline/build
scripts.
No mail will be sent out, as 'ActiveMQ-Java8-5.15.x » ActiveMQ :: All JAR bundle #483'
does not have a result yet. Please make sure you set a proper result in case of pipeline/build
scripts.
No mail will be sent out, as 'ActiveMQ-Java8-5.15.x » ActiveMQ :: Assembly #483' does not
have a result yet. Please make sure you set a proper result in case of pipeline/build scripts.
No mail will be sent out, as 'ActiveMQ-Java8-5.15.x » ActiveMQ :: Console #483' does not
have a result yet. Please make sure you set a proper result in case of pipeline/build scripts.
No mail will be sent out, as 'ActiveMQ-Java8-5.15.x » ActiveMQ :: Spring #483' does not
have a result yet. Please make sure you set a proper result in case of pipeline/build scripts.
No mail will be sent out, as 'ActiveMQ-Java8-5.15.x » ActiveMQ :: ConnectionFactory #483'
does not have a result yet. Please make sure you set a proper result in case of pipeline/build
scripts.
No mail will be sent out, as 'ActiveMQ-Java8-5.15.x » ActiveMQ :: LevelDB Store #483' does
not have a result yet. Please make sure you set a proper result in case of pipeline/build
scripts.
No mail will be sent out, as 'ActiveMQ-Java8-5.15.x » ActiveMQ :: Web #483' does not have
a result yet. Please make sure you set a proper result in case of pipeline/build scripts.
No mail will be sent out, as 'ActiveMQ-Java8-5.15.x » ActiveMQ :: Log4j Appender #483'
does not have a result yet. Please make sure you set a proper result in case of pipeline/build
scripts.
[locks-and-latches] Releasing all the locks
[locks-and-latches] All the locks released
channel stopped

Mime
View raw message