activemq-commits mailing list archives

Site index · List index
Message view « Date » · « Thread »
Top « Date » · « Thread »
From Apache Jenkins Server <jenk...@builds.apache.org>
Subject Build failed in Jenkins: ActiveMQ-Artemis-Master #2562
Date Tue, 03 Dec 2019 16:48:42 GMT
See <https://builds.apache.org/job/ActiveMQ-Artemis-Master/2562/display/redirect?page=changes>

Changes:

[clebertsuconic] ARTEMIS-2494: [AMQP] Allow Modified disposition to be used signal


------------------------------------------
[...truncated 490.67 KB...]
	at org.apache.activemq.artemis.utils.PortCheckRule.finished(PortCheckRule.java:51)
	at org.junit.rules.TestWatcher.finishedQuietly(TestWatcher.java:111)
	at org.junit.rules.TestWatcher.access$400(TestWatcher.java:46)
	at org.junit.rules.TestWatcher$1.evaluate(TestWatcher.java:64)
	at org.junit.rules.RunRules.evaluate(RunRules.java:20)
	at org.junit.runners.ParentRunner.run(ParentRunner.java:309)
	at org.apache.maven.surefire.junit4.JUnit4Provider.execute(JUnit4Provider.java:283)
	at org.apache.maven.surefire.junit4.JUnit4Provider.executeWithRerun(JUnit4Provider.java:173)
	at org.apache.maven.surefire.junit4.JUnit4Provider.executeTestSet(JUnit4Provider.java:153)
	at org.apache.maven.surefire.junit4.JUnit4Provider.invoke(JUnit4Provider.java:128)
	at org.apache.maven.surefire.booter.ForkedBooter.invokeProviderInSameClassLoader(ForkedBooter.java:203)
	at org.apache.maven.surefire.booter.ForkedBooter.runSuitesInProcess(ForkedBooter.java:155)
	at org.apache.maven.surefire.booter.ForkedBooter.main(ForkedBooter.java:103)
Tests run: 4, Failures: 2, Errors: 0, Skipped: 0, Time elapsed: 0.001 sec <<< FAILURE!
- in org.apache.activemq.artemis.core.transaction.impl.TransactionImplTest
org.apache.activemq.artemis.core.transaction.impl.TransactionImplTest  Time elapsed: 0 sec
 <<< FAILURE!
java.lang.AssertionError: a previous test is using port 61616 on org.apache.activemq.artemis.core.transaction.impl.TransactionImplTest
	at org.junit.Assert.fail(Assert.java:88)
	at org.apache.activemq.artemis.utils.PortCheckRule.starting(PortCheckRule.java:43)
	at org.junit.rules.TestWatcher.startingQuietly(TestWatcher.java:102)
	at org.junit.rules.TestWatcher.access$000(TestWatcher.java:46)
	at org.junit.rules.TestWatcher$1.evaluate(TestWatcher.java:53)
	at org.junit.rules.RunRules.evaluate(RunRules.java:20)
	at org.junit.runners.ParentRunner.run(ParentRunner.java:309)
	at org.apache.maven.surefire.junit4.JUnit4Provider.execute(JUnit4Provider.java:283)
	at org.apache.maven.surefire.junit4.JUnit4Provider.executeWithRerun(JUnit4Provider.java:173)
	at org.apache.maven.surefire.junit4.JUnit4Provider.executeTestSet(JUnit4Provider.java:153)
	at org.apache.maven.surefire.junit4.JUnit4Provider.invoke(JUnit4Provider.java:128)
	at org.apache.maven.surefire.booter.ForkedBooter.invokeProviderInSameClassLoader(ForkedBooter.java:203)
	at org.apache.maven.surefire.booter.ForkedBooter.runSuitesInProcess(ForkedBooter.java:155)
	at org.apache.maven.surefire.booter.ForkedBooter.main(ForkedBooter.java:103)

org.apache.activemq.artemis.core.transaction.impl.TransactionImplTest  Time elapsed: 0 sec
 <<< FAILURE!
java.lang.AssertionError: org.apache.activemq.artemis.core.transaction.impl.TransactionImplTest
has left a server socket open on port 61616
	at org.junit.Assert.fail(Assert.java:88)
	at org.apache.activemq.artemis.utils.PortCheckRule.finished(PortCheckRule.java:52)
	at org.junit.rules.TestWatcher.finishedQuietly(TestWatcher.java:111)
	at org.junit.rules.TestWatcher.access$400(TestWatcher.java:46)
	at org.junit.rules.TestWatcher$1.evaluate(TestWatcher.java:64)
	at org.junit.rules.RunRules.evaluate(RunRules.java:20)
	at org.junit.runners.ParentRunner.run(ParentRunner.java:309)
	at org.apache.maven.surefire.junit4.JUnit4Provider.execute(JUnit4Provider.java:283)
	at org.apache.maven.surefire.junit4.JUnit4Provider.executeWithRerun(JUnit4Provider.java:173)
	at org.apache.maven.surefire.junit4.JUnit4Provider.executeTestSet(JUnit4Provider.java:153)
	at org.apache.maven.surefire.junit4.JUnit4Provider.invoke(JUnit4Provider.java:128)
	at org.apache.maven.surefire.booter.ForkedBooter.invokeProviderInSameClassLoader(ForkedBooter.java:203)
	at org.apache.maven.surefire.booter.ForkedBooter.runSuitesInProcess(ForkedBooter.java:155)
	at org.apache.maven.surefire.booter.ForkedBooter.main(ForkedBooter.java:103)

Running org.apache.activemq.artemis.core.version.impl.VersionImplTest
Tests run: 3, Failures: 0, Errors: 0, Skipped: 0, Time elapsed: 0 sec - in org.apache.activemq.artemis.core.version.impl.VersionImplTest
Running org.apache.activemq.artemis.spi.core.security.jaas.Krb5LoginModuleTest
Tests run: 2, Failures: 0, Errors: 0, Skipped: 0, Time elapsed: 0 sec - in org.apache.activemq.artemis.spi.core.security.jaas.Krb5LoginModuleTest
Running org.apache.activemq.artemis.tests.util.SimpleStringTest
Tests run: 20, Failures: 0, Errors: 0, Skipped: 0, Time elapsed: 0.461 sec - in org.apache.activemq.artemis.tests.util.SimpleStringTest
Running org.apache.activemq.artemis.uri.AcceptorParserTest
config:TransportConfiguration(name=test, factory=org-apache-activemq-artemis-core-remoting-impl-netty-NettyAcceptorFactory)
?tcpReceiveBufferSize=1048576&port=8080&host=localhost&protocols=openwire&tcpSendBufferSize=1048576&banana=x
config:TransportConfiguration(name=test, factory=org-apache-activemq-artemis-core-remoting-impl-netty-NettyAcceptorFactory)
?tcpReceiveBufferSize=1048576&port=5672&host=0-0-0-0&tcpSendBufferSize=1048576&virtualTopicConsumerWildcards=Consumer-*->;2
Consumer.*.>;2
Tests run: 3, Failures: 0, Errors: 0, Skipped: 0, Time elapsed: 0.011 sec - in org.apache.activemq.artemis.uri.AcceptorParserTest
Running org.apache.activemq.artemis.uri.ClusterConnectionConfigurationTest
Tests run: 5, Failures: 0, Errors: 0, Skipped: 0, Time elapsed: 0.007 sec - in org.apache.activemq.artemis.uri.ClusterConnectionConfigurationTest

Results :

Failed tests: 
org.apache.activemq.artemis.core.config.impl.ConfigurationImplTest.org.apache.activemq.artemis.core.config.impl.ConfigurationImplTest
  Run 1: ConfigurationImplTest>Assert.fail:88 a previous test is using port 61616 on org.apache.activemq.artemis.core.config.impl.ConfigurationImplTest
  Run 2: ConfigurationImplTest>Assert.fail:88 org.apache.activemq.artemis.core.config.impl.ConfigurationImplTest
has left a server socket open on port 61616

org.apache.activemq.artemis.core.config.impl.DatabaseStoreConfigurationTest.org.apache.activemq.artemis.core.config.impl.DatabaseStoreConfigurationTest
  Run 1: DatabaseStoreConfigurationTest>Assert.fail:88 a previous test is using port 61616
on org.apache.activemq.artemis.core.config.impl.DatabaseStoreConfigurationTest
  Run 2: DatabaseStoreConfigurationTest>Assert.fail:88 org.apache.activemq.artemis.core.config.impl.DatabaseStoreConfigurationTest
has left a server socket open on port 61616

org.apache.activemq.artemis.core.config.impl.DefaultsFileConfigurationTest.org.apache.activemq.artemis.core.config.impl.DefaultsFileConfigurationTest
  Run 1: DefaultsFileConfigurationTest>Assert.fail:88 a previous test is using port 61616
on org.apache.activemq.artemis.core.config.impl.DefaultsFileConfigurationTest
  Run 2: DefaultsFileConfigurationTest>Assert.fail:88 org.apache.activemq.artemis.core.config.impl.DefaultsFileConfigurationTest
has left a server socket open on port 61616

org.apache.activemq.artemis.core.config.impl.FileConfigurationParserTest.org.apache.activemq.artemis.core.config.impl.FileConfigurationParserTest
  Run 1: FileConfigurationParserTest>Assert.fail:88 a previous test is using port 61616
on org.apache.activemq.artemis.core.config.impl.FileConfigurationParserTest
  Run 2: FileConfigurationParserTest>Assert.fail:88 org.apache.activemq.artemis.core.config.impl.FileConfigurationParserTest
has left a server socket open on port 61616

org.apache.activemq.artemis.core.config.impl.FileConfigurationSecurityPluginTest.org.apache.activemq.artemis.core.config.impl.FileConfigurationSecurityPluginTest
  Run 1: FileConfigurationSecurityPluginTest>Assert.fail:88 a previous test is using port
61616 on org.apache.activemq.artemis.core.config.impl.FileConfigurationSecurityPluginTest
  Run 2: FileConfigurationSecurityPluginTest>Assert.fail:88 org.apache.activemq.artemis.core.config.impl.FileConfigurationSecurityPluginTest
has left a server socket open on port 61616

org.apache.activemq.artemis.core.config.impl.FileConfigurationTest.org.apache.activemq.artemis.core.config.impl.FileConfigurationTest
  Run 1: FileConfigurationTest>Assert.fail:88 a previous test is using port 61616 on org.apache.activemq.artemis.core.config.impl.FileConfigurationTest
  Run 2: FileConfigurationTest>Assert.fail:88 org.apache.activemq.artemis.core.config.impl.FileConfigurationTest
has left a server socket open on port 61616

org.apache.activemq.artemis.core.config.impl.FileXIncludeConfigurationTest.org.apache.activemq.artemis.core.config.impl.FileXIncludeConfigurationTest
  Run 1: FileXIncludeConfigurationTest>Assert.fail:88 a previous test is using port 61616
on org.apache.activemq.artemis.core.config.impl.FileXIncludeConfigurationTest
  Run 2: FileXIncludeConfigurationTest>Assert.fail:88 org.apache.activemq.artemis.core.config.impl.FileXIncludeConfigurationTest
has left a server socket open on port 61616

org.apache.activemq.artemis.core.config.impl.HAPolicyConfigurationTest.org.apache.activemq.artemis.core.config.impl.HAPolicyConfigurationTest
  Run 1: HAPolicyConfigurationTest>Assert.fail:88 a previous test is using port 61616 on
org.apache.activemq.artemis.core.config.impl.HAPolicyConfigurationTest
  Run 2: HAPolicyConfigurationTest>Assert.fail:88 org.apache.activemq.artemis.core.config.impl.HAPolicyConfigurationTest
has left a server socket open on port 61616

org.apache.activemq.artemis.core.config.impl.WrongRoleFileConfigurationParserTest.org.apache.activemq.artemis.core.config.impl.WrongRoleFileConfigurationParserTest
  Run 1: WrongRoleFileConfigurationParserTest>Assert.fail:88 a previous test is using port
61616 on org.apache.activemq.artemis.core.config.impl.WrongRoleFileConfigurationParserTest
  Run 2: WrongRoleFileConfigurationParserTest>Assert.fail:88 org.apache.activemq.artemis.core.config.impl.WrongRoleFileConfigurationParserTest
has left a server socket open on port 61616

org.apache.activemq.artemis.core.message.impl.MessagePropertyTest.org.apache.activemq.artemis.core.message.impl.MessagePropertyTest
  Run 1: MessagePropertyTest>Assert.fail:88 a previous test is using port 61616 on org.apache.activemq.artemis.core.message.impl.MessagePropertyTest
  Run 2: MessagePropertyTest>Assert.fail:88 org.apache.activemq.artemis.core.message.impl.MessagePropertyTest
has left a server socket open on port 61616

org.apache.activemq.artemis.core.paging.cursor.impl.PageReaderTest.org.apache.activemq.artemis.core.paging.cursor.impl.PageReaderTest
  Run 1: PageReaderTest>Assert.fail:88 a previous test is using port 61616 on org.apache.activemq.artemis.core.paging.cursor.impl.PageReaderTest
  Run 2: PageReaderTest>Assert.fail:88 org.apache.activemq.artemis.core.paging.cursor.impl.PageReaderTest
has left a server socket open on port 61616

org.apache.activemq.artemis.core.persistence.impl.journal.JournalStorageManagerTest.org.apache.activemq.artemis.core.persistence.impl.journal.JournalStorageManagerTest
  Run 1: JournalStorageManagerTest>Assert.fail:88 a previous test is using port 61616 on
org.apache.activemq.artemis.core.persistence.impl.journal.JournalStorageManagerTest
  Run 2: JournalStorageManagerTest>Assert.fail:88 org.apache.activemq.artemis.core.persistence.impl.journal.JournalStorageManagerTest
has left a server socket open on port 61616

org.apache.activemq.artemis.core.reload.ReloadManagerTest.org.apache.activemq.artemis.core.reload.ReloadManagerTest
  Run 1: ReloadManagerTest>Assert.fail:88 a previous test is using port 61616 on org.apache.activemq.artemis.core.reload.ReloadManagerTest
  Run 2: ReloadManagerTest>Assert.fail:88 org.apache.activemq.artemis.core.reload.ReloadManagerTest
has left a server socket open on port 61616

org.apache.activemq.artemis.core.server.cluster.impl.BroadcastGroupImplTest.org.apache.activemq.artemis.core.server.cluster.impl.BroadcastGroupImplTest
  Run 1: BroadcastGroupImplTest>Assert.fail:88 a previous test is using port 61616 on org.apache.activemq.artemis.core.server.cluster.impl.BroadcastGroupImplTest
  Run 2: BroadcastGroupImplTest>Assert.fail:88 org.apache.activemq.artemis.core.server.cluster.impl.BroadcastGroupImplTest
has left a server socket open on port 61616

org.apache.activemq.artemis.core.server.files.FileStoreMonitorTest.org.apache.activemq.artemis.core.server.files.FileStoreMonitorTest
  Run 1: FileStoreMonitorTest>Assert.fail:88 a previous test is using port 61616 on org.apache.activemq.artemis.core.server.files.FileStoreMonitorTest
  Run 2: FileStoreMonitorTest>Assert.fail:88 org.apache.activemq.artemis.core.server.files.FileStoreMonitorTest
has left a server socket open on port 61616

org.apache.activemq.artemis.core.server.group.impl.ClusteredResetMockTest.org.apache.activemq.artemis.core.server.group.impl.ClusteredResetMockTest
  Run 1: ClusteredResetMockTest>Assert.fail:88 a previous test is using port 61616 on org.apache.activemq.artemis.core.server.group.impl.ClusteredResetMockTest
  Run 2: ClusteredResetMockTest>Assert.fail:88 org.apache.activemq.artemis.core.server.group.impl.ClusteredResetMockTest
has left a server socket open on port 61616

org.apache.activemq.artemis.core.server.impl.ActiveMQServerImplTest.org.apache.activemq.artemis.core.server.impl.ActiveMQServerImplTest
  Run 1: ActiveMQServerImplTest>Assert.fail:88 a previous test is using port 61616 on org.apache.activemq.artemis.core.server.impl.ActiveMQServerImplTest
  Run 2: ActiveMQServerImplTest>Assert.fail:88 org.apache.activemq.artemis.core.server.impl.ActiveMQServerImplTest
has left a server socket open on port 61616

org.apache.activemq.artemis.core.server.impl.jdbc.JdbcLeaseLockTest.org.apache.activemq.artemis.core.server.impl.jdbc.JdbcLeaseLockTest
  Run 1: JdbcLeaseLockTest>Assert.fail:88 a previous test is using port 61616 on org.apache.activemq.artemis.core.server.impl.jdbc.JdbcLeaseLockTest
  Run 2: JdbcLeaseLockTest>Assert.fail:88 org.apache.activemq.artemis.core.server.impl.jdbc.JdbcLeaseLockTest
has left a server socket open on port 61616

org.apache.activemq.artemis.core.server.impl.jdbc.JdbcNodeManagerTest.org.apache.activemq.artemis.core.server.impl.jdbc.JdbcNodeManagerTest
  Run 1: JdbcNodeManagerTest>Assert.fail:88 a previous test is using port 61616 on org.apache.activemq.artemis.core.server.impl.jdbc.JdbcNodeManagerTest
  Run 2: JdbcNodeManagerTest>Assert.fail:88 org.apache.activemq.artemis.core.server.impl.jdbc.JdbcNodeManagerTest
has left a server socket open on port 61616

org.apache.activemq.artemis.core.server.impl.jdbc.JdbcSharedStateManagerTest.org.apache.activemq.artemis.core.server.impl.jdbc.JdbcSharedStateManagerTest
  Run 1: JdbcSharedStateManagerTest>Assert.fail:88 a previous test is using port 61616
on org.apache.activemq.artemis.core.server.impl.jdbc.JdbcSharedStateManagerTest
  Run 2: JdbcSharedStateManagerTest>Assert.fail:88 Thread leaked
  Run 3: JdbcSharedStateManagerTest>Assert.fail:88 org.apache.activemq.artemis.core.server.impl.jdbc.JdbcSharedStateManagerTest
has left a server socket open on port 61616

org.apache.activemq.artemis.core.settings.AddressSettingsTest.org.apache.activemq.artemis.core.settings.AddressSettingsTest
  Run 1: AddressSettingsTest>Assert.fail:88 a previous test is using port 61616 on org.apache.activemq.artemis.core.settings.AddressSettingsTest
  Run 2: AddressSettingsTest>Assert.fail:88 org.apache.activemq.artemis.core.settings.AddressSettingsTest
has left a server socket open on port 61616

org.apache.activemq.artemis.core.settings.RepositoryTest.org.apache.activemq.artemis.core.settings.RepositoryTest
  Run 1: RepositoryTest>Assert.fail:88 a previous test is using port 61616 on org.apache.activemq.artemis.core.settings.RepositoryTest
  Run 2: RepositoryTest>Assert.fail:88 org.apache.activemq.artemis.core.settings.RepositoryTest
has left a server socket open on port 61616

org.apache.activemq.artemis.core.transaction.impl.TransactionImplTest.org.apache.activemq.artemis.core.transaction.impl.TransactionImplTest
  Run 1: TransactionImplTest>Assert.fail:88 a previous test is using port 61616 on org.apache.activemq.artemis.core.transaction.impl.TransactionImplTest
  Run 2: TransactionImplTest>Assert.fail:88 org.apache.activemq.artemis.core.transaction.impl.TransactionImplTest
has left a server socket open on port 61616

Tests in error: 
  JdbcSharedStateManagerTest.shouldStartIfTableExistEmpty:73 » SQL Failed to cre...
  JdbcSharedStateManagerTest.shouldStartIfTableExistInitialized:86 » SQL Failed ...
  JdbcSharedStateManagerTest.shouldStartIfTableNotExist:62->createSharedStateManager:52
» IllegalState
  JdbcSharedStateManagerTest.shouldStartTwoIfTableNotExist:98->createSharedStateManager:52
» 

Tests run: 351, Failures: 23, Errors: 4, Skipped: 0

[INFO] ------------------------------------------------------------------------
[INFO] Reactor Summary:
[INFO] 
[INFO] ActiveMQ Artemis Parent 2.11.0-SNAPSHOT ............ SUCCESS [ 13.104 s]
[INFO] ActiveMQ Artemis Commons ........................... SUCCESS [ 37.865 s]
[INFO] ActiveMQ Artemis Core Client ....................... SUCCESS [ 30.900 s]
[INFO] ActiveMQ Artemis Selector Implementation ........... SUCCESS [  5.785 s]
[INFO] ActiveMQ Artemis JMS Client ........................ SUCCESS [ 37.596 s]
[INFO] ActiveMQ Artemis Journal ........................... SUCCESS [  5.474 s]
[INFO] ActiveMQ Artemis JDBC Store ........................ SUCCESS [01:06 min]
[INFO] ActiveMQ Artemis Server ............................ FAILURE [10:09 min]
[INFO] ActiveMQ Artemis Protocols ......................... SKIPPED
[INFO] ActiveMQ Artemis AMQP Protocol ..................... SKIPPED
[INFO] ActiveMQ Artemis STOMP Protocol .................... SKIPPED
[INFO] ActiveMQ Artemis OpenWire Protocol ................. SKIPPED
[INFO] ActiveMQ Artemis HQClient Protocol ................. SKIPPED
[INFO] ActiveMQ Artemis HornetQ Protocol .................. SKIPPED
[INFO] ActiveMQ Artemis MQTT Protocol ..................... SKIPPED
[INFO] ActiveMQ Artemis DTO ............................... SKIPPED
[INFO] ActiveMQ Artemis Service Extensions ................ SKIPPED
[INFO] ActiveMQ Artemis JMS Server ........................ SKIPPED
[INFO] ActiveMQ Artemis CDI Integration ................... SKIPPED
[INFO] ActiveMQ Artemis Boot .............................. SKIPPED
[INFO] ActiveMQ Artemis Tools ............................. SKIPPED
[INFO] ActiveMQ Artemis JUnit Rules ....................... SKIPPED
[INFO] ActiveMQ Artemis CLI ............................... SKIPPED
[INFO] ActiveMQ Artemis Web ............................... SKIPPED
[INFO] ActiveMQ Artemis Web ............................... SKIPPED
[INFO] ActiveMQ Artemis Core Client All ................... SKIPPED
[INFO] ActiveMQ Artemis Client OSGi ....................... SKIPPED
[INFO] ActiveMQ Artemis JMS Client All .................... SKIPPED
[INFO] ActiveMQ Artemis JMS Client OSGi ................... SKIPPED
[INFO] ActiveMQ Artemis RAR POM ........................... SKIPPED
[INFO] ActiveMQ Artemis REST Interface Implementation ..... SKIPPED
[INFO] ActiveMQ Artemis Maven Plugin ...................... SKIPPED
[INFO] ActiveMQ Artemis Server OSGi ....................... SKIPPED
[INFO] ActiveMQ Artemis Cons .............................. SKIPPED
[INFO] ActiveMQ Artemis HawtIO Branding ................... SKIPPED
[INFO] ActiveMQ Artemis HawtIO Plugin ..................... SKIPPED
[INFO] ActiveMQ Artemis Console ........................... SKIPPED
[INFO] ActiveMQ Artemis Spring Integration ................ SKIPPED
[INFO] Apache ActiveMQ Artemis Distribution ............... SKIPPED
[INFO] ActiveMQ Artemis Tests POM ......................... SKIPPED
[INFO] ActiveMQ Artemis Test Support ...................... SKIPPED
[INFO] ActiveMQ Artemis Unit Tests ........................ SKIPPED
[INFO] ActiveMQ Artemis Joram Tests ....................... SKIPPED
[INFO] ActiveMQ Artemis timing Tests ...................... SKIPPED
[INFO] ActiveMQ Artemis JMS Tests ......................... SKIPPED
[INFO] ActiveMQ Artemis Features .......................... SKIPPED
[INFO] ActiveMQ Artemis Integration Tests ................. SKIPPED
[INFO] ActiveMQ Artemis Client Integration Tests .......... SKIPPED
[INFO] ActiveMQ Artemis Compatibility Tests ............... SKIPPED
[INFO] ActiveMQ Artemis soak Tests ........................ SKIPPED
[INFO] ActiveMQ Artemis stress Tests ...................... SKIPPED
[INFO] ActiveMQ Artemis performance Tests ................. SKIPPED
[INFO] Smoke Tests ........................................ SKIPPED
[INFO] ActiveMQ Artemis Extra Tests 2.11.0-SNAPSHOT ....... SKIPPED
[INFO] ------------------------------------------------------------------------
[INFO] BUILD FAILURE
[INFO] ------------------------------------------------------------------------
[INFO] Total time: 13:31 min
[INFO] Finished at: 2019-12-03T16:48:41Z
[INFO] ------------------------------------------------------------------------
[ERROR] Failed to execute goal org.apache.maven.plugins:maven-surefire-plugin:2.18.1:test
(default-test) on project artemis-server: There are test failures.
[ERROR] 
[ERROR] Please refer to <https://builds.apache.org/job/ActiveMQ-Artemis-Master/ws/artemis-server/target/surefire-reports>
for the individual test results.
[ERROR] -> [Help 1]
[ERROR] 
[ERROR] To see the full stack trace of the errors, re-run Maven with the -e switch.
[ERROR] Re-run Maven using the -X switch to enable full debug logging.
[ERROR] 
[ERROR] For more information about the errors and possible solutions, please read the following
articles:
[ERROR] [Help 1] http://cwiki.apache.org/confluence/display/MAVEN/MojoFailureException
[ERROR] 
[ERROR] After correcting the problems, you can resume the build with the command
[ERROR]   mvn <goals> -rf :artemis-server
Build step 'Invoke top-level Maven targets' marked build as failure
Performing Post build task...
Could not match :Too many files with unapproved license  : False
Logical operation result is FALSE
Skipping script  : cat ratReport.txt
END OF POST BUILD TASK 	: 0
Recording test results

Mime
View raw message