activemq-commits mailing list archives

Site index · List index
Message view « Date » · « Thread »
Top « Date » · « Thread »
From Apache Jenkins Server <jenk...@builds.apache.org>
Subject Build failed in Jenkins: ActiveMQ-Artemis-Master #2555
Date Wed, 20 Nov 2019 15:29:55 GMT
See <https://builds.apache.org/job/ActiveMQ-Artemis-Master/2555/display/redirect?page=changes>

Changes:

[christopher.l.shannon] ARTEMIS-2549 - Add Downstream support to Federation


------------------------------------------
[...truncated 298.84 KB...]
Tests run: 1, Failures: 0, Errors: 0, Skipped: 0, Time elapsed: 0.812 sec - in org.apache.activemq.artemis.core.message.impl.MessagePropertyTest
Running org.apache.activemq.artemis.core.paging.cursor.impl.PageCursorProviderImplTest
Tests run: 3, Failures: 0, Errors: 0, Skipped: 0, Time elapsed: 3.024 sec - in org.apache.activemq.artemis.core.paging.cursor.impl.PageCursorProviderImplTest
Running org.apache.activemq.artemis.core.paging.cursor.impl.PageReaderTest
[main] 15:23:17,930 INFO  [org.apache.activemq.artemis.core.server] **** start #test testPageReadMessageBeyondPage()
***
[main] 15:23:17,953 INFO  [org.apache.activemq.artemis.core.server] **** end #test testPageReadMessageBeyondPage()
***
[main] 15:23:17,954 INFO  [org.apache.activemq.artemis.core.server] **** start #test testPageReadMessageKeepOpen()
***
[main] 15:23:17,965 INFO  [org.apache.activemq.artemis.core.server] **** end #test testPageReadMessageKeepOpen()
***
[main] 15:23:17,967 INFO  [org.apache.activemq.artemis.core.server] **** start #test testPageReadMessage()
***
[main] 15:23:18,036 INFO  [org.apache.activemq.artemis.core.server] **** end #test testPageReadMessage()
***
Tests run: 3, Failures: 0, Errors: 0, Skipped: 0, Time elapsed: 0.122 sec - in org.apache.activemq.artemis.core.paging.cursor.impl.PageReaderTest
Running org.apache.activemq.artemis.core.persistence.impl.journal.AddressBindingEncodingTest
Tests run: 1, Failures: 0, Errors: 0, Skipped: 0, Time elapsed: 0.002 sec - in org.apache.activemq.artemis.core.persistence.impl.journal.AddressBindingEncodingTest
Running org.apache.activemq.artemis.core.persistence.impl.journal.JournalStorageManagerTest
[main] 15:23:18,060 INFO  [org.apache.activemq.artemis.core.server] **** start #test testAddBytesToLargeMessageNotLeakingByteBuffer[journal
type=NIO]() ***
[main] 15:23:18,629 INFO  [org.apache.activemq.artemis.core.server] **** end #test testAddBytesToLargeMessageNotLeakingByteBuffer[journal
type=NIO]() ***
[main] 15:23:18,632 INFO  [org.apache.activemq.artemis.core.server] **** start #test testStopReplicationDoesNotDeadlockWhileStopping[journal
type=NIO]() ***
[main] 15:23:19,966 INFO  [org.apache.activemq.artemis.core.server] **** end #test testStopReplicationDoesNotDeadlockWhileStopping[journal
type=NIO]() ***
[main] 15:23:19,971 INFO  [org.apache.activemq.artemis.core.server] **** start #test testFixJournalFileSize[journal
type=NIO]() ***
[main] 15:23:19,978 INFO  [org.apache.activemq.artemis.core.server] AMQ221058: resetting Journal
File size from 4,098 to 4,096 to fit with alignment of 4,096
[main] 15:23:19,984 INFO  [org.apache.activemq.artemis.core.server] **** end #test testFixJournalFileSize[journal
type=NIO]() ***
[main] 15:23:19,986 INFO  [org.apache.activemq.artemis.core.server] **** start #test testAddBytesToLargeMessageNotLeakingByteBuffer[journal
type=ASYNCIO]() ***
[main] 15:23:20,124 INFO  [org.apache.activemq.artemis.core.server] **** end #test testAddBytesToLargeMessageNotLeakingByteBuffer[journal
type=ASYNCIO]() ***
[main] 15:23:20,126 INFO  [org.apache.activemq.artemis.core.server] **** start #test testStopReplicationDoesNotDeadlockWhileStopping[journal
type=ASYNCIO]() ***
[main] 15:23:20,758 INFO  [org.apache.activemq.artemis.core.server] **** end #test testStopReplicationDoesNotDeadlockWhileStopping[journal
type=ASYNCIO]() ***
[main] 15:23:20,759 INFO  [org.apache.activemq.artemis.core.server] **** start #test testFixJournalFileSize[journal
type=ASYNCIO]() ***
[main] 15:23:20,762 INFO  [org.apache.activemq.artemis.core.server] AMQ221058: resetting Journal
File size from 4,098 to 4,096 to fit with alignment of 4,096
[main] 15:23:20,766 INFO  [org.apache.activemq.artemis.core.server] **** end #test testFixJournalFileSize[journal
type=ASYNCIO]() ***
[main] 15:23:20,767 INFO  [org.apache.activemq.artemis.core.server] **** start #test testAddBytesToLargeMessageNotLeakingByteBuffer[journal
type=MAPPED]() ***
[main] 15:23:20,834 INFO  [org.apache.activemq.artemis.core.server] **** end #test testAddBytesToLargeMessageNotLeakingByteBuffer[journal
type=MAPPED]() ***
[main] 15:23:20,836 INFO  [org.apache.activemq.artemis.core.server] **** start #test testStopReplicationDoesNotDeadlockWhileStopping[journal
type=MAPPED]() ***
[main] 15:23:21,388 INFO  [org.apache.activemq.artemis.core.server] **** end #test testStopReplicationDoesNotDeadlockWhileStopping[journal
type=MAPPED]() ***
[main] 15:23:21,389 INFO  [org.apache.activemq.artemis.core.server] **** start #test testFixJournalFileSize[journal
type=MAPPED]() ***
[main] 15:23:21,391 INFO  [org.apache.activemq.artemis.core.server] AMQ221058: resetting Journal
File size from 4,098 to 4,096 to fit with alignment of 4,096
[main] 15:23:21,392 INFO  [org.apache.activemq.artemis.core.server] **** end #test testFixJournalFileSize[journal
type=MAPPED]() ***
Tests run: 9, Failures: 0, Errors: 0, Skipped: 0, Time elapsed: 3.352 sec - in org.apache.activemq.artemis.core.persistence.impl.journal.JournalStorageManagerTest
Running org.apache.activemq.artemis.core.persistence.impl.journal.QueueBindingEncodingTest
Tests run: 1, Failures: 0, Errors: 0, Skipped: 0, Time elapsed: 0.004 sec - in org.apache.activemq.artemis.core.persistence.impl.journal.QueueBindingEncodingTest
Running org.apache.activemq.artemis.core.reload.LoggingConfigurationFileReloaderTest
[main] 15:23:21,404 INFO  [org.apache.activemq.artemis.core.server] AMQ221056: Reloading configuration:
logging
Tests run: 1, Failures: 0, Errors: 0, Skipped: 0, Time elapsed: 0.02 sec - in org.apache.activemq.artemis.core.reload.LoggingConfigurationFileReloaderTest
Running org.apache.activemq.artemis.core.reload.ReloadManagerTest
Tests run: 2, Failures: 0, Errors: 0, Skipped: 0, Time elapsed: 2.022 sec - in org.apache.activemq.artemis.core.reload.ReloadManagerTest
Running org.apache.activemq.artemis.core.security.RoleTest
Tests run: 5, Failures: 0, Errors: 0, Skipped: 0, Time elapsed: 0.003 sec - in org.apache.activemq.artemis.core.security.RoleTest
Running org.apache.activemq.artemis.core.security.jaas.CertificateLoginModuleTest
Tests run: 3, Failures: 0, Errors: 0, Skipped: 0, Time elapsed: 0.007 sec - in org.apache.activemq.artemis.core.security.jaas.CertificateLoginModuleTest
Running org.apache.activemq.artemis.core.security.jaas.GuestLoginModuleTest
Tests run: 2, Failures: 0, Errors: 0, Skipped: 0, Time elapsed: 0.021 sec - in org.apache.activemq.artemis.core.security.jaas.GuestLoginModuleTest
Running org.apache.activemq.artemis.core.security.jaas.JAASSecurityManagerTest
loader: sun.misc.Launcher$AppClassLoader@42a57993
loader: sun.misc.Launcher$AppClassLoader@42a57993
Tests run: 2, Failures: 0, Errors: 0, Skipped: 0, Time elapsed: 0.012 sec - in org.apache.activemq.artemis.core.security.jaas.JAASSecurityManagerTest
Running org.apache.activemq.artemis.core.security.jaas.LDAPLoginModuleMaskPasswordTest
Tests run: 5, Failures: 0, Errors: 0, Skipped: 0, Time elapsed: 17.906 sec - in org.apache.activemq.artemis.core.security.jaas.LDAPLoginModuleMaskPasswordTest
Running org.apache.activemq.artemis.core.security.jaas.LDAPLoginModuleTest
Tests run: 8, Failures: 0, Errors: 0, Skipped: 0, Time elapsed: 16.644 sec - in org.apache.activemq.artemis.core.security.jaas.LDAPLoginModuleTest
Running org.apache.activemq.artemis.core.security.jaas.LDAPModuleRoleExpansionTest
Tests run: 2, Failures: 0, Errors: 0, Skipped: 0, Time elapsed: 15.609 sec - in org.apache.activemq.artemis.core.security.jaas.LDAPModuleRoleExpansionTest
Running org.apache.activemq.artemis.core.security.jaas.PropertiesLoginModuleRaceConditionTest
Tests run: 1, Failures: 0, Errors: 0, Skipped: 0, Time elapsed: 103.491 sec - in org.apache.activemq.artemis.core.security.jaas.PropertiesLoginModuleRaceConditionTest
Running org.apache.activemq.artemis.core.security.jaas.PropertiesLoginModuleTest
Tests run: 5, Failures: 0, Errors: 0, Skipped: 0, Time elapsed: 1.063 sec - in org.apache.activemq.artemis.core.security.jaas.PropertiesLoginModuleTest
Running org.apache.activemq.artemis.core.security.jaas.RolePrincipalTest
Tests run: 3, Failures: 0, Errors: 0, Skipped: 0, Time elapsed: 0.001 sec - in org.apache.activemq.artemis.core.security.jaas.RolePrincipalTest
Running org.apache.activemq.artemis.core.security.jaas.TextFileCertificateLoginModuleTest
Tests run: 3, Failures: 0, Errors: 0, Skipped: 0, Time elapsed: 1.217 sec - in org.apache.activemq.artemis.core.security.jaas.TextFileCertificateLoginModuleTest
Running org.apache.activemq.artemis.core.security.jaas.UserPrincipalTest
Tests run: 3, Failures: 0, Errors: 0, Skipped: 0, Time elapsed: 0.001 sec - in org.apache.activemq.artemis.core.security.jaas.UserPrincipalTest
Running org.apache.activemq.artemis.core.server.QueueConfigTest
Tests run: 4, Failures: 0, Errors: 0, Skipped: 0, Time elapsed: 0.003 sec - in org.apache.activemq.artemis.core.server.QueueConfigTest
Running org.apache.activemq.artemis.core.server.cluster.impl.BroadcastGroupImplTest
Tests run: 1, Failures: 0, Errors: 0, Skipped: 0, Time elapsed: 0.009 sec - in org.apache.activemq.artemis.core.server.cluster.impl.BroadcastGroupImplTest
Running org.apache.activemq.artemis.core.server.files.FileMoveManagerTest
Tests run: 9, Failures: 0, Errors: 0, Skipped: 0, Time elapsed: 1.159 sec - in org.apache.activemq.artemis.core.server.files.FileMoveManagerTest
Running org.apache.activemq.artemis.core.server.files.FileStoreMonitorTest
tick:: / (/dev/sda3) usage::0.14428827866779315
under:: / (/dev/sda3) usage::0.14428827866779315
tick:: / (/dev/sda3) usage::1.0
over:: / (/dev/sda3) usage::1.0
TickS::0.14428827762710916
TickS::0.14428827762710916
TickS::0.14428827762710916
TickS::0.14428827762710916
TickS::0.14428827762710916
Tests run: 2, Failures: 0, Errors: 0, Skipped: 0, Time elapsed: 0.217 sec - in org.apache.activemq.artemis.core.server.files.FileStoreMonitorTest
Running org.apache.activemq.artemis.core.server.group.impl.ClusteredResetMockTest
Tests run: 1, Failures: 0, Errors: 0, Skipped: 0, Time elapsed: 0.401 sec - in org.apache.activemq.artemis.core.server.group.impl.ClusteredResetMockTest
Running org.apache.activemq.artemis.core.server.impl.ActiveMQServerImplTest
Tests run: 1, Failures: 0, Errors: 0, Skipped: 0, Time elapsed: 0.461 sec - in org.apache.activemq.artemis.core.server.impl.ActiveMQServerImplTest
Running org.apache.activemq.artemis.core.server.impl.BucketMessageGroupsTest
Tests run: 7, Failures: 0, Errors: 0, Skipped: 0, Time elapsed: 0.029 sec - in org.apache.activemq.artemis.core.server.impl.BucketMessageGroupsTest
Running org.apache.activemq.artemis.core.server.impl.CompositeAddressTest
Tests run: 1, Failures: 0, Errors: 0, Skipped: 0, Time elapsed: 0 sec - in org.apache.activemq.artemis.core.server.impl.CompositeAddressTest
Running org.apache.activemq.artemis.core.server.impl.EmbeddedServerTest
Tests run: 2, Failures: 0, Errors: 0, Skipped: 0, Time elapsed: 0.061 sec - in org.apache.activemq.artemis.core.server.impl.EmbeddedServerTest
Running org.apache.activemq.artemis.core.server.impl.QueueConsumersImplTest
Tests run: 3, Failures: 0, Errors: 0, Skipped: 0, Time elapsed: 0.003 sec - in org.apache.activemq.artemis.core.server.impl.QueueConsumersImplTest
Running org.apache.activemq.artemis.core.server.impl.QueueImplTest
Tests run: 1, Failures: 0, Errors: 0, Skipped: 0, Time elapsed: 2.281 sec - in org.apache.activemq.artemis.core.server.impl.QueueImplTest
Running org.apache.activemq.artemis.core.server.impl.ScheduledDeliveryHandlerTest
Tests run: 6, Failures: 0, Errors: 0, Skipped: 0, Time elapsed: 2.319 sec - in org.apache.activemq.artemis.core.server.impl.ScheduledDeliveryHandlerTest
Running org.apache.activemq.artemis.core.server.impl.jdbc.JdbcLeaseLockTest
Tests run: 20, Failures: 0, Errors: 0, Skipped: 0, Time elapsed: 171.938 sec - in org.apache.activemq.artemis.core.server.impl.jdbc.JdbcLeaseLockTest
Running org.apache.activemq.artemis.core.server.impl.jdbc.JdbcNodeManagerTest
Tests run: 2, Failures: 0, Errors: 0, Skipped: 0, Time elapsed: 16.77 sec - in org.apache.activemq.artemis.core.server.impl.jdbc.JdbcNodeManagerTest
Running org.apache.activemq.artemis.core.server.impl.jdbc.JdbcSharedStateManagerTest
Tests run: 4, Failures: 0, Errors: 1, Skipped: 0, Time elapsed: 39.95 sec <<< FAILURE!
- in org.apache.activemq.artemis.core.server.impl.jdbc.JdbcSharedStateManagerTest
shouldStartIfTableExistInitialized(org.apache.activemq.artemis.core.server.impl.jdbc.JdbcSharedStateManagerTest)
 Time elapsed: 11.255 sec  <<< ERROR!
java.lang.Exception: test timed out after 10000 milliseconds
	at java.io.RandomAccessFile.writeBytes(Native Method)
	at java.io.RandomAccessFile.write(RandomAccessFile.java:525)
	at org.apache.derby.impl.store.raw.log.LogAccessFile.writeToLog(Unknown Source)
	at org.apache.derby.impl.store.raw.log.LogAccessFile.flushDirtyBuffers(Unknown Source)
	at org.apache.derby.impl.store.raw.log.LogToFile.flush(Unknown Source)
	at org.apache.derby.impl.store.raw.log.LogToFile.flush(Unknown Source)
	at org.apache.derby.impl.store.raw.log.FileLogger.flush(Unknown Source)
	at org.apache.derby.impl.store.raw.xact.Xact.prepareCommit(Unknown Source)
	at org.apache.derby.impl.store.raw.xact.Xact.commit(Unknown Source)
	at org.apache.derby.impl.store.raw.xact.Xact.commit(Unknown Source)
	at org.apache.derby.impl.store.access.RAMTransaction.commit(Unknown Source)
	at org.apache.derby.impl.sql.conn.GenericLanguageConnectionContext.doCommit(Unknown Source)
	at org.apache.derby.impl.sql.conn.GenericLanguageConnectionContext.userCommit(Unknown Source)
	at org.apache.derby.impl.jdbc.TransactionResourceImpl.commit(Unknown Source)
	at org.apache.derby.impl.jdbc.EmbedConnection.commitIfNeeded(Unknown Source)
	at org.apache.derby.impl.jdbc.ConnectionChild.commitIfNeeded(Unknown Source)
	at org.apache.derby.impl.jdbc.EmbedStatement.executeStatement(Unknown Source)
	at org.apache.derby.impl.jdbc.EmbedStatement.execute(Unknown Source)
	at org.apache.derby.impl.jdbc.EmbedStatement.execute(Unknown Source)
	at org.apache.activemq.artemis.core.server.impl.jdbc.TestJDBCDriver.createSchema(TestJDBCDriver.java:62)
	at org.apache.activemq.artemis.jdbc.store.drivers.AbstractJDBCDriver.start(AbstractJDBCDriver.java:88)
	at org.apache.activemq.artemis.core.server.impl.jdbc.JdbcSharedStateManagerTest.shouldStartIfTableExistInitialized(JdbcSharedStateManagerTest.java:86)

Running org.apache.activemq.artemis.core.server.journal.JournalStorageManagerConstantTest
Tests run: 1, Failures: 0, Errors: 0, Skipped: 0, Time elapsed: 0.001 sec - in org.apache.activemq.artemis.core.server.journal.JournalStorageManagerConstantTest
Running org.apache.activemq.artemis.core.server.management.JMXAccessControlListTest
Tests run: 15, Failures: 0, Errors: 0, Skipped: 0, Time elapsed: 0.012 sec - in org.apache.activemq.artemis.core.server.management.JMXAccessControlListTest
Running org.apache.activemq.artemis.core.settings.AddressSettingsTest
Tests run: 4, Failures: 0, Errors: 0, Skipped: 0, Time elapsed: 0.014 sec - in org.apache.activemq.artemis.core.settings.AddressSettingsTest
Running org.apache.activemq.artemis.core.settings.RepositoryTest
Tests run: 11, Failures: 0, Errors: 0, Skipped: 0, Time elapsed: 0.039 sec - in org.apache.activemq.artemis.core.settings.RepositoryTest
Running org.apache.activemq.artemis.core.transaction.impl.TransactionImplTest
rollback...
rollback...
Tests run: 2, Failures: 0, Errors: 0, Skipped: 0, Time elapsed: 0.021 sec - in org.apache.activemq.artemis.core.transaction.impl.TransactionImplTest
Running org.apache.activemq.artemis.core.version.impl.VersionImplTest
Tests run: 3, Failures: 0, Errors: 0, Skipped: 0, Time elapsed: 0.005 sec - in org.apache.activemq.artemis.core.version.impl.VersionImplTest
Running org.apache.activemq.artemis.spi.core.security.jaas.Krb5LoginModuleTest
Tests run: 2, Failures: 0, Errors: 0, Skipped: 0, Time elapsed: 0.004 sec - in org.apache.activemq.artemis.spi.core.security.jaas.Krb5LoginModuleTest
Running org.apache.activemq.artemis.tests.util.SimpleStringTest
Tests run: 20, Failures: 0, Errors: 0, Skipped: 0, Time elapsed: 0.699 sec - in org.apache.activemq.artemis.tests.util.SimpleStringTest
Running org.apache.activemq.artemis.uri.AcceptorParserTest
config:TransportConfiguration(name=test, factory=org-apache-activemq-artemis-core-remoting-impl-netty-NettyAcceptorFactory)
?tcpReceiveBufferSize=1048576&port=8080&host=localhost&protocols=openwire&tcpSendBufferSize=1048576&banana=x
config:TransportConfiguration(name=test, factory=org-apache-activemq-artemis-core-remoting-impl-netty-NettyAcceptorFactory)
?tcpReceiveBufferSize=1048576&port=5672&host=0-0-0-0&tcpSendBufferSize=1048576&virtualTopicConsumerWildcards=Consumer-*->;2
Consumer.*.>;2
Tests run: 3, Failures: 0, Errors: 0, Skipped: 0, Time elapsed: 0.012 sec - in org.apache.activemq.artemis.uri.AcceptorParserTest
Running org.apache.activemq.artemis.uri.ClusterConnectionConfigurationTest
Tests run: 5, Failures: 0, Errors: 0, Skipped: 0, Time elapsed: 0.012 sec - in org.apache.activemq.artemis.uri.ClusterConnectionConfigurationTest

Results :

Tests in error: 
  JdbcSharedStateManagerTest.shouldStartIfTableExistInitialized:86 ยป  test timed...

Tests run: 328, Failures: 0, Errors: 1, Skipped: 0

[INFO] ------------------------------------------------------------------------
[INFO] Reactor Summary:
[INFO] 
[INFO] ActiveMQ Artemis Parent 2.11.0-SNAPSHOT ............ SUCCESS [  8.302 s]
[INFO] ActiveMQ Artemis Commons ........................... SUCCESS [ 38.639 s]
[INFO] ActiveMQ Artemis Core Client ....................... SUCCESS [ 32.847 s]
[INFO] ActiveMQ Artemis Selector Implementation ........... SUCCESS [  5.667 s]
[INFO] ActiveMQ Artemis JMS Client ........................ SUCCESS [  8.031 s]
[INFO] ActiveMQ Artemis Journal ........................... SUCCESS [  5.764 s]
[INFO] ActiveMQ Artemis JDBC Store ........................ SUCCESS [ 53.080 s]
[INFO] ActiveMQ Artemis Server ............................ FAILURE [07:55 min]
[INFO] ActiveMQ Artemis Protocols ......................... SKIPPED
[INFO] ActiveMQ Artemis AMQP Protocol ..................... SKIPPED
[INFO] ActiveMQ Artemis STOMP Protocol .................... SKIPPED
[INFO] ActiveMQ Artemis OpenWire Protocol ................. SKIPPED
[INFO] ActiveMQ Artemis HQClient Protocol ................. SKIPPED
[INFO] ActiveMQ Artemis HornetQ Protocol .................. SKIPPED
[INFO] ActiveMQ Artemis MQTT Protocol ..................... SKIPPED
[INFO] ActiveMQ Artemis DTO ............................... SKIPPED
[INFO] ActiveMQ Artemis Service Extensions ................ SKIPPED
[INFO] ActiveMQ Artemis JMS Server ........................ SKIPPED
[INFO] ActiveMQ Artemis CDI Integration ................... SKIPPED
[INFO] ActiveMQ Artemis Boot .............................. SKIPPED
[INFO] ActiveMQ Artemis Tools ............................. SKIPPED
[INFO] ActiveMQ Artemis JUnit Rules ....................... SKIPPED
[INFO] ActiveMQ Artemis CLI ............................... SKIPPED
[INFO] ActiveMQ Artemis Web ............................... SKIPPED
[INFO] ActiveMQ Artemis Web ............................... SKIPPED
[INFO] ActiveMQ Artemis Core Client All ................... SKIPPED
[INFO] ActiveMQ Artemis Client OSGi ....................... SKIPPED
[INFO] ActiveMQ Artemis JMS Client All .................... SKIPPED
[INFO] ActiveMQ Artemis JMS Client OSGi ................... SKIPPED
[INFO] ActiveMQ Artemis RAR POM ........................... SKIPPED
[INFO] ActiveMQ Artemis REST Interface Implementation ..... SKIPPED
[INFO] ActiveMQ Artemis Maven Plugin ...................... SKIPPED
[INFO] ActiveMQ Artemis Server OSGi ....................... SKIPPED
[INFO] ActiveMQ Artemis Cons .............................. SKIPPED
[INFO] ActiveMQ Artemis HawtIO Branding ................... SKIPPED
[INFO] ActiveMQ Artemis HawtIO Plugin ..................... SKIPPED
[INFO] ActiveMQ Artemis Console ........................... SKIPPED
[INFO] ActiveMQ Artemis Spring Integration ................ SKIPPED
[INFO] Apache ActiveMQ Artemis Distribution ............... SKIPPED
[INFO] ActiveMQ Artemis Tests POM ......................... SKIPPED
[INFO] ActiveMQ Artemis Test Support ...................... SKIPPED
[INFO] ActiveMQ Artemis Unit Tests ........................ SKIPPED
[INFO] ActiveMQ Artemis Joram Tests ....................... SKIPPED
[INFO] ActiveMQ Artemis timing Tests ...................... SKIPPED
[INFO] ActiveMQ Artemis JMS Tests ......................... SKIPPED
[INFO] ActiveMQ Artemis Features .......................... SKIPPED
[INFO] ActiveMQ Artemis Integration Tests ................. SKIPPED
[INFO] ActiveMQ Artemis Client Integration Tests .......... SKIPPED
[INFO] ActiveMQ Artemis Compatibility Tests ............... SKIPPED
[INFO] ActiveMQ Artemis soak Tests ........................ SKIPPED
[INFO] ActiveMQ Artemis stress Tests ...................... SKIPPED
[INFO] ActiveMQ Artemis performance Tests ................. SKIPPED
[INFO] Smoke Tests ........................................ SKIPPED
[INFO] ActiveMQ Artemis Extra Tests 2.11.0-SNAPSHOT ....... SKIPPED
[INFO] ------------------------------------------------------------------------
[INFO] BUILD FAILURE
[INFO] ------------------------------------------------------------------------
[INFO] Total time: 10:32 min
[INFO] Finished at: 2019-11-20T15:29:56Z
[INFO] ------------------------------------------------------------------------
[ERROR] Failed to execute goal org.apache.maven.plugins:maven-surefire-plugin:2.18.1:test
(default-test) on project artemis-server: There are test failures.
[ERROR] 
[ERROR] Please refer to <https://builds.apache.org/job/ActiveMQ-Artemis-Master/ws/artemis-server/target/surefire-reports>
for the individual test results.
[ERROR] -> [Help 1]
[ERROR] 
[ERROR] To see the full stack trace of the errors, re-run Maven with the -e switch.
[ERROR] Re-run Maven using the -X switch to enable full debug logging.
[ERROR] 
[ERROR] For more information about the errors and possible solutions, please read the following
articles:
[ERROR] [Help 1] http://cwiki.apache.org/confluence/display/MAVEN/MojoFailureException
[ERROR] 
[ERROR] After correcting the problems, you can resume the build with the command
[ERROR]   mvn <goals> -rf :artemis-server
Build step 'Invoke top-level Maven targets' marked build as failure
Performing Post build task...
Could not match :Too many files with unapproved license  : False
Logical operation result is FALSE
Skipping script  : cat ratReport.txt
END OF POST BUILD TASK 	: 0
Recording test results

Mime
View raw message