activemq-commits mailing list archives

Site index · List index
Message view « Date » · « Thread »
Top « Date » · « Thread »
From Apache Jenkins Server <jenk...@builds.apache.org>
Subject Build failed in Jenkins: ActiveMQ-Java8-5.15.x » ActiveMQ :: Unit Tests #233
Date Sat, 08 Jun 2019 00:58:53 GMT
See <https://builds.apache.org/job/ActiveMQ-Java8-5.15.x/org.apache.activemq$activemq-unit-tests/233/display/redirect>

------------------------------------------
[...truncated 55.31 KB...]
Running org.apache.activemq.broker.virtual.VirtualTopicsAndDurableSubsTest
Tests run: 36, Failures: 0, Errors: 0, Skipped: 0, Time elapsed: 35.332 sec - in org.apache.activemq.broker.virtual.VirtualTopicsAndDurableSubsTest
Running org.apache.activemq.bugs.AMQ2103Test
Tests run: 1, Failures: 0, Errors: 0, Skipped: 1, Time elapsed: 0.023 sec - in org.apache.activemq.bugs.AMQ2103Test
Running org.apache.activemq.bugs.AMQ2149LevelDBTest
Tests run: 1, Failures: 0, Errors: 0, Skipped: 1, Time elapsed: 0.021 sec - in org.apache.activemq.bugs.AMQ2149LevelDBTest
Running org.apache.activemq.bugs.AMQ2174Test
Tests run: 1, Failures: 0, Errors: 0, Skipped: 0, Time elapsed: 2.904 sec - in org.apache.activemq.bugs.AMQ2174Test
Running org.apache.activemq.bugs.AMQ2383Test
Tests run: 1, Failures: 0, Errors: 0, Skipped: 0, Time elapsed: 0.851 sec - in org.apache.activemq.bugs.AMQ2383Test
Running org.apache.activemq.bugs.AMQ2528Test
Tests run: 1, Failures: 0, Errors: 0, Skipped: 0, Time elapsed: 1.032 sec - in org.apache.activemq.bugs.AMQ2528Test
Running org.apache.activemq.bugs.AMQ2571Test
Tests run: 1, Failures: 0, Errors: 0, Skipped: 0, Time elapsed: 0.828 sec - in org.apache.activemq.bugs.AMQ2571Test
Running org.apache.activemq.bugs.AMQ2585Test
Tests run: 1, Failures: 0, Errors: 0, Skipped: 0, Time elapsed: 1.066 sec - in org.apache.activemq.bugs.AMQ2585Test
Running org.apache.activemq.bugs.AMQ2736Test
Tests run: 1, Failures: 0, Errors: 0, Skipped: 0, Time elapsed: 2.428 sec - in org.apache.activemq.bugs.AMQ2736Test
Running org.apache.activemq.bugs.AMQ2801Test
Tests run: 1, Failures: 0, Errors: 0, Skipped: 0, Time elapsed: 100.004 sec - in org.apache.activemq.bugs.AMQ2801Test
Running org.apache.activemq.bugs.AMQ2902Test
Tests run: 2, Failures: 0, Errors: 0, Skipped: 0, Time elapsed: 1.085 sec - in org.apache.activemq.bugs.AMQ2902Test
Running org.apache.activemq.bugs.AMQ3014Test
Tests run: 2, Failures: 0, Errors: 0, Skipped: 0, Time elapsed: 1.53 sec - in org.apache.activemq.bugs.AMQ3014Test
Running org.apache.activemq.bugs.AMQ3166Test
Tests run: 5, Failures: 0, Errors: 0, Skipped: 0, Time elapsed: 7.998 sec - in org.apache.activemq.bugs.AMQ3166Test
Running org.apache.activemq.bugs.AMQ3465Test
Tests run: 2, Failures: 0, Errors: 0, Skipped: 0, Time elapsed: 1.007 sec - in org.apache.activemq.bugs.AMQ3465Test
Running org.apache.activemq.bugs.AMQ3529v2Test
Tests run: 2, Failures: 0, Errors: 0, Skipped: 0, Time elapsed: 10.347 sec - in org.apache.activemq.bugs.AMQ3529v2Test
Running org.apache.activemq.bugs.AMQ3537Test
Tests run: 1, Failures: 0, Errors: 0, Skipped: 0, Time elapsed: 0.227 sec - in org.apache.activemq.bugs.AMQ3537Test
Running org.apache.activemq.bugs.AMQ3779Test
Tests run: 1, Failures: 0, Errors: 0, Skipped: 0, Time elapsed: 0.743 sec - in org.apache.activemq.bugs.AMQ3779Test
Running org.apache.activemq.bugs.AMQ3879Test
Tests run: 1, Failures: 0, Errors: 0, Skipped: 0, Time elapsed: 1.42 sec - in org.apache.activemq.bugs.AMQ3879Test
Running org.apache.activemq.bugs.AMQ3903Test
Tests run: 2, Failures: 0, Errors: 0, Skipped: 0, Time elapsed: 0.979 sec - in org.apache.activemq.bugs.AMQ3903Test
Running org.apache.activemq.bugs.AMQ3932Test
Tests run: 3, Failures: 0, Errors: 0, Skipped: 0, Time elapsed: 20.978 sec - in org.apache.activemq.bugs.AMQ3932Test
Running org.apache.activemq.bugs.AMQ3934Test
Tests run: 1, Failures: 0, Errors: 0, Skipped: 0, Time elapsed: 0.97 sec - in org.apache.activemq.bugs.AMQ3934Test
Running org.apache.activemq.bugs.AMQ3961Test
Tests run: 1, Failures: 0, Errors: 0, Skipped: 0, Time elapsed: 7.652 sec - in org.apache.activemq.bugs.AMQ3961Test
Running org.apache.activemq.bugs.AMQ3992Test
Tests run: 1, Failures: 0, Errors: 0, Skipped: 0, Time elapsed: 4.224 sec - in org.apache.activemq.bugs.AMQ3992Test
Running org.apache.activemq.bugs.AMQ4062Test
Tests run: 1, Failures: 0, Errors: 0, Skipped: 0, Time elapsed: 8.144 sec - in org.apache.activemq.bugs.AMQ4062Test
Running org.apache.activemq.bugs.AMQ4083Test
Tests run: 6, Failures: 0, Errors: 0, Skipped: 0, Time elapsed: 55.985 sec - in org.apache.activemq.bugs.AMQ4083Test
Running org.apache.activemq.bugs.AMQ4116Test
Tests run: 2, Failures: 0, Errors: 0, Skipped: 0, Time elapsed: 1.079 sec - in org.apache.activemq.bugs.AMQ4116Test
Running org.apache.activemq.bugs.AMQ4126Test
Tests run: 9, Failures: 0, Errors: 0, Skipped: 0, Time elapsed: 4.17 sec - in org.apache.activemq.bugs.AMQ4126Test
Running org.apache.activemq.bugs.AMQ4133Test
Tests run: 6, Failures: 0, Errors: 0, Skipped: 0, Time elapsed: 3.523 sec - in org.apache.activemq.bugs.AMQ4133Test
Running org.apache.activemq.bugs.AMQ4147Test
Tests run: 2, Failures: 0, Errors: 0, Skipped: 0, Time elapsed: 8.046 sec - in org.apache.activemq.bugs.AMQ4147Test
Running org.apache.activemq.bugs.AMQ4148Test
Tests run: 1, Failures: 0, Errors: 0, Skipped: 0, Time elapsed: 10.957 sec - in org.apache.activemq.bugs.AMQ4148Test
Running org.apache.activemq.bugs.AMQ4157Test
Tests run: 1, Failures: 0, Errors: 0, Skipped: 0, Time elapsed: 6.412 sec - in org.apache.activemq.bugs.AMQ4157Test
Running org.apache.activemq.bugs.AMQ4160Test
Tests run: 3, Failures: 0, Errors: 0, Skipped: 0, Time elapsed: 43.911 sec - in org.apache.activemq.bugs.AMQ4160Test
Running org.apache.activemq.bugs.AMQ4212Test
Tests run: 2, Failures: 0, Errors: 0, Skipped: 0, Time elapsed: 111.642 sec - in org.apache.activemq.bugs.AMQ4212Test
Running org.apache.activemq.bugs.AMQ4213Test
Tests run: 1, Failures: 0, Errors: 0, Skipped: 0, Time elapsed: 0.825 sec - in org.apache.activemq.bugs.AMQ4213Test
Running org.apache.activemq.bugs.AMQ4220Test
Tests run: 1, Failures: 0, Errors: 0, Skipped: 0, Time elapsed: 3.2 sec - in org.apache.activemq.bugs.AMQ4220Test
Running org.apache.activemq.bugs.AMQ4222Test
Tests run: 1, Failures: 0, Errors: 0, Skipped: 0, Time elapsed: 1.059 sec - in org.apache.activemq.bugs.AMQ4222Test
Running org.apache.activemq.bugs.AMQ4323Test
Tests run: 1, Failures: 0, Errors: 0, Skipped: 0, Time elapsed: 42.541 sec - in org.apache.activemq.bugs.AMQ4323Test
Running org.apache.activemq.bugs.AMQ4356Test
Tests run: 1, Failures: 0, Errors: 0, Skipped: 0, Time elapsed: 3.617 sec - in org.apache.activemq.bugs.AMQ4356Test
Running org.apache.activemq.bugs.AMQ4361Test
Tests run: 1, Failures: 0, Errors: 0, Skipped: 0, Time elapsed: 4.32 sec - in org.apache.activemq.bugs.AMQ4361Test
Running org.apache.activemq.bugs.AMQ4368Test
Tests run: 1, Failures: 0, Errors: 0, Skipped: 0, Time elapsed: 13.291 sec - in org.apache.activemq.bugs.AMQ4368Test
Running org.apache.activemq.bugs.AMQ4407Test
Tests run: 2, Failures: 0, Errors: 0, Skipped: 0, Time elapsed: 11.313 sec - in org.apache.activemq.bugs.AMQ4407Test
Running org.apache.activemq.bugs.AMQ4413Test
Tests run: 1, Failures: 0, Errors: 0, Skipped: 0, Time elapsed: 4.981 sec - in org.apache.activemq.bugs.AMQ4413Test
Running org.apache.activemq.bugs.AMQ4469Test
Tests run: 1, Failures: 0, Errors: 0, Skipped: 0, Time elapsed: 5.858 sec - in org.apache.activemq.bugs.AMQ4469Test
Running org.apache.activemq.bugs.AMQ4472Test
Tests run: 1, Failures: 0, Errors: 0, Skipped: 0, Time elapsed: 1.994 sec - in org.apache.activemq.bugs.AMQ4472Test
Running org.apache.activemq.bugs.AMQ4475Test
Tests run: 1, Failures: 0, Errors: 0, Skipped: 0, Time elapsed: 4.157 sec - in org.apache.activemq.bugs.AMQ4475Test
Running org.apache.activemq.bugs.AMQ4485LowLimitLevelDBTest
Tests run: 1, Failures: 0, Errors: 0, Skipped: 0, Time elapsed: 113.533 sec - in org.apache.activemq.bugs.AMQ4485LowLimitLevelDBTest
Running org.apache.activemq.bugs.AMQ4485LowLimitTest
Tests run: 1, Failures: 0, Errors: 0, Skipped: 0, Time elapsed: 362.594 sec - in org.apache.activemq.bugs.AMQ4485LowLimitTest
Running org.apache.activemq.bugs.AMQ4485NetworkOfXBrokersWithNDestsFanoutTransactionTest
Tests run: 1, Failures: 0, Errors: 0, Skipped: 0, Time elapsed: 213.047 sec - in org.apache.activemq.bugs.AMQ4485NetworkOfXBrokersWithNDestsFanoutTransactionTest
Running org.apache.activemq.bugs.AMQ4485Test
Tests run: 1, Failures: 0, Errors: 0, Skipped: 0, Time elapsed: 11.459 sec - in org.apache.activemq.bugs.AMQ4485Test
Running org.apache.activemq.bugs.AMQ4487Test
Tests run: 2, Failures: 0, Errors: 0, Skipped: 0, Time elapsed: 33.707 sec - in org.apache.activemq.bugs.AMQ4487Test
Running org.apache.activemq.bugs.AMQ4504Test
Tests run: 1, Failures: 0, Errors: 0, Skipped: 0, Time elapsed: 1.832 sec - in org.apache.activemq.bugs.AMQ4504Test
Running org.apache.activemq.bugs.AMQ4513Test
Tests run: 1, Failures: 0, Errors: 0, Skipped: 0, Time elapsed: 23.13 sec - in org.apache.activemq.bugs.AMQ4513Test
Running org.apache.activemq.bugs.AMQ4517Test
Tests run: 1, Failures: 0, Errors: 0, Skipped: 0, Time elapsed: 1.497 sec - in org.apache.activemq.bugs.AMQ4517Test
Running org.apache.activemq.bugs.AMQ4518Test
Tests run: 1, Failures: 0, Errors: 0, Skipped: 0, Time elapsed: 1.502 sec - in org.apache.activemq.bugs.AMQ4518Test
Running org.apache.activemq.bugs.AMQ4530Test
Tests run: 1, Failures: 0, Errors: 0, Skipped: 0, Time elapsed: 0.988 sec - in org.apache.activemq.bugs.AMQ4530Test
Running org.apache.activemq.bugs.AMQ4531Test
Tests run: 1, Failures: 0, Errors: 0, Skipped: 0, Time elapsed: 0.976 sec - in org.apache.activemq.bugs.AMQ4531Test
Running org.apache.activemq.bugs.AMQ4554Test
Tests run: 1, Failures: 0, Errors: 0, Skipped: 0, Time elapsed: 0.969 sec - in org.apache.activemq.bugs.AMQ4554Test
Running org.apache.activemq.bugs.AMQ4582Test
Tests run: 1, Failures: 0, Errors: 0, Skipped: 0, Time elapsed: 0.986 sec - in org.apache.activemq.bugs.AMQ4582Test
Running org.apache.activemq.bugs.AMQ4595Test
Tests run: 3, Failures: 0, Errors: 0, Skipped: 0, Time elapsed: 8.223 sec - in org.apache.activemq.bugs.AMQ4595Test
Running org.apache.activemq.bugs.AMQ4636Test
Tests run: 3, Failures: 0, Errors: 0, Skipped: 0, Time elapsed: 50.196 sec - in org.apache.activemq.bugs.AMQ4636Test
Running org.apache.activemq.bugs.AMQ4656Test
Tests run: 2, Failures: 0, Errors: 0, Skipped: 0, Time elapsed: 1.165 sec - in org.apache.activemq.bugs.AMQ4656Test
Running org.apache.activemq.bugs.AMQ4671Test
Tests run: 1, Failures: 0, Errors: 0, Skipped: 0, Time elapsed: 0.707 sec - in org.apache.activemq.bugs.AMQ4671Test
Running org.apache.activemq.bugs.AMQ4814Test
Tests run: 1, Failures: 0, Errors: 0, Skipped: 0, Time elapsed: 7.52 sec - in org.apache.activemq.bugs.AMQ4814Test
Running org.apache.activemq.bugs.AMQ4853Test
Tests run: 3, Failures: 0, Errors: 0, Skipped: 2, Time elapsed: 0.722 sec - in org.apache.activemq.bugs.AMQ4853Test
Running org.apache.activemq.bugs.AMQ4887Test
Tests run: 4, Failures: 0, Errors: 0, Skipped: 0, Time elapsed: 4.089 sec - in org.apache.activemq.bugs.AMQ4887Test
Running org.apache.activemq.bugs.AMQ4893Test
Tests run: 4, Failures: 0, Errors: 0, Skipped: 0, Time elapsed: 0.307 sec - in org.apache.activemq.bugs.AMQ4893Test
Running org.apache.activemq.bugs.AMQ4899Test
Tests run: 1, Failures: 0, Errors: 0, Skipped: 0, Time elapsed: 3.17 sec - in org.apache.activemq.bugs.AMQ4899Test
Running org.apache.activemq.bugs.AMQ4930Test
Tests run: 3, Failures: 0, Errors: 0, Skipped: 0, Time elapsed: 41.503 sec - in org.apache.activemq.bugs.AMQ4930Test
Running org.apache.activemq.bugs.AMQ4950Test
Tests run: 1, Failures: 0, Errors: 0, Skipped: 0, Time elapsed: 2.278 sec - in org.apache.activemq.bugs.AMQ4950Test
Running org.apache.activemq.bugs.AMQ4952Test
Tests run: 2, Failures: 1, Errors: 0, Skipped: 0, Time elapsed: 99.578 sec <<< FAILURE!
- in org.apache.activemq.bugs.AMQ4952Test
testConsumerBrokerRestart[enableAudit=false](org.apache.activemq.bugs.AMQ4952Test)  Time elapsed:
33.155 sec  <<< FAILURE!
java.lang.AssertionError: number of messages received expected:<2> but was:<1>
	at org.junit.Assert.fail(Assert.java:88)
	at org.junit.Assert.failNotEquals(Assert.java:834)
	at org.junit.Assert.assertEquals(Assert.java:645)
	at org.apache.activemq.bugs.AMQ4952Test.testConsumerBrokerRestart(AMQ4952Test.java:248)

Running org.apache.activemq.bugs.AMQ5035Test
Tests run: 1, Failures: 0, Errors: 0, Skipped: 0, Time elapsed: 4.725 sec - in org.apache.activemq.bugs.AMQ5035Test
Running org.apache.activemq.bugs.AMQ5136Test
Tests run: 2, Failures: 0, Errors: 0, Skipped: 0, Time elapsed: 0.945 sec - in org.apache.activemq.bugs.AMQ5136Test
Running org.apache.activemq.bugs.AMQ5212Test
Tests run: 10, Failures: 0, Errors: 0, Skipped: 0, Time elapsed: 131.964 sec - in org.apache.activemq.bugs.AMQ5212Test
Running org.apache.activemq.bugs.AMQ5266SingleDestTest
Tests run: 3, Failures: 0, Errors: 0, Skipped: 0, Time elapsed: 653.507 sec - in org.apache.activemq.bugs.AMQ5266SingleDestTest
Running org.apache.activemq.bugs.AMQ5274Test
Tests run: 1, Failures: 0, Errors: 0, Skipped: 0, Time elapsed: 15.22 sec - in org.apache.activemq.bugs.AMQ5274Test
Running org.apache.activemq.bugs.AMQ5336Test
Tests run: 1, Failures: 0, Errors: 0, Skipped: 0, Time elapsed: 2.344 sec - in org.apache.activemq.bugs.AMQ5336Test
Running org.apache.activemq.bugs.AMQ5381Test
Tests run: 1, Failures: 0, Errors: 0, Skipped: 0, Time elapsed: 0.889 sec - in org.apache.activemq.bugs.AMQ5381Test
Running org.apache.activemq.bugs.AMQ5421Test
Tests run: 1, Failures: 0, Errors: 0, Skipped: 0, Time elapsed: 2.709 sec - in org.apache.activemq.bugs.AMQ5421Test
Running org.apache.activemq.bugs.AMQ5426Test
Tests run: 1, Failures: 0, Errors: 0, Skipped: 0, Time elapsed: 7.77 sec - in org.apache.activemq.bugs.AMQ5426Test
Running org.apache.activemq.bugs.AMQ5450Test
Tests run: 2, Failures: 0, Errors: 0, Skipped: 0, Time elapsed: 12.05 sec - in org.apache.activemq.bugs.AMQ5450Test
Running org.apache.activemq.bugs.AMQ5486Test
Tests run: 1, Failures: 0, Errors: 0, Skipped: 0, Time elapsed: 1.753 sec - in org.apache.activemq.bugs.AMQ5486Test
Running org.apache.activemq.bugs.AMQ5567Test
Tests run: 6, Failures: 0, Errors: 0, Skipped: 0, Time elapsed: 71.954 sec - in org.apache.activemq.bugs.AMQ5567Test
Running org.apache.activemq.bugs.AMQ5712Test
Tests run: 1, Failures: 0, Errors: 0, Skipped: 0, Time elapsed: 32.645 sec - in org.apache.activemq.bugs.AMQ5712Test
Running org.apache.activemq.bugs.AMQ5814Test
Tests run: 1, Failures: 0, Errors: 0, Skipped: 0, Time elapsed: 1.079 sec - in org.apache.activemq.bugs.AMQ5814Test
Running org.apache.activemq.bugs.AMQ5822Test
Tests run: 1, Failures: 0, Errors: 0, Skipped: 0, Time elapsed: 3.8 sec - in org.apache.activemq.bugs.AMQ5822Test
Running org.apache.activemq.bugs.AMQ5844Test
Tests run: 1, Failures: 0, Errors: 0, Skipped: 0, Time elapsed: 9.685 sec - in org.apache.activemq.bugs.AMQ5844Test
Running org.apache.activemq.bugs.AMQ5863CompositePublishTest
Tests run: 3, Failures: 0, Errors: 0, Skipped: 0, Time elapsed: 24.244 sec - in org.apache.activemq.bugs.AMQ5863CompositePublishTest
Running org.apache.activemq.bugs.AMQ5893Test
Tests run: 2, Failures: 0, Errors: 0, Skipped: 0, Time elapsed: 1.154 sec - in org.apache.activemq.bugs.AMQ5893Test
Running org.apache.activemq.bugs.AMQ5914Test
Tests run: 1, Failures: 0, Errors: 0, Skipped: 0, Time elapsed: 2.373 sec - in org.apache.activemq.bugs.AMQ5914Test
Running org.apache.activemq.bugs.AMQ5921Test
Tests run: 1, Failures: 0, Errors: 0, Skipped: 0, Time elapsed: 0.972 sec - in org.apache.activemq.bugs.AMQ5921Test
Running org.apache.activemq.bugs.AMQ6000Test
Tests run: 1, Failures: 0, Errors: 0, Skipped: 0, Time elapsed: 1.223 sec - in org.apache.activemq.bugs.AMQ6000Test
Running org.apache.activemq.bugs.AMQ6059Test
Tests run: 2, Failures: 0, Errors: 0, Skipped: 0, Time elapsed: 8.01 sec - in org.apache.activemq.bugs.AMQ6059Test
Running org.apache.activemq.bugs.AMQ6094Test
Tests run: 1, Failures: 0, Errors: 0, Skipped: 0, Time elapsed: 72.03 sec - in org.apache.activemq.bugs.AMQ6094Test
Running org.apache.activemq.bugs.AMQ6117Test
Tests run: 1, Failures: 0, Errors: 0, Skipped: 0, Time elapsed: 5.916 sec - in org.apache.activemq.bugs.AMQ6117Test
Running org.apache.activemq.bugs.AMQ6121Test
Tests run: 1, Failures: 0, Errors: 0, Skipped: 0, Time elapsed: 11.276 sec - in org.apache.activemq.bugs.AMQ6121Test
Running org.apache.activemq.bugs.AMQ6122Test
Tests run: 1, Failures: 0, Errors: 0, Skipped: 0, Time elapsed: 20.104 sec - in org.apache.activemq.bugs.AMQ6122Test
Running org.apache.activemq.bugs.AMQ6125Test
Tests run: 1, Failures: 0, Errors: 0, Skipped: 0, Time elapsed: 0.787 sec - in org.apache.activemq.bugs.AMQ6125Test
Running org.apache.activemq.bugs.AMQ6131Test
Tests run: 2, Failures: 1, Errors: 0, Skipped: 0, Time elapsed: 77.557 sec <<< FAILURE!
- in org.apache.activemq.bugs.AMQ6131Test
testDurableWithNoMessageAfterRestartAndIndexRecovery(org.apache.activemq.bugs.AMQ6131Test)
 Time elapsed: 34.237 sec  <<< FAILURE!
java.lang.AssertionError: Should have added a journal file
	at org.junit.Assert.fail(Assert.java:88)
	at org.junit.Assert.assertTrue(Assert.java:41)
	at org.apache.activemq.bugs.AMQ6131Test.testDurableWithNoMessageAfterRestartAndIndexRecovery(AMQ6131Test.java:219)

Running org.apache.activemq.bugs.AMQ6133PersistJMSRedeliveryTest
Tests run: 1, Failures: 0, Errors: 0, Skipped: 0, Time elapsed: 56.77 sec - in org.apache.activemq.bugs.AMQ6133PersistJMSRedeliveryTest
Running org.apache.activemq.bugs.AMQ6194Test
Tests run: 2, Failures: 0, Errors: 0, Skipped: 0, Time elapsed: 1.151 sec - in org.apache.activemq.bugs.AMQ6194Test
Running org.apache.activemq.bugs.AMQ6240Test
Tests run: 1, Failures: 0, Errors: 0, Skipped: 0, Time elapsed: 8.912 sec - in org.apache.activemq.bugs.AMQ6240Test
Running org.apache.activemq.bugs.AMQ6244Test
Tests run: 1, Failures: 0, Errors: 0, Skipped: 0, Time elapsed: 1.09 sec - in org.apache.activemq.bugs.AMQ6244Test
Running org.apache.activemq.bugs.AMQ6254Test
Tests run: 4, Failures: 0, Errors: 0, Skipped: 0, Time elapsed: 10.794 sec - in org.apache.activemq.bugs.AMQ6254Test
Running org.apache.activemq.bugs.AMQ6264Test
Tests run: 1, Failures: 0, Errors: 0, Skipped: 0, Time elapsed: 3.503 sec - in org.apache.activemq.bugs.AMQ6264Test
Running org.apache.activemq.bugs.AMQ6293Test
Tests run: 1, Failures: 0, Errors: 0, Skipped: 0, Time elapsed: 2.905 sec - in org.apache.activemq.bugs.AMQ6293Test
Running org.apache.activemq.bugs.AMQ6387Test
Tests run: 4, Failures: 0, Errors: 0, Skipped: 0, Time elapsed: 1.123 sec - in org.apache.activemq.bugs.AMQ6387Test
Running org.apache.activemq.bugs.AMQ6432Test
Tests run: 1, Failures: 1, Errors: 0, Skipped: 0, Time elapsed: 693.803 sec <<< FAILURE!
- in org.apache.activemq.bugs.AMQ6432Test
testTransactedStoreUsageSuspendResume(org.apache.activemq.bugs.AMQ6432Test)  Time elapsed:
693.646 sec  <<< FAILURE!
java.lang.AssertionError: gc worked ok
	at org.junit.Assert.fail(Assert.java:88)
	at org.junit.Assert.assertTrue(Assert.java:41)
	at org.apache.activemq.bugs.AMQ6432Test.testTransactedStoreUsageSuspendResume(AMQ6432Test.java:148)

Running org.apache.activemq.bugs.AMQ6459Test

Results :

Failed tests: 
  InMemeoryJmsSchedulerTest>JmsSchedulerTest.testScheduleFullRecoveryRestart:215->JmsSchedulerTest.testScheduleRestart:293
Didn't receive the message
  AMQ4952Test.testConsumerBrokerRestart:248 number of messages received expected:<2>
but was:<1>
  AMQ6131Test.testDurableWithNoMessageAfterRestartAndIndexRecovery:219 Should have added a
journal file
  AMQ6432Test.testTransactedStoreUsageSuspendResume:148 gc worked ok

Tests in error: 
  InMemeoryJmsSchedulerTest>JmsSchedulerTest.testUpdatesAppliedToIndexBeforeJournalShouldBeDiscarded:222
� ClassCast

Tests run: 1549, Failures: 4, Errors: 1, Skipped: 33

[JENKINS] Recording test results

Mime
View raw message