activemq-commits mailing list archives

Site index · List index
Message view « Date » · « Thread »
Top « Date » · « Thread »
From Apache Jenkins Server <jenk...@builds.apache.org>
Subject Build failed in Jenkins: ActiveMQ-Artemis-Master #2265
Date Wed, 06 Feb 2019 14:49:56 GMT
See <https://builds.apache.org/job/ActiveMQ-Artemis-Master/2265/display/redirect?page=changes>

Changes:

[clebertsuconic] ARTEMIS-1058 Improving web temporary cleanup

------------------------------------------
[...truncated 724.53 KB...]
Or you can run the broker in the background using:

   "<https://builds.apache.org/job/ActiveMQ-Artemis-Master/ws/artemis-cli/target/tmp/junit6706732807321724120/broker/bin/artemis-service">
start

     _        _               _
    / \  ____| |_  ___ __  __(_) _____
   / _ \|  _ \ __|/ _ \  \/  | |/  __/
  / ___ \ | \/ |_/  __/ |\/| | |\___ \
 /_/   \_\|   \__\____|_|  |_|_|/___ /
 Apache ActiveMQ Artemis 2.7.0-SNAPSHOT


[main] 14:49:38,464 INFO  [org.apache.activemq.artemis.integration.bootstrap] AMQ101000: Starting
ActiveMQ Artemis Server
[main] 14:49:38,554 INFO  [org.apache.activemq.artemis.core.server] AMQ221000: live Message
Broker is starting with configuration Broker Configuration (clustered=false,journalDirectory=data/journal,bindingsDirectory=data/bindings,largeMessagesDirectory=data/large-messages,pagingDirectory=data/paging)
[main] 14:49:38,555 INFO  [org.apache.activemq.artemis.core.server] AMQ224073: Using MAPPED
Journal
[main] 14:49:38,555 INFO  [org.apache.activemq.artemis.core.server] AMQ221057: Global Max
Size is being adjusted to 1/2 of the JVM max size (-Xmx). being defined as 11,263,279,104
[main] 14:49:38,556 INFO  [org.apache.activemq.artemis.core.server] AMQ221043: Protocol module
found: [artemis-server]. Adding protocol support for: CORE
[main] 14:49:38,604 INFO  [org.apache.activemq.artemis.core.server] AMQ221034: Waiting indefinitely
to obtain live lock
[main] 14:49:38,604 INFO  [org.apache.activemq.artemis.core.server] AMQ221035: Live Server
Obtained live lock
[main] 14:49:38,645 INFO  [org.apache.activemq.artemis.core.server] AMQ221080: Deploying address
DLQ supporting [ANYCAST]
[main] 14:49:38,647 INFO  [org.apache.activemq.artemis.core.server] AMQ221003: Deploying ANYCAST
queue DLQ on address DLQ
[main] 14:49:38,650 INFO  [org.apache.activemq.artemis.core.server] AMQ221080: Deploying address
ExpiryQueue supporting [ANYCAST]
[main] 14:49:38,651 INFO  [org.apache.activemq.artemis.core.server] AMQ221003: Deploying ANYCAST
queue ExpiryQueue on address ExpiryQueue
[main] 14:49:38,657 WARN  [org.apache.activemq.artemis.core.server] AMQ222203: Classpath lacks
a protocol-manager for protocol STOMP, Protocol being ignored on acceptor TransportConfiguration(name=stomp,
factory=org-apache-activemq-artemis-core-remoting-impl-netty-NettyAcceptorFactory) ?tcpReceiveBufferSize=1048576&port=61613&host=0-0-0-0&protocols=STOMP&useEpoll=true&tcpSendBufferSize=1048576
[main] 14:49:38,665 WARN  [org.apache.activemq.artemis.core.server] AMQ222203: Classpath lacks
a protocol-manager for protocol AMQP, Protocol being ignored on acceptor TransportConfiguration(name=amqp,
factory=org-apache-activemq-artemis-core-remoting-impl-netty-NettyAcceptorFactory) ?tcpReceiveBufferSize=1048576&port=5672&host=0-0-0-0&protocols=AMQP&useEpoll=true&tcpSendBufferSize=1048576&amqpCredits=1000&amqpLowCredits=300
[main] 14:49:38,666 WARN  [org.apache.activemq.artemis.core.server] AMQ222203: Classpath lacks
a protocol-manager for protocol MQTT, Protocol being ignored on acceptor TransportConfiguration(name=mqtt,
factory=org-apache-activemq-artemis-core-remoting-impl-netty-NettyAcceptorFactory) ?tcpReceiveBufferSize=1048576&port=1883&host=0-0-0-0&protocols=MQTT&useEpoll=true&tcpSendBufferSize=1048576
[main] 14:49:38,667 WARN  [org.apache.activemq.artemis.core.server] AMQ222203: Classpath lacks
a protocol-manager for protocol AMQP, Protocol being ignored on acceptor TransportConfiguration(name=artemis,
factory=org-apache-activemq-artemis-core-remoting-impl-netty-NettyAcceptorFactory) ?tcpReceiveBufferSize=1048576&port=61616&host=0-0-0-0&protocols=CORE,AMQP,STOMP,HORNETQ,MQTT,OPENWIRE&useEpoll=true&tcpSendBufferSize=1048576&amqpCredits=1000&amqpLowCredits=300
[main] 14:49:38,667 WARN  [org.apache.activemq.artemis.core.server] AMQ222203: Classpath lacks
a protocol-manager for protocol STOMP, Protocol being ignored on acceptor TransportConfiguration(name=artemis,
factory=org-apache-activemq-artemis-core-remoting-impl-netty-NettyAcceptorFactory) ?tcpReceiveBufferSize=1048576&port=61616&host=0-0-0-0&protocols=CORE,AMQP,STOMP,HORNETQ,MQTT,OPENWIRE&useEpoll=true&tcpSendBufferSize=1048576&amqpCredits=1000&amqpLowCredits=300
[main] 14:49:38,668 WARN  [org.apache.activemq.artemis.core.server] AMQ222203: Classpath lacks
a protocol-manager for protocol HORNETQ, Protocol being ignored on acceptor TransportConfiguration(name=artemis,
factory=org-apache-activemq-artemis-core-remoting-impl-netty-NettyAcceptorFactory) ?tcpReceiveBufferSize=1048576&port=61616&host=0-0-0-0&protocols=CORE,AMQP,STOMP,HORNETQ,MQTT,OPENWIRE&useEpoll=true&tcpSendBufferSize=1048576&amqpCredits=1000&amqpLowCredits=300
[main] 14:49:38,668 WARN  [org.apache.activemq.artemis.core.server] AMQ222203: Classpath lacks
a protocol-manager for protocol MQTT, Protocol being ignored on acceptor TransportConfiguration(name=artemis,
factory=org-apache-activemq-artemis-core-remoting-impl-netty-NettyAcceptorFactory) ?tcpReceiveBufferSize=1048576&port=61616&host=0-0-0-0&protocols=CORE,AMQP,STOMP,HORNETQ,MQTT,OPENWIRE&useEpoll=true&tcpSendBufferSize=1048576&amqpCredits=1000&amqpLowCredits=300
[main] 14:49:38,668 WARN  [org.apache.activemq.artemis.core.server] AMQ222203: Classpath lacks
a protocol-manager for protocol OPENWIRE, Protocol being ignored on acceptor TransportConfiguration(name=artemis,
factory=org-apache-activemq-artemis-core-remoting-impl-netty-NettyAcceptorFactory) ?tcpReceiveBufferSize=1048576&port=61616&host=0-0-0-0&protocols=CORE,AMQP,STOMP,HORNETQ,MQTT,OPENWIRE&useEpoll=true&tcpSendBufferSize=1048576&amqpCredits=1000&amqpLowCredits=300
[main] 14:49:38,669 WARN  [org.apache.activemq.artemis.core.server] AMQ222203: Classpath lacks
a protocol-manager for protocol HORNETQ, Protocol being ignored on acceptor TransportConfiguration(name=hornetq,
factory=org-apache-activemq-artemis-core-remoting-impl-netty-NettyAcceptorFactory) ?port=5445&host=0-0-0-0&protocols=HORNETQ,STOMP&useEpoll=true&anycastPrefix=jms-queue-&multicastPrefix=jms-topic-
[main] 14:49:38,669 WARN  [org.apache.activemq.artemis.core.server] AMQ222203: Classpath lacks
a protocol-manager for protocol STOMP, Protocol being ignored on acceptor TransportConfiguration(name=hornetq,
factory=org-apache-activemq-artemis-core-remoting-impl-netty-NettyAcceptorFactory) ?port=5445&host=0-0-0-0&protocols=HORNETQ,STOMP&useEpoll=true&anycastPrefix=jms-queue-&multicastPrefix=jms-topic-
[main] 14:49:38,716 INFO  [org.apache.activemq.artemis.core.server] AMQ221020: Started EPOLL
Acceptor at 0.0.0.0:61616 for protocols [CORE]
[main] 14:49:38,760 INFO  [org.apache.activemq.artemis.core.server] AMQ221020: Started EPOLL
Acceptor at 0.0.0.0:5445 for protocols [CORE]
[main] 14:49:38,813 INFO  [org.apache.activemq.artemis.core.server] AMQ221020: Started EPOLL
Acceptor at 0.0.0.0:5672 for protocols [CORE]
[main] 14:49:38,856 INFO  [org.apache.activemq.artemis.core.server] AMQ221020: Started EPOLL
Acceptor at 0.0.0.0:1883 for protocols [CORE]
[main] 14:49:38,904 INFO  [org.apache.activemq.artemis.core.server] AMQ221020: Started EPOLL
Acceptor at 0.0.0.0:61613 for protocols [CORE]
[main] 14:49:38,946 INFO  [org.apache.activemq.artemis.core.server] AMQ221007: Server is now
live
[main] 14:49:38,946 INFO  [org.apache.activemq.artemis.core.server] AMQ221001: Apache ActiveMQ
Artemis Message Broker version 2.7.0-SNAPSHOT [0.0.0.0, nodeID=6d715526-2a1e-11e9-9ebe-024233dacb26]

Queue [name=queueM1, address=testMulticast, routingType=MULTICAST, durable=true, purgeOnNoConsumers=false,
autoCreateAddress=false, exclusive=false, lastValue=false, lastValueKey=null, nonDestructive=false,
consumersBeforeDispatch=0, delayBeforeDispatch=-1, autoCreateAddress=false] created successfully.
Queue [name=queueM2, address=testMulticast, routingType=MULTICAST, durable=true, purgeOnNoConsumers=false,
autoCreateAddress=false, exclusive=false, lastValue=false, lastValueKey=null, nonDestructive=false,
consumersBeforeDispatch=0, delayBeforeDispatch=-1, autoCreateAddress=false] created successfully.
Consumer:: filter = null
Consumer:: clientID = test-client
Consumer ActiveMQQueue[testAnycast], thread=0 wait until 10 messages are consumed
Consumer ActiveMQQueue[testAnycast], thread=0 Consumed: 10 messages
Consumer ActiveMQQueue[testAnycast], thread=0 Consumer thread finished
Sent 10 Messages.
[ActiveMQ Artemis Server Shutdown Timer] 14:49:40,565 INFO  [org.apache.activemq.artemis.core.server]
AMQ221002: Apache ActiveMQ Artemis Message Broker version 2.7.0-SNAPSHOT [6d715526-2a1e-11e9-9ebe-024233dacb26]
stopped, uptime 2.100 seconds
Server stopped!
Creating ActiveMQ Artemis instance at: <https://builds.apache.org/job/ActiveMQ-Artemis-Master/ws/artemis-cli/target/tmp/junit8647991079038660394/broker>

You can now start the broker by executing:  

   "<https://builds.apache.org/job/ActiveMQ-Artemis-Master/ws/artemis-cli/target/tmp/junit8647991079038660394/broker/bin/artemis">
run

Or you can run the broker in the background using:

   "<https://builds.apache.org/job/ActiveMQ-Artemis-Master/ws/artemis-cli/target/tmp/junit8647991079038660394/broker/bin/artemis-service">
start

     _        _               _
    / \  ____| |_  ___ __  __(_) _____
   / _ \|  _ \ __|/ _ \  \/  | |/  __/
  / ___ \ | \/ |_/  __/ |\/| | |\___ \
 /_/   \_\|   \__\____|_|  |_|_|/___ /
 Apache ActiveMQ Artemis 2.7.0-SNAPSHOT


[main] 14:49:40,714 INFO  [org.apache.activemq.artemis.integration.bootstrap] AMQ101000: Starting
ActiveMQ Artemis Server
[main] 14:49:40,789 INFO  [org.apache.activemq.artemis.core.server] AMQ221000: live Message
Broker is starting with configuration Broker Configuration (clustered=false,journalDirectory=data/journal,bindingsDirectory=data/bindings,largeMessagesDirectory=data/large-messages,pagingDirectory=data/paging)
[main] 14:49:40,790 INFO  [org.apache.activemq.artemis.core.server] AMQ224073: Using MAPPED
Journal
[main] 14:49:40,791 INFO  [org.apache.activemq.artemis.core.server] AMQ221057: Global Max
Size is being adjusted to 1/2 of the JVM max size (-Xmx). being defined as 11,263,279,104
[main] 14:49:40,791 INFO  [org.apache.activemq.artemis.core.server] AMQ221043: Protocol module
found: [artemis-server]. Adding protocol support for: CORE
[main] 14:49:40,831 INFO  [org.apache.activemq.artemis.core.server] AMQ221034: Waiting indefinitely
to obtain live lock
[main] 14:49:40,831 INFO  [org.apache.activemq.artemis.core.server] AMQ221035: Live Server
Obtained live lock
[main] 14:49:40,876 INFO  [org.apache.activemq.artemis.core.server] AMQ221080: Deploying address
DLQ supporting [ANYCAST]
[main] 14:49:40,878 INFO  [org.apache.activemq.artemis.core.server] AMQ221003: Deploying ANYCAST
queue DLQ on address DLQ
[main] 14:49:40,881 INFO  [org.apache.activemq.artemis.core.server] AMQ221080: Deploying address
ExpiryQueue supporting [ANYCAST]
[main] 14:49:40,882 INFO  [org.apache.activemq.artemis.core.server] AMQ221003: Deploying ANYCAST
queue ExpiryQueue on address ExpiryQueue
[main] 14:49:40,885 WARN  [org.apache.activemq.artemis.core.server] AMQ222203: Classpath lacks
a protocol-manager for protocol STOMP, Protocol being ignored on acceptor TransportConfiguration(name=stomp,
factory=org-apache-activemq-artemis-core-remoting-impl-netty-NettyAcceptorFactory) ?tcpReceiveBufferSize=1048576&port=61613&host=0-0-0-0&protocols=STOMP&useEpoll=true&tcpSendBufferSize=1048576
[main] 14:49:40,887 WARN  [org.apache.activemq.artemis.core.server] AMQ222203: Classpath lacks
a protocol-manager for protocol AMQP, Protocol being ignored on acceptor TransportConfiguration(name=amqp,
factory=org-apache-activemq-artemis-core-remoting-impl-netty-NettyAcceptorFactory) ?tcpReceiveBufferSize=1048576&port=5672&host=0-0-0-0&protocols=AMQP&useEpoll=true&tcpSendBufferSize=1048576&amqpCredits=1000&amqpLowCredits=300
[main] 14:49:40,888 WARN  [org.apache.activemq.artemis.core.server] AMQ222203: Classpath lacks
a protocol-manager for protocol MQTT, Protocol being ignored on acceptor TransportConfiguration(name=mqtt,
factory=org-apache-activemq-artemis-core-remoting-impl-netty-NettyAcceptorFactory) ?tcpReceiveBufferSize=1048576&port=1883&host=0-0-0-0&protocols=MQTT&useEpoll=true&tcpSendBufferSize=1048576
[main] 14:49:40,889 WARN  [org.apache.activemq.artemis.core.server] AMQ222203: Classpath lacks
a protocol-manager for protocol AMQP, Protocol being ignored on acceptor TransportConfiguration(name=artemis,
factory=org-apache-activemq-artemis-core-remoting-impl-netty-NettyAcceptorFactory) ?tcpReceiveBufferSize=1048576&port=61616&host=0-0-0-0&protocols=CORE,AMQP,STOMP,HORNETQ,MQTT,OPENWIRE&useEpoll=true&tcpSendBufferSize=1048576&amqpCredits=1000&amqpLowCredits=300
[main] 14:49:40,890 WARN  [org.apache.activemq.artemis.core.server] AMQ222203: Classpath lacks
a protocol-manager for protocol STOMP, Protocol being ignored on acceptor TransportConfiguration(name=artemis,
factory=org-apache-activemq-artemis-core-remoting-impl-netty-NettyAcceptorFactory) ?tcpReceiveBufferSize=1048576&port=61616&host=0-0-0-0&protocols=CORE,AMQP,STOMP,HORNETQ,MQTT,OPENWIRE&useEpoll=true&tcpSendBufferSize=1048576&amqpCredits=1000&amqpLowCredits=300
[main] 14:49:40,890 WARN  [org.apache.activemq.artemis.core.server] AMQ222203: Classpath lacks
a protocol-manager for protocol HORNETQ, Protocol being ignored on acceptor TransportConfiguration(name=artemis,
factory=org-apache-activemq-artemis-core-remoting-impl-netty-NettyAcceptorFactory) ?tcpReceiveBufferSize=1048576&port=61616&host=0-0-0-0&protocols=CORE,AMQP,STOMP,HORNETQ,MQTT,OPENWIRE&useEpoll=true&tcpSendBufferSize=1048576&amqpCredits=1000&amqpLowCredits=300
[main] 14:49:40,890 WARN  [org.apache.activemq.artemis.core.server] AMQ222203: Classpath lacks
a protocol-manager for protocol MQTT, Protocol being ignored on acceptor TransportConfiguration(name=artemis,
factory=org-apache-activemq-artemis-core-remoting-impl-netty-NettyAcceptorFactory) ?tcpReceiveBufferSize=1048576&port=61616&host=0-0-0-0&protocols=CORE,AMQP,STOMP,HORNETQ,MQTT,OPENWIRE&useEpoll=true&tcpSendBufferSize=1048576&amqpCredits=1000&amqpLowCredits=300
[main] 14:49:40,890 WARN  [org.apache.activemq.artemis.core.server] AMQ222203: Classpath lacks
a protocol-manager for protocol OPENWIRE, Protocol being ignored on acceptor TransportConfiguration(name=artemis,
factory=org-apache-activemq-artemis-core-remoting-impl-netty-NettyAcceptorFactory) ?tcpReceiveBufferSize=1048576&port=61616&host=0-0-0-0&protocols=CORE,AMQP,STOMP,HORNETQ,MQTT,OPENWIRE&useEpoll=true&tcpSendBufferSize=1048576&amqpCredits=1000&amqpLowCredits=300
[main] 14:49:40,891 WARN  [org.apache.activemq.artemis.core.server] AMQ222203: Classpath lacks
a protocol-manager for protocol HORNETQ, Protocol being ignored on acceptor TransportConfiguration(name=hornetq,
factory=org-apache-activemq-artemis-core-remoting-impl-netty-NettyAcceptorFactory) ?port=5445&host=0-0-0-0&protocols=HORNETQ,STOMP&useEpoll=true&anycastPrefix=jms-queue-&multicastPrefix=jms-topic-
[main] 14:49:40,891 WARN  [org.apache.activemq.artemis.core.server] AMQ222203: Classpath lacks
a protocol-manager for protocol STOMP, Protocol being ignored on acceptor TransportConfiguration(name=hornetq,
factory=org-apache-activemq-artemis-core-remoting-impl-netty-NettyAcceptorFactory) ?port=5445&host=0-0-0-0&protocols=HORNETQ,STOMP&useEpoll=true&anycastPrefix=jms-queue-&multicastPrefix=jms-topic-
[main] 14:49:40,965 INFO  [org.apache.activemq.artemis.core.server] AMQ221020: Started EPOLL
Acceptor at 0.0.0.0:61616 for protocols [CORE]
[main] 14:49:41,011 INFO  [org.apache.activemq.artemis.core.server] AMQ221020: Started EPOLL
Acceptor at 0.0.0.0:5445 for protocols [CORE]
[main] 14:49:41,054 INFO  [org.apache.activemq.artemis.core.server] AMQ221020: Started EPOLL
Acceptor at 0.0.0.0:5672 for protocols [CORE]
[main] 14:49:41,122 INFO  [org.apache.activemq.artemis.core.server] AMQ221020: Started EPOLL
Acceptor at 0.0.0.0:1883 for protocols [CORE]
[main] 14:49:41,172 INFO  [org.apache.activemq.artemis.core.server] AMQ221020: Started EPOLL
Acceptor at 0.0.0.0:61613 for protocols [CORE]
[main] 14:49:41,215 INFO  [org.apache.activemq.artemis.core.server] AMQ221007: Server is now
live
[main] 14:49:41,215 INFO  [org.apache.activemq.artemis.core.server] AMQ221001: Apache ActiveMQ
Artemis Message Broker version 2.7.0-SNAPSHOT [0.0.0.0, nodeID=6ec8f62d-2a1e-11e9-9ebe-024233dacb26]

Queue [name=queueM1, address=testMulticast, routingType=MULTICAST, durable=true, purgeOnNoConsumers=false,
autoCreateAddress=false, exclusive=false, lastValue=false, lastValueKey=null, nonDestructive=false,
consumersBeforeDispatch=0, delayBeforeDispatch=-1, autoCreateAddress=false] created successfully.
Queue [name=queueM2, address=testMulticast, routingType=MULTICAST, durable=true, purgeOnNoConsumers=false,
autoCreateAddress=false, exclusive=false, lastValue=false, lastValueKey=null, nonDestructive=false,
consumersBeforeDispatch=0, delayBeforeDispatch=-1, autoCreateAddress=false] created successfully.
Consumer:: filter = null
Consumer:: clientID = test-client
Consumer ActiveMQQueue[testAnycast], thread=0 wait until 10 messages are consumed
Consumer ActiveMQQueue[testAnycast], thread=0 Consumed: 10 messages
Consumer ActiveMQQueue[testAnycast], thread=0 Consumer thread finished
Sent 10 Messages.
[ActiveMQ Artemis Server Shutdown Timer] 14:49:43,791 INFO  [org.apache.activemq.artemis.core.server]
AMQ221002: Apache ActiveMQ Artemis Message Broker version 2.7.0-SNAPSHOT [6ec8f62d-2a1e-11e9-9ebe-024233dacb26]
stopped, uptime 3.076 seconds
Server stopped!
Tests run: 9, Failures: 0, Errors: 0, Skipped: 0, Time elapsed: 23.233 sec - in org.apache.activemq.cli.test.MessageSerializerTest
Running org.apache.activemq.cli.test.OptionsValidationTest
Tests run: 28, Failures: 0, Errors: 0, Skipped: 0, Time elapsed: 0.65 sec - in org.apache.activemq.cli.test.OptionsValidationTest
Running org.apache.activemq.cli.test.StreamClassPathTest
Tests run: 1, Failures: 0, Errors: 0, Skipped: 0, Time elapsed: 0.002 sec - in org.apache.activemq.cli.test.StreamClassPathTest

Results :

Tests run: 66, Failures: 0, Errors: 0, Skipped: 0

[INFO] 
[INFO] --- maven-jar-plugin:2.4:jar (default-jar) @ artemis-cli ---
[INFO] Building jar: <https://builds.apache.org/job/ActiveMQ-Artemis-Master/ws/artemis-cli/target/artemis-cli-2.7.0-SNAPSHOT.jar>
[INFO] 
[INFO] --- maven-site-plugin:3.3:attach-descriptor (attach-descriptor) @ artemis-cli ---
[INFO] 
[INFO] --- maven-source-plugin:2.2.1:jar-no-fork (attach-sources) @ artemis-cli ---
[INFO] Building jar: <https://builds.apache.org/job/ActiveMQ-Artemis-Master/ws/artemis-cli/target/artemis-cli-2.7.0-SNAPSHOT-sources.jar>
[INFO] 
[INFO] --- dependency-check-maven:1.4.3:check (default) @ artemis-cli ---
[INFO] Skipping dependency-check
[INFO] 
[INFO] --- maven-install-plugin:2.4:install (default-install) @ artemis-cli ---
[INFO] Installing <https://builds.apache.org/job/ActiveMQ-Artemis-Master/ws/artemis-cli/target/artemis-cli-2.7.0-SNAPSHOT.jar>
to /home/jenkins/.m2/repository/org/apache/activemq/artemis-cli/2.7.0-SNAPSHOT/artemis-cli-2.7.0-SNAPSHOT.jar
[INFO] Installing <https://builds.apache.org/job/ActiveMQ-Artemis-Master/ws/artemis-cli/pom.xml>
to /home/jenkins/.m2/repository/org/apache/activemq/artemis-cli/2.7.0-SNAPSHOT/artemis-cli-2.7.0-SNAPSHOT.pom
[INFO] Installing <https://builds.apache.org/job/ActiveMQ-Artemis-Master/ws/artemis-cli/target/artemis-cli-2.7.0-SNAPSHOT-sources.jar>
to /home/jenkins/.m2/repository/org/apache/activemq/artemis-cli/2.7.0-SNAPSHOT/artemis-cli-2.7.0-SNAPSHOT-sources.jar
[INFO]                                                                         
[INFO] ------------------------------------------------------------------------
[INFO] Building ActiveMQ Artemis Web 2.7.0-SNAPSHOT
[INFO] ------------------------------------------------------------------------
[INFO] 
[INFO] --- maven-enforcer-plugin:1.4:enforce (enforce-maven) @ artemis-web ---
[INFO] 
[INFO] --- maven-enforcer-plugin:1.4:enforce (enforce-java) @ artemis-web ---
[INFO] 
[INFO] --- maven-remote-resources-plugin:1.5:process (process-resource-bundles) @ artemis-web
---
[INFO] 
[INFO] --- maven-resources-plugin:2.6:resources (default-resources) @ artemis-web ---
[INFO] Using 'UTF-8' encoding to copy filtered resources.
[INFO] skip non existing resourceDirectory <https://builds.apache.org/job/ActiveMQ-Artemis-Master/ws/artemis-web/src/main/resources>
[INFO] Copying 3 resources
[INFO] 
[INFO] --- maven-compiler-plugin:3.1:compile (default-compile) @ artemis-web ---
[INFO] Changes detected - recompiling the module!
[INFO] Compiling 3 source files to <https://builds.apache.org/job/ActiveMQ-Artemis-Master/ws/artemis-web/target/classes>
[INFO] 
[INFO] --- maven-checkstyle-plugin:2.17:check (default) @ artemis-web ---
[INFO] Starting audit...
[ERROR] <https://builds.apache.org/job/ActiveMQ-Artemis-Master/ws/artemis-web/src/test/java/org/apache/activemq/cli/test/WebServerCLITest.java>:21:8:
Unused import - java.io.OutputStream. [UnusedImports]
Audit done.
[INFO] There is 1 error reported by Checkstyle 7.7 with <https://builds.apache.org/job/ActiveMQ-Artemis-Master/ws/artemis-web/../etc/checkstyle.xml>
ruleset.
[ERROR] src/test/java/org/apache/activemq/cli/test/WebServerCLITest.java:[21,8] (imports)
UnusedImports: Unused import - java.io.OutputStream.
[INFO] ------------------------------------------------------------------------
[INFO] Reactor Summary:
[INFO] 
[INFO] ActiveMQ Artemis Parent ............................ SUCCESS [  6.730 s]
[INFO] ActiveMQ Artemis Commons ........................... SUCCESS [ 29.081 s]
[INFO] ActiveMQ Artemis Core Client ....................... SUCCESS [ 15.867 s]
[INFO] ActiveMQ Artemis Selector Implementation ........... SUCCESS [  5.768 s]
[INFO] ActiveMQ Artemis JMS Client ........................ SUCCESS [  6.128 s]
[INFO] ActiveMQ Artemis Native POM ........................ SUCCESS [  6.981 s]
[INFO] ActiveMQ Artemis Journal ........................... SUCCESS [  4.246 s]
[INFO] ActiveMQ Artemis JDBC Store ........................ SUCCESS [ 30.340 s]
[INFO] ActiveMQ Artemis Server ............................ SUCCESS [06:08 min]
[INFO] ActiveMQ Artemis Protocols ......................... SUCCESS [  0.210 s]
[INFO] ActiveMQ Artemis AMQP Protocol ..................... SUCCESS [ 12.053 s]
[INFO] ActiveMQ Artemis STOMP Protocol .................... SUCCESS [  2.929 s]
[INFO] ActiveMQ Artemis OpenWire Protocol ................. SUCCESS [  3.615 s]
[INFO] ActiveMQ Artemis HQClient Protocol ................. SUCCESS [  1.000 s]
[INFO] ActiveMQ Artemis HornetQ Protocol .................. SUCCESS [  1.563 s]
[INFO] ActiveMQ Artemis MQTT Protocol ..................... SUCCESS [  2.475 s]
[INFO] ActiveMQ Artemis DTO ............................... SUCCESS [  2.974 s]
[INFO] ActiveMQ Artemis Service Extensions ................ SUCCESS [  2.538 s]
[INFO] ActiveMQ Artemis JMS Server ........................ SUCCESS [  2.608 s]
[INFO] ActiveMQ Artemis CDI Integration ................... SUCCESS [  6.339 s]
[INFO] ActiveMQ Artemis Boot .............................. SUCCESS [  0.395 s]
[INFO] ActiveMQ Artemis Tools ............................. SUCCESS [  0.992 s]
[INFO] ActiveMQ Artemis JUnit Rules ....................... SUCCESS [  9.004 s]
[INFO] ActiveMQ Artemis CLI ............................... SUCCESS [01:27 min]
[INFO] ActiveMQ Artemis Web ............................... FAILURE [  3.710 s]
[INFO] ActiveMQ Artemis Web ............................... SKIPPED
[INFO] ActiveMQ Artemis Core Client All ................... SKIPPED
[INFO] ActiveMQ Artemis Client OSGi ....................... SKIPPED
[INFO] ActiveMQ Artemis JMS Client All .................... SKIPPED
[INFO] ActiveMQ Artemis JMS Client OSGi ................... SKIPPED
[INFO] ActiveMQ Artemis RAR POM ........................... SKIPPED
[INFO] ActiveMQ Artemis REST Interface Implementation ..... SKIPPED
[INFO] ActiveMQ Artemis Maven Plugin ...................... SKIPPED
[INFO] ActiveMQ Artemis Server OSGi ....................... SKIPPED
[INFO] ActiveMQ Artemis Cons .............................. SKIPPED
[INFO] ActiveMQ Artemis HawtIO Branding ................... SKIPPED
[INFO] ActiveMQ Artemis HawtIO Plugin ..................... SKIPPED
[INFO] ActiveMQ Artemis Console ........................... SKIPPED
[INFO] ActiveMQ Artemis Spring Integration ................ SKIPPED
[INFO] Apache ActiveMQ Artemis Distribution ............... SKIPPED
[INFO] ActiveMQ Artemis Tests POM ......................... SKIPPED
[INFO] ActiveMQ Artemis Test Support ...................... SKIPPED
[INFO] ActiveMQ Artemis Unit Tests ........................ SKIPPED
[INFO] ActiveMQ Artemis Joram Tests ....................... SKIPPED
[INFO] ActiveMQ Artemis timing Tests ...................... SKIPPED
[INFO] ActiveMQ Artemis JMS Tests ......................... SKIPPED
[INFO] ActiveMQ Artemis Features .......................... SKIPPED
[INFO] ActiveMQ Artemis Integration Tests ................. SKIPPED
[INFO] ActiveMQ Artemis Client Integration Tests .......... SKIPPED
[INFO] ActiveMQ Artemis Compatibility Tests ............... SKIPPED
[INFO] ActiveMQ Artemis soak Tests ........................ SKIPPED
[INFO] ActiveMQ Artemis stress Tests ...................... SKIPPED
[INFO] ActiveMQ Artemis performance Tests ................. SKIPPED
[INFO] Smoke Tests ........................................ SKIPPED
[INFO] ActiveMQ Artemis Extra Tests ....................... SKIPPED
[INFO] ------------------------------------------------------------------------
[INFO] BUILD FAILURE
[INFO] ------------------------------------------------------------------------
[INFO] Total time: 10:16 min
[INFO] Finished at: 2019-02-06T14:49:49+00:00
[INFO] Final Memory: 237M/3988M
[INFO] ------------------------------------------------------------------------
[ERROR] Failed to execute goal org.apache.maven.plugins:maven-checkstyle-plugin:2.17:check
(default) on project artemis-web: You have 1 Checkstyle violation. -> [Help 1]
[ERROR] 
[ERROR] To see the full stack trace of the errors, re-run Maven with the -e switch.
[ERROR] Re-run Maven using the -X switch to enable full debug logging.
[ERROR] 
[ERROR] For more information about the errors and possible solutions, please read the following
articles:
[ERROR] [Help 1] http://cwiki.apache.org/confluence/display/MAVEN/MojoFailureException
[ERROR] 
[ERROR] After correcting the problems, you can resume the build with the command
[ERROR]   mvn <goals> -rf :artemis-web
Build step 'Invoke top-level Maven targets' marked build as failure
Performing Post build task...
Could not match :Too many files with unapproved license  : False
Logical operation result is FALSE
Skipping script  : cat ratReport.txt
END OF POST BUILD TASK 	: 0
Recording test results
Not sending mail to unregistered user sato.tadayoshi@gmail.com
Not sending mail to unregistered user nigro.fra@gmail.com
Not sending mail to unregistered user tabish121@gmail.com
Not sending mail to unregistered user michael.andre.pearce@me.com
Not sending mail to unregistered user howard.gao@gmail.com
Not sending mail to unregistered user emmanuel.hugonnet+gitkraken@gmail.com
Not sending mail to unregistered user mtaylor@redhat.com
Not sending mail to unregistered user sebthom@users.noreply.github.com
Not sending mail to unregistered user wy96fyw@gmail.com

Mime
View raw message