activemq-commits mailing list archives

Site index · List index
Message view « Date » · « Thread »
Top « Date » · « Thread »
From Apache Jenkins Server <jenk...@builds.apache.org>
Subject Build failed in Jenkins: ActiveMQ-Artemis-Master #2269
Date Thu, 07 Feb 2019 20:52:40 GMT
See <https://builds.apache.org/job/ActiveMQ-Artemis-Master/2269/display/redirect?page=changes>

Changes:

[clebertsuconic] ARTEMIS-2246 clarify docs for defaults; change max-disk-usage default

[clebertsuconic] ARTEMIS-2246 Setting the max-disk-usage as 100 on the testsuite

------------------------------------------
[...truncated 249.83 KB...]
[main] 20:46:33,663 INFO  [org.apache.activemq.artemis.core.server] AMQ221012: Using AIO Journal
[main] 20:46:33,664 INFO  [org.apache.activemq.artemis.core.server] AMQ221043: Protocol module
found: [artemis-server]. Adding protocol support for: CORE
[main] 20:46:33,704 INFO  [org.apache.activemq.artemis.core.server] AMQ221034: Waiting indefinitely
to obtain live lock
[main] 20:46:33,704 INFO  [org.apache.activemq.artemis.core.server] AMQ221035: Live Server
Obtained live lock
[main] 20:46:34,374 INFO  [org.apache.activemq.artemis.core.server] AMQ221007: Server is now
live
[main] 20:46:34,374 INFO  [org.apache.activemq.artemis.core.server] AMQ221001: Apache ActiveMQ
Artemis Message Broker version 2.7.0-SNAPSHOT [localhost, nodeID=7443d50c-2b19-11e9-abd0-0242132c567d]

[main] 20:46:34,483 INFO  [org.apache.activemq.artemis.core.server] AMQ221002: Apache ActiveMQ
Artemis Message Broker version 2.7.0-SNAPSHOT [7443d50c-2b19-11e9-abd0-0242132c567d] stopped,
uptime 0.883 seconds
[main] 20:46:34,486 INFO  [org.apache.activemq.artemis.core.server] **** end #test liveOnlyTest5()
***
[main] 20:46:34,487 INFO  [org.apache.activemq.artemis.core.server] **** start #test ReplicaTest2()
***
[main] 20:46:34,575 INFO  [org.apache.activemq.artemis.core.server] AMQ221000: backup Message
Broker is starting with configuration Broker Configuration (clustered=false,journalDirectory=<https://builds.apache.org/job/ActiveMQ-Artemis-Master/ws/artemis-server/./target/tmp/junit3761065482749772956/data/journal,bindingsDirectory=/home/jenkins/jenkins-slave/workspace/ActiveMQ-Artemis-Master/artemis-server/./target/tmp/junit3761065482749772956/data/bindings,largeMessagesDirectory=/home/jenkins/jenkins-slave/workspace/ActiveMQ-Artemis-Master/artemis-server/./target/tmp/junit3761065482749772956/data/largemessages,pagingDirectory=/home/jenkins/jenkins-slave/workspace/ActiveMQ-Artemis-Master/artemis-server/./target/tmp/junit3761065482749772956/data/paging)>
[AMQ229000: Activation for server ActiveMQServerImpl::serverUUID=null] 20:46:34,577 INFO 
[org.apache.activemq.artemis.core.server] AMQ222162: Moving data directory <https://builds.apache.org/job/ActiveMQ-Artemis-Master/ws/artemis-server/./target/tmp/junit3761065482749772956/data/journal>
to <https://builds.apache.org/job/ActiveMQ-Artemis-Master/ws/artemis-server/./target/tmp/junit3761065482749772956/data/journal/oldreplica.1>
[main] 20:46:34,578 INFO  [org.apache.activemq.artemis.core.server] AMQ221002: Apache ActiveMQ
Artemis Message Broker version 2.7.0-SNAPSHOT [null] stopped, uptime 0.074 seconds
[main] 20:46:34,580 INFO  [org.apache.activemq.artemis.core.server] **** end #test ReplicaTest2()
***
[main] 20:46:34,580 INFO  [org.apache.activemq.artemis.core.server] **** start #test ReplicaTest3()
***
[main] 20:46:34,668 INFO  [org.apache.activemq.artemis.core.server] AMQ221000: backup Message
Broker is starting with configuration Broker Configuration (clustered=false,journalDirectory=<https://builds.apache.org/job/ActiveMQ-Artemis-Master/ws/artemis-server/./target/tmp/junit5697683451785955646/data/journal,bindingsDirectory=/home/jenkins/jenkins-slave/workspace/ActiveMQ-Artemis-Master/artemis-server/./target/tmp/junit5697683451785955646/data/bindings,largeMessagesDirectory=/home/jenkins/jenkins-slave/workspace/ActiveMQ-Artemis-Master/artemis-server/./target/tmp/junit5697683451785955646/data/largemessages,pagingDirectory=/home/jenkins/jenkins-slave/workspace/ActiveMQ-Artemis-Master/artemis-server/./target/tmp/junit5697683451785955646/data/paging)>
[AMQ229000: Activation for server ActiveMQServerImpl::serverUUID=null] 20:46:34,669 INFO 
[org.apache.activemq.artemis.core.server] AMQ222162: Moving data directory <https://builds.apache.org/job/ActiveMQ-Artemis-Master/ws/artemis-server/./target/tmp/junit5697683451785955646/data/journal>
to <https://builds.apache.org/job/ActiveMQ-Artemis-Master/ws/artemis-server/./target/tmp/junit5697683451785955646/data/journal/oldreplica.1>
[main] 20:46:34,670 INFO  [org.apache.activemq.artemis.core.server] AMQ221002: Apache ActiveMQ
Artemis Message Broker version 2.7.0-SNAPSHOT [null] stopped, uptime 0.067 seconds
[main] 20:46:34,672 INFO  [org.apache.activemq.artemis.core.server] **** end #test ReplicaTest3()
***
[main] 20:46:34,672 INFO  [org.apache.activemq.artemis.core.server] **** start #test colocatedTestNullBackup()
***
[main] 20:46:34,760 INFO  [org.apache.activemq.artemis.core.server] AMQ221000: live Message
Broker is starting with configuration Broker Configuration (clustered=false,journalDirectory=<https://builds.apache.org/job/ActiveMQ-Artemis-Master/ws/artemis-server/./target/tmp/junit1279883041718857235/data/journal,bindingsDirectory=/home/jenkins/jenkins-slave/workspace/ActiveMQ-Artemis-Master/artemis-server/./target/tmp/junit1279883041718857235/data/bindings,largeMessagesDirectory=/home/jenkins/jenkins-slave/workspace/ActiveMQ-Artemis-Master/artemis-server/./target/tmp/junit1279883041718857235/data/largemessages,pagingDirectory=/home/jenkins/jenkins-slave/workspace/ActiveMQ-Artemis-Master/artemis-server/./target/tmp/junit1279883041718857235/data/paging)>
[main] 20:46:34,761 INFO  [org.apache.activemq.artemis.core.server] AMQ221012: Using AIO Journal
[main] 20:46:34,762 INFO  [org.apache.activemq.artemis.core.server] AMQ221043: Protocol module
found: [artemis-server]. Adding protocol support for: CORE
[main] 20:46:35,166 INFO  [org.apache.activemq.artemis.core.server] AMQ221007: Server is now
live
[main] 20:46:35,166 INFO  [org.apache.activemq.artemis.core.server] AMQ221001: Apache ActiveMQ
Artemis Message Broker version 2.7.0-SNAPSHOT [localhost, nodeID=74eb5fb0-2b19-11e9-abd0-0242132c567d]

[main] 20:46:35,263 INFO  [org.apache.activemq.artemis.core.server] AMQ221002: Apache ActiveMQ
Artemis Message Broker version 2.7.0-SNAPSHOT [74eb5fb0-2b19-11e9-abd0-0242132c567d] stopped,
uptime 0.568 seconds
[main] 20:46:35,266 INFO  [org.apache.activemq.artemis.core.server] **** end #test colocatedTestNullBackup()
***
Tests run: 18, Failures: 0, Errors: 0, Skipped: 0, Time elapsed: 20.417 sec - in org.apache.activemq.artemis.core.config.impl.HAPolicyConfigurationTest
Running org.apache.activemq.artemis.core.config.impl.ValidatorsTest
Tests run: 9, Failures: 0, Errors: 0, Skipped: 0, Time elapsed: 0.006 sec - in org.apache.activemq.artemis.core.config.impl.ValidatorsTest
Running org.apache.activemq.artemis.core.config.impl.WrongRoleFileConfigurationParserTest
[main] 20:46:35,275 INFO  [org.apache.activemq.artemis.core.server] **** start #test testParsingDefaultServerConfig()
***
[main] 20:46:35,291 ERROR [org.apache.activemq.artemis.core.server] cvc-complex-type.2.4.a:
Invalid content was found starting with element 'name'. One of '{WC[##other:"urn:activemq"]}'
is expected.
[main] 20:46:35,293 WARN  [org.apache.activemq.artemis.core.server] AMQ222177: Wrong configuration
for role, create-durable-queue is not a valid permission
[main] 20:46:35,293 WARN  [org.apache.activemq.artemis.core.server] AMQ222177: Wrong configuration
for role, delete-durable-queue is not a valid permission
[main] 20:46:35,295 INFO  [org.apache.activemq.artemis.core.server] **** end #test testParsingDefaultServerConfig()
***
Tests run: 1, Failures: 0, Errors: 0, Skipped: 0, Time elapsed: 0.021 sec - in org.apache.activemq.artemis.core.config.impl.WrongRoleFileConfigurationParserTest
Running org.apache.activemq.artemis.core.filter.impl.FilterTest
[main] 20:46:35,333 ERROR [org.apache.activemq.artemis.core.server] AMQ224006: Invalid filter:
color = 'red
[main] 20:46:35,334 ERROR [org.apache.activemq.artemis.core.server] AMQ224006: Invalid filter:
color = 'red
[main] 20:46:35,335 ERROR [org.apache.activemq.artemis.core.server] AMQ224006: Invalid filter:
3
[main] 20:46:35,335 ERROR [org.apache.activemq.artemis.core.server] AMQ224006: Invalid filter:
3
Tests run: 21, Failures: 0, Errors: 0, Skipped: 0, Time elapsed: 0.052 sec - in org.apache.activemq.artemis.core.filter.impl.FilterTest
Running org.apache.activemq.artemis.core.list.PriorityLinkedListTest
Tests run: 11, Failures: 0, Errors: 0, Skipped: 0, Time elapsed: 0.006 sec - in org.apache.activemq.artemis.core.list.PriorityLinkedListTest
Running org.apache.activemq.artemis.core.message.impl.MessagePropertyTest
[main] 20:46:35,358 INFO  [org.apache.activemq.artemis.core.server] **** start #test testProperties()
***
[main] 20:46:35,439 INFO  [org.apache.activemq.artemis.core.server] AMQ221000: live Message
Broker is starting with configuration Broker Configuration (clustered=false,journalDirectory=<https://builds.apache.org/job/ActiveMQ-Artemis-Master/ws/artemis-server/./target/tmp/junit1634931302572475461/journal0-L,bindingsDirectory=/home/jenkins/jenkins-slave/workspace/ActiveMQ-Artemis-Master/artemis-server/./target/tmp/junit1634931302572475461/bindings0-L,largeMessagesDirectory=/home/jenkins/jenkins-slave/workspace/ActiveMQ-Artemis-Master/artemis-server/./target/tmp/junit1634931302572475461/large-msg0-L,pagingDirectory=/home/jenkins/jenkins-slave/workspace/ActiveMQ-Artemis-Master/artemis-server/./target/tmp/junit1634931302572475461/page0-L)>
[main] 20:46:35,440 INFO  [org.apache.activemq.artemis.core.server] AMQ221012: Using AIO Journal
[main] 20:46:35,441 INFO  [org.apache.activemq.artemis.core.server] AMQ221043: Protocol module
found: [artemis-server]. Adding protocol support for: CORE
[main] 20:46:35,473 INFO  [org.apache.activemq.artemis.core.server] AMQ221034: Waiting indefinitely
to obtain live lock
[main] 20:46:35,473 INFO  [org.apache.activemq.artemis.core.server] AMQ221035: Live Server
Obtained live lock
[main] 20:46:35,548 INFO  [org.apache.activemq.artemis.core.server] AMQ221007: Server is now
live
[main] 20:46:35,549 INFO  [org.apache.activemq.artemis.core.server] AMQ221001: Apache ActiveMQ
Artemis Message Broker version 2.7.0-SNAPSHOT [localhost, nodeID=7552fb21-2b19-11e9-abd0-0242132c567d]

[main] 20:46:36,050 INFO  [org.apache.activemq.artemis.core.server] AMQ221002: Apache ActiveMQ
Artemis Message Broker version 2.7.0-SNAPSHOT [7552fb21-2b19-11e9-abd0-0242132c567d] stopped,
uptime 0.683 seconds
[main] 20:46:36,053 INFO  [org.apache.activemq.artemis.core.server] **** end #test testProperties()
***
Tests run: 1, Failures: 0, Errors: 0, Skipped: 0, Time elapsed: 0.695 sec - in org.apache.activemq.artemis.core.message.impl.MessagePropertyTest
Running org.apache.activemq.artemis.core.persistence.impl.journal.JournalStorageManagerTest
[main] 20:46:36,056 INFO  [org.apache.activemq.artemis.core.server] AMQ221058: resetting Journal
File size from 4,098 to 4,096 to fit with alignment of 4,096
Tests run: 1, Failures: 0, Errors: 0, Skipped: 0, Time elapsed: 0.002 sec - in org.apache.activemq.artemis.core.persistence.impl.journal.JournalStorageManagerTest
Running org.apache.activemq.artemis.core.reload.LoggingConfigurationFileReloaderTest
[main] 20:46:36,060 INFO  [org.apache.activemq.artemis.core.server] AMQ221056: Reloading configuration:
logging
Tests run: 1, Failures: 0, Errors: 0, Skipped: 0, Time elapsed: 0.014 sec - in org.apache.activemq.artemis.core.reload.LoggingConfigurationFileReloaderTest
Running org.apache.activemq.artemis.core.reload.ReloadManagerTest
Tests run: 2, Failures: 0, Errors: 0, Skipped: 0, Time elapsed: 2.018 sec - in org.apache.activemq.artemis.core.reload.ReloadManagerTest
Running org.apache.activemq.artemis.core.security.RoleTest
Tests run: 5, Failures: 0, Errors: 0, Skipped: 0, Time elapsed: 0.002 sec - in org.apache.activemq.artemis.core.security.RoleTest
Running org.apache.activemq.artemis.core.security.jaas.CertificateLoginModuleTest
Tests run: 3, Failures: 0, Errors: 0, Skipped: 0, Time elapsed: 0.006 sec - in org.apache.activemq.artemis.core.security.jaas.CertificateLoginModuleTest
Running org.apache.activemq.artemis.core.security.jaas.GuestLoginModuleTest
Tests run: 2, Failures: 0, Errors: 0, Skipped: 0, Time elapsed: 0.01 sec - in org.apache.activemq.artemis.core.security.jaas.GuestLoginModuleTest
Running org.apache.activemq.artemis.core.security.jaas.JAASSecurityManagerTest
loader: sun.misc.Launcher$AppClassLoader@42a57993
loader: sun.misc.Launcher$AppClassLoader@42a57993
Tests run: 2, Failures: 0, Errors: 0, Skipped: 0, Time elapsed: 0.009 sec - in org.apache.activemq.artemis.core.security.jaas.JAASSecurityManagerTest
Running org.apache.activemq.artemis.core.security.jaas.LDAPLoginModuleMaskPasswordTest
Tests run: 5, Failures: 0, Errors: 0, Skipped: 0, Time elapsed: 14.666 sec - in org.apache.activemq.artemis.core.security.jaas.LDAPLoginModuleMaskPasswordTest
Running org.apache.activemq.artemis.core.security.jaas.LDAPLoginModuleTest
Tests run: 8, Failures: 0, Errors: 0, Skipped: 0, Time elapsed: 13.889 sec - in org.apache.activemq.artemis.core.security.jaas.LDAPLoginModuleTest
Running org.apache.activemq.artemis.core.security.jaas.LDAPModuleRoleExpansionTest
Tests run: 2, Failures: 0, Errors: 0, Skipped: 0, Time elapsed: 11.897 sec - in org.apache.activemq.artemis.core.security.jaas.LDAPModuleRoleExpansionTest
Running org.apache.activemq.artemis.core.security.jaas.PropertiesLoginModuleRaceConditionTest
Tests run: 1, Failures: 0, Errors: 0, Skipped: 0, Time elapsed: 71.247 sec - in org.apache.activemq.artemis.core.security.jaas.PropertiesLoginModuleRaceConditionTest
Running org.apache.activemq.artemis.core.security.jaas.PropertiesLoginModuleTest
Tests run: 5, Failures: 0, Errors: 0, Skipped: 0, Time elapsed: 1.049 sec - in org.apache.activemq.artemis.core.security.jaas.PropertiesLoginModuleTest
Running org.apache.activemq.artemis.core.security.jaas.RolePrincipalTest
Tests run: 3, Failures: 0, Errors: 0, Skipped: 0, Time elapsed: 0 sec - in org.apache.activemq.artemis.core.security.jaas.RolePrincipalTest
Running org.apache.activemq.artemis.core.security.jaas.TextFileCertificateLoginModuleTest
Tests run: 3, Failures: 0, Errors: 0, Skipped: 0, Time elapsed: 0.99 sec - in org.apache.activemq.artemis.core.security.jaas.TextFileCertificateLoginModuleTest
Running org.apache.activemq.artemis.core.security.jaas.UserPrincipalTest
Tests run: 3, Failures: 0, Errors: 0, Skipped: 0, Time elapsed: 0.001 sec - in org.apache.activemq.artemis.core.security.jaas.UserPrincipalTest
Running org.apache.activemq.artemis.core.server.QueueConfigTest
Tests run: 4, Failures: 0, Errors: 0, Skipped: 0, Time elapsed: 0.001 sec - in org.apache.activemq.artemis.core.server.QueueConfigTest
Running org.apache.activemq.artemis.core.server.cluster.impl.BroadcastGroupImplTest
Tests run: 1, Failures: 0, Errors: 0, Skipped: 0, Time elapsed: 0.009 sec - in org.apache.activemq.artemis.core.server.cluster.impl.BroadcastGroupImplTest
Running org.apache.activemq.artemis.core.server.files.FileMoveManagerTest
Tests run: 9, Failures: 0, Errors: 0, Skipped: 0, Time elapsed: 0.585 sec - in org.apache.activemq.artemis.core.server.files.FileMoveManagerTest
Running org.apache.activemq.artemis.core.server.files.FileStoreMonitorTest
tick:: / (/dev/sda3) usage::0.12642191908968692
under:: / (/dev/sda3) usage::0.12642191908968692
tick:: / (/dev/sda3) usage::1.0
over:: / (/dev/sda3) usage::1.0
TickS::0.12642191804925684
TickS::0.12642191804925684
TickS::0.12642191804925684
TickS::0.12642191804925684
TickS::0.12642191804925684
Tests run: 2, Failures: 0, Errors: 0, Skipped: 0, Time elapsed: 0.212 sec - in org.apache.activemq.artemis.core.server.files.FileStoreMonitorTest
Running org.apache.activemq.artemis.core.server.group.impl.ClusteredResetMockTest
Tests run: 1, Failures: 0, Errors: 0, Skipped: 0, Time elapsed: 0.052 sec - in org.apache.activemq.artemis.core.server.group.impl.ClusteredResetMockTest
Running org.apache.activemq.artemis.core.server.impl.CompositeAddressTest
Tests run: 1, Failures: 0, Errors: 0, Skipped: 0, Time elapsed: 0 sec - in org.apache.activemq.artemis.core.server.impl.CompositeAddressTest
Running org.apache.activemq.artemis.core.server.impl.EmbeddedServerTest
Tests run: 2, Failures: 0, Errors: 0, Skipped: 0, Time elapsed: 0.038 sec - in org.apache.activemq.artemis.core.server.impl.EmbeddedServerTest
Running org.apache.activemq.artemis.core.server.impl.QueueConsumersImplTest
Tests run: 3, Failures: 0, Errors: 0, Skipped: 0, Time elapsed: 0.005 sec - in org.apache.activemq.artemis.core.server.impl.QueueConsumersImplTest
Running org.apache.activemq.artemis.core.server.impl.ScheduledDeliveryHandlerTest
Tests run: 6, Failures: 0, Errors: 0, Skipped: 0, Time elapsed: 2.013 sec - in org.apache.activemq.artemis.core.server.impl.ScheduledDeliveryHandlerTest
Running org.apache.activemq.artemis.core.server.impl.jdbc.JdbcLeaseLockTest
Tests run: 20, Failures: 0, Errors: 0, Skipped: 0, Time elapsed: 201.343 sec - in org.apache.activemq.artemis.core.server.impl.jdbc.JdbcLeaseLockTest
Running org.apache.activemq.artemis.core.server.impl.jdbc.JdbcSharedStateManagerTest
Tests run: 4, Failures: 0, Errors: 0, Skipped: 0, Time elapsed: 38.001 sec - in org.apache.activemq.artemis.core.server.impl.jdbc.JdbcSharedStateManagerTest
Running org.apache.activemq.artemis.core.server.journal.JournalStorageManagerConstantTest
Tests run: 1, Failures: 0, Errors: 0, Skipped: 0, Time elapsed: 0.003 sec - in org.apache.activemq.artemis.core.server.journal.JournalStorageManagerConstantTest
Running org.apache.activemq.artemis.core.server.management.JMXAccessControlListTest
Tests run: 14, Failures: 0, Errors: 0, Skipped: 0, Time elapsed: 0.006 sec - in org.apache.activemq.artemis.core.server.management.JMXAccessControlListTest
Running org.apache.activemq.artemis.core.settings.AddressSettingsTest
Tests run: 4, Failures: 0, Errors: 0, Skipped: 0, Time elapsed: 0.01 sec - in org.apache.activemq.artemis.core.settings.AddressSettingsTest
Running org.apache.activemq.artemis.core.settings.RepositoryTest
Tests run: 11, Failures: 0, Errors: 0, Skipped: 0, Time elapsed: 0.026 sec - in org.apache.activemq.artemis.core.settings.RepositoryTest
Running org.apache.activemq.artemis.core.transaction.impl.TransactionImplTest
rollback...
rollback...
Tests run: 2, Failures: 0, Errors: 0, Skipped: 0, Time elapsed: 0.011 sec - in org.apache.activemq.artemis.core.transaction.impl.TransactionImplTest
Running org.apache.activemq.artemis.core.version.impl.VersionImplTest
Tests run: 3, Failures: 0, Errors: 0, Skipped: 0, Time elapsed: 0.002 sec - in org.apache.activemq.artemis.core.version.impl.VersionImplTest
Running org.apache.activemq.artemis.spi.core.security.jaas.Krb5LoginModuleTest
Tests run: 2, Failures: 0, Errors: 0, Skipped: 0, Time elapsed: 0.002 sec - in org.apache.activemq.artemis.spi.core.security.jaas.Krb5LoginModuleTest
Running org.apache.activemq.artemis.tests.util.SimpleStringTest
Tests run: 20, Failures: 0, Errors: 0, Skipped: 0, Time elapsed: 0.34 sec - in org.apache.activemq.artemis.tests.util.SimpleStringTest
Running org.apache.activemq.artemis.uri.AcceptorParserTest
config:TransportConfiguration(name=test, factory=org-apache-activemq-artemis-core-remoting-impl-netty-NettyAcceptorFactory)
?tcpReceiveBufferSize=1048576&port=8080&host=localhost&protocols=openwire&tcpSendBufferSize=1048576&banana=x
config:TransportConfiguration(name=test, factory=org-apache-activemq-artemis-core-remoting-impl-netty-NettyAcceptorFactory)
?tcpReceiveBufferSize=1048576&port=5672&host=0-0-0-0&tcpSendBufferSize=1048576&virtualTopicConsumerWildcards=Consumer-*->;2
Consumer.*.>;2
Tests run: 2, Failures: 0, Errors: 0, Skipped: 0, Time elapsed: 0 sec - in org.apache.activemq.artemis.uri.AcceptorParserTest
Running org.apache.activemq.artemis.uri.ClusterConnectionConfigurationTest
Tests run: 5, Failures: 0, Errors: 0, Skipped: 0, Time elapsed: 0.006 sec - in org.apache.activemq.artemis.uri.ClusterConnectionConfigurationTest

Results :

Failed tests: 
  FileConfigurationTest.testDefaults:409->Assert.assertEquals:542->Assert.assertEquals:555->Assert.assertEquals:118->Assert.failNotEquals:743->Assert.fail:88
expected:<37> but was:<100>
  FileXIncludeConfigurationTest>FileConfigurationTest.testDefaults:409->Assert.assertEquals:542->Assert.assertEquals:555->Assert.assertEquals:118->Assert.failNotEquals:743->Assert.fail:88
expected:<37> but was:<100>

Tests run: 284, Failures: 2, Errors: 0, Skipped: 0

[INFO] ------------------------------------------------------------------------
[INFO] Reactor Summary:
[INFO] 
[INFO] ActiveMQ Artemis Parent ............................ SUCCESS [  4.306 s]
[INFO] ActiveMQ Artemis Commons ........................... SUCCESS [ 26.520 s]
[INFO] ActiveMQ Artemis Core Client ....................... SUCCESS [ 15.134 s]
[INFO] ActiveMQ Artemis Selector Implementation ........... SUCCESS [  5.161 s]
[INFO] ActiveMQ Artemis JMS Client ........................ SUCCESS [  5.653 s]
[INFO] ActiveMQ Artemis Native POM ........................ SUCCESS [  8.090 s]
[INFO] ActiveMQ Artemis Journal ........................... SUCCESS [  4.924 s]
[INFO] ActiveMQ Artemis JDBC Store ........................ SUCCESS [ 30.325 s]
[INFO] ActiveMQ Artemis Server ............................ FAILURE [06:54 min]
[INFO] ActiveMQ Artemis Protocols ......................... SKIPPED
[INFO] ActiveMQ Artemis AMQP Protocol ..................... SKIPPED
[INFO] ActiveMQ Artemis STOMP Protocol .................... SKIPPED
[INFO] ActiveMQ Artemis OpenWire Protocol ................. SKIPPED
[INFO] ActiveMQ Artemis HQClient Protocol ................. SKIPPED
[INFO] ActiveMQ Artemis HornetQ Protocol .................. SKIPPED
[INFO] ActiveMQ Artemis MQTT Protocol ..................... SKIPPED
[INFO] ActiveMQ Artemis DTO ............................... SKIPPED
[INFO] ActiveMQ Artemis Service Extensions ................ SKIPPED
[INFO] ActiveMQ Artemis JMS Server ........................ SKIPPED
[INFO] ActiveMQ Artemis CDI Integration ................... SKIPPED
[INFO] ActiveMQ Artemis Boot .............................. SKIPPED
[INFO] ActiveMQ Artemis Tools ............................. SKIPPED
[INFO] ActiveMQ Artemis JUnit Rules ....................... SKIPPED
[INFO] ActiveMQ Artemis CLI ............................... SKIPPED
[INFO] ActiveMQ Artemis Web ............................... SKIPPED
[INFO] ActiveMQ Artemis Web ............................... SKIPPED
[INFO] ActiveMQ Artemis Core Client All ................... SKIPPED
[INFO] ActiveMQ Artemis Client OSGi ....................... SKIPPED
[INFO] ActiveMQ Artemis JMS Client All .................... SKIPPED
[INFO] ActiveMQ Artemis JMS Client OSGi ................... SKIPPED
[INFO] ActiveMQ Artemis RAR POM ........................... SKIPPED
[INFO] ActiveMQ Artemis REST Interface Implementation ..... SKIPPED
[INFO] ActiveMQ Artemis Maven Plugin ...................... SKIPPED
[INFO] ActiveMQ Artemis Server OSGi ....................... SKIPPED
[INFO] ActiveMQ Artemis Cons .............................. SKIPPED
[INFO] ActiveMQ Artemis HawtIO Branding ................... SKIPPED
[INFO] ActiveMQ Artemis HawtIO Plugin ..................... SKIPPED
[INFO] ActiveMQ Artemis Console ........................... SKIPPED
[INFO] ActiveMQ Artemis Spring Integration ................ SKIPPED
[INFO] Apache ActiveMQ Artemis Distribution ............... SKIPPED
[INFO] ActiveMQ Artemis Tests POM ......................... SKIPPED
[INFO] ActiveMQ Artemis Test Support ...................... SKIPPED
[INFO] ActiveMQ Artemis Unit Tests ........................ SKIPPED
[INFO] ActiveMQ Artemis Joram Tests ....................... SKIPPED
[INFO] ActiveMQ Artemis timing Tests ...................... SKIPPED
[INFO] ActiveMQ Artemis JMS Tests ......................... SKIPPED
[INFO] ActiveMQ Artemis Features .......................... SKIPPED
[INFO] ActiveMQ Artemis Integration Tests ................. SKIPPED
[INFO] ActiveMQ Artemis Client Integration Tests .......... SKIPPED
[INFO] ActiveMQ Artemis Compatibility Tests ............... SKIPPED
[INFO] ActiveMQ Artemis soak Tests ........................ SKIPPED
[INFO] ActiveMQ Artemis stress Tests ...................... SKIPPED
[INFO] ActiveMQ Artemis performance Tests ................. SKIPPED
[INFO] Smoke Tests ........................................ SKIPPED
[INFO] ActiveMQ Artemis Extra Tests ....................... SKIPPED
[INFO] ------------------------------------------------------------------------
[INFO] BUILD FAILURE
[INFO] ------------------------------------------------------------------------
[INFO] Total time: 08:37 min
[INFO] Finished at: 2019-02-07T20:52:34+00:00
[INFO] Final Memory: 201M/3432M
[INFO] ------------------------------------------------------------------------
[ERROR] Failed to execute goal org.apache.maven.plugins:maven-surefire-plugin:2.18.1:test
(default-test) on project artemis-server: There are test failures.
[ERROR] 
[ERROR] Please refer to <https://builds.apache.org/job/ActiveMQ-Artemis-Master/ws/artemis-server/target/surefire-reports>
for the individual test results.
[ERROR] -> [Help 1]
[ERROR] 
[ERROR] To see the full stack trace of the errors, re-run Maven with the -e switch.
[ERROR] Re-run Maven using the -X switch to enable full debug logging.
[ERROR] 
[ERROR] For more information about the errors and possible solutions, please read the following
articles:
[ERROR] [Help 1] http://cwiki.apache.org/confluence/display/MAVEN/MojoFailureException
[ERROR] 
[ERROR] After correcting the problems, you can resume the build with the command
[ERROR]   mvn <goals> -rf :artemis-server
Build step 'Invoke top-level Maven targets' marked build as failure
Performing Post build task...
Could not match :Too many files with unapproved license  : False
Logical operation result is FALSE
Skipping script  : cat ratReport.txt
END OF POST BUILD TASK 	: 0
Recording test results
Not sending mail to unregistered user sato.tadayoshi@gmail.com
Not sending mail to unregistered user nigro.fra@gmail.com
Not sending mail to unregistered user tabish121@gmail.com
Not sending mail to unregistered user michael.andre.pearce@me.com
Not sending mail to unregistered user howard.gao@gmail.com
Not sending mail to unregistered user emmanuel.hugonnet+gitkraken@gmail.com
Not sending mail to unregistered user mtaylor@redhat.com
Not sending mail to unregistered user sebthom@users.noreply.github.com
Not sending mail to unregistered user wy96fyw@gmail.com

Mime
View raw message