activemq-commits mailing list archives

Site index · List index
Message view « Date » · « Thread »
Top « Date » · « Thread »
From Apache Jenkins Server <jenk...@builds.apache.org>
Subject Build failed in Jenkins: ActiveMQ-Artemis-Master #1895
Date Mon, 09 Jul 2018 21:49:05 GMT
See <https://builds.apache.org/job/ActiveMQ-Artemis-Master/1895/display/redirect>

------------------------------------------
Started by an SCM change
[EnvInject] - Loading node environment variables.
Building remotely on ubuntu-eu2 (ubuntu trusty) in workspace <https://builds.apache.org/job/ActiveMQ-Artemis-Master/ws/>
Cloning the remote Git repository
Cloning repository https://git-wip-us.apache.org/repos/asf/activemq-artemis.git
 > git init <https://builds.apache.org/job/ActiveMQ-Artemis-Master/ws/> # timeout=10
Fetching upstream changes from https://git-wip-us.apache.org/repos/asf/activemq-artemis.git
 > git --version # timeout=10
 > git fetch --tags --progress https://git-wip-us.apache.org/repos/asf/activemq-artemis.git
+refs/heads/*:refs/remotes/origin/*
 > git config remote.origin.url https://git-wip-us.apache.org/repos/asf/activemq-artemis.git
# timeout=10
 > git config --add remote.origin.fetch +refs/heads/*:refs/remotes/origin/* # timeout=10
 > git config remote.origin.url https://git-wip-us.apache.org/repos/asf/activemq-artemis.git
# timeout=10
Cleaning workspace
 > git rev-parse --verify HEAD # timeout=10
No valid HEAD. Skipping the resetting
 > git clean -fdx # timeout=10
Fetching upstream changes from https://git-wip-us.apache.org/repos/asf/activemq-artemis.git
 > git fetch --tags --progress https://git-wip-us.apache.org/repos/asf/activemq-artemis.git
+refs/heads/*:refs/remotes/origin/*
 > git rev-parse origin/master^{commit} # timeout=10
Checking out Revision 8989da1a6a2baeb36c6eb018126cc1e0a5697c40 (origin/master)
 > git config core.sparsecheckout # timeout=10
 > git checkout -f 8989da1a6a2baeb36c6eb018126cc1e0a5697c40
FATAL: Could not checkout 8989da1a6a2baeb36c6eb018126cc1e0a5697c40
hudson.plugins.git.GitException: Command "git checkout -f 8989da1a6a2baeb36c6eb018126cc1e0a5697c40"
returned status code 128:
stdout: 
stderr: error: unable to write file examples/features/standard/jms-bridge/jms-bridge.png
error: unable to write file examples/features/standard/jms-bridge/pom.xml
error: unable to write file examples/features/standard/jms-bridge/readme.md
fatal: cannot create directory at 'examples/features/standard/jms-bridge/src': No space left
on device

	at org.jenkinsci.plugins.gitclient.CliGitAPIImpl.launchCommandIn(CliGitAPIImpl.java:2002)
	at org.jenkinsci.plugins.gitclient.CliGitAPIImpl.access$800(CliGitAPIImpl.java:72)
	at org.jenkinsci.plugins.gitclient.CliGitAPIImpl$9.execute(CliGitAPIImpl.java:2301)
Also:   hudson.remoting.Channel$CallSiteStackTrace: Remote call to ubuntu-eu2
		at hudson.remoting.Channel.attachCallSiteStackTrace(Channel.java:1741)
		at hudson.remoting.UserRequest$ExceptionResponse.retrieve(UserRequest.java:357)
		at hudson.remoting.Channel.call(Channel.java:955)
		at org.jenkinsci.plugins.gitclient.RemoteGitImpl$CommandInvocationHandler.execute(RemoteGitImpl.java:146)
		at sun.reflect.GeneratedMethodAccessor1289.invoke(Unknown Source)
		at sun.reflect.DelegatingMethodAccessorImpl.invoke(DelegatingMethodAccessorImpl.java:43)
		at java.lang.reflect.Method.invoke(Method.java:498)
		at org.jenkinsci.plugins.gitclient.RemoteGitImpl$CommandInvocationHandler.invoke(RemoteGitImpl.java:132)
		at com.sun.proxy.$Proxy150.execute(Unknown Source)
		at hudson.plugins.git.GitSCM.checkout(GitSCM.java:1236)
		at hudson.scm.SCM.checkout(SCM.java:504)
		at hudson.model.AbstractProject.checkout(AbstractProject.java:1208)
		at hudson.model.AbstractBuild$AbstractBuildExecution.defaultCheckout(AbstractBuild.java:574)
		at jenkins.scm.SCMCheckoutStrategy.checkout(SCMCheckoutStrategy.java:86)
		at hudson.model.AbstractBuild$AbstractBuildExecution.run(AbstractBuild.java:499)
		at hudson.model.Run.execute(Run.java:1794)
		at hudson.model.FreeStyleBuild.run(FreeStyleBuild.java:43)
		at hudson.model.ResourceController.execute(ResourceController.java:97)
		at hudson.model.Executor.run(Executor.java:429)
Caused: hudson.plugins.git.GitException: Could not checkout 8989da1a6a2baeb36c6eb018126cc1e0a5697c40
	at org.jenkinsci.plugins.gitclient.CliGitAPIImpl$9.execute(CliGitAPIImpl.java:2325)
	at org.jenkinsci.plugins.gitclient.RemoteGitImpl$CommandInvocationHandler$1.call(RemoteGitImpl.java:153)
	at org.jenkinsci.plugins.gitclient.RemoteGitImpl$CommandInvocationHandler$1.call(RemoteGitImpl.java:146)
	at hudson.remoting.UserRequest.perform(UserRequest.java:212)
	at hudson.remoting.UserRequest.perform(UserRequest.java:54)
	at hudson.remoting.Request$2.run(Request.java:369)
	at hudson.remoting.InterceptingExecutorService$1.call(InterceptingExecutorService.java:72)
	at java.util.concurrent.FutureTask.run(FutureTask.java:266)
	at java.util.concurrent.ThreadPoolExecutor.runWorker(ThreadPoolExecutor.java:1142)
	at java.util.concurrent.ThreadPoolExecutor$Worker.run(ThreadPoolExecutor.java:617)
	at java.lang.Thread.run(Thread.java:748)
Performing Post build task...
Could not match :Too many files with unapproved license  : False
Logical operation result is FALSE
Skipping script  : cat ratReport.txt
END OF POST BUILD TASK 	: 0
Recording test results
ERROR: Step ‘Publish JUnit test result report’ failed: No test report files were found.
Configuration error?
Not sending mail to unregistered user shailendra14k@gmail.com
Not sending mail to unregistered user vkamble@redhat.com
Not sending mail to unregistered user wy96fyw@gmail.com
Not sending mail to unregistered user tabish121@gmail.com

Mime
View raw message