activemq-commits mailing list archives

Site index · List index
Message view « Date » · « Thread »
Top « Date » · « Thread »
From Apache Jenkins Server <jenk...@builds.apache.org>
Subject Build failed in Jenkins: ActiveMQ-Java8-All-UnitTests #810
Date Thu, 10 May 2018 08:08:08 GMT
See <https://builds.apache.org/job/ActiveMQ-Java8-All-UnitTests/810/display/redirect?page=changes>

Changes:

[gtully] AMQ-6707 - fix trace log reporting in error

------------------------------------------
[...truncated 231.58 KB...]
[INFO] 
[INFO] --- maven-compiler-plugin:3.3:compile (default-compile) @ activemq-console ---
[INFO] Changes detected - recompiling the module!
[INFO] Compiling 59 source files to <https://builds.apache.org/job/ActiveMQ-Java8-All-UnitTests/ws/activemq-console/target/classes>
[INFO] <https://builds.apache.org/job/ActiveMQ-Java8-All-UnitTests/ws/activemq-console/src/main/java/org/apache/activemq/console/filter/MBeansObjectNameQueryFilter.java>:
Some input files use unchecked or unsafe operations.
[INFO] <https://builds.apache.org/job/ActiveMQ-Java8-All-UnitTests/ws/activemq-console/src/main/java/org/apache/activemq/console/filter/MBeansObjectNameQueryFilter.java>:
Recompile with -Xlint:unchecked for details.
[INFO] 
[INFO] --- maven-resources-plugin:2.7:testResources (default-testResources) @ activemq-console
---
[INFO] Using 'UTF-8' encoding to copy filtered resources.
[INFO] Copying 1 resource
[INFO] Copying 3 resources
[INFO] 
[INFO] --- maven-compiler-plugin:3.3:testCompile (default-testCompile) @ activemq-console
---
[INFO] Changes detected - recompiling the module!
[INFO] Compiling 7 source files to <https://builds.apache.org/job/ActiveMQ-Java8-All-UnitTests/ws/activemq-console/target/test-classes>
[INFO] 
[INFO] --- maven-surefire-plugin:2.16:test (default-test) @ activemq-console ---
[INFO] Surefire report directory: <https://builds.apache.org/job/ActiveMQ-Java8-All-UnitTests/ws/activemq-console/target/surefire-reports>

-------------------------------------------------------
 T E S T S
-------------------------------------------------------

-------------------------------------------------------
 T E S T S
-------------------------------------------------------
Running org.apache.activemq.console.QueryCommandTest
Tests run: 3, Failures: 0, Errors: 0, Skipped: 0, Time elapsed: 2.062 sec - in org.apache.activemq.console.QueryCommandTest
Running org.apache.activemq.console.filter.TestMapTransformFilter
Tests run: 2, Failures: 0, Errors: 0, Skipped: 0, Time elapsed: 0.216 sec - in org.apache.activemq.console.filter.TestMapTransformFilter
Running org.apache.activemq.console.command.PurgeCommandTest
Tests run: 9, Failures: 0, Errors: 0, Skipped: 0, Time elapsed: 0.231 sec - in org.apache.activemq.console.command.PurgeCommandTest
Running org.apache.activemq.console.PurgeCommandTest
Tests run: 2, Failures: 0, Errors: 0, Skipped: 0, Time elapsed: 3.581 sec - in org.apache.activemq.console.PurgeCommandTest
Running org.apache.activemq.console.DstatCommandTest
Tests run: 1, Failures: 0, Errors: 0, Skipped: 0, Time elapsed: 1.268 sec - in org.apache.activemq.console.DstatCommandTest

Results :

Tests run: 17, Failures: 0, Errors: 0, Skipped: 0

[JENKINS] Recording test results
[INFO] 
[INFO] --- maven-jar-plugin:2.4:jar (default-jar) @ activemq-console ---
[INFO] Building jar: <https://builds.apache.org/job/ActiveMQ-Java8-All-UnitTests/ws/activemq-console/target/activemq-console-5.16.0-SNAPSHOT.jar>
[INFO] 
[INFO] --- maven-site-plugin:3.5.1:attach-descriptor (attach-descriptor) @ activemq-console
---
[INFO] 
[INFO] --- ianal-maven-plugin:1.0-alpha-1:verify-legal-files (default) @ activemq-console
---
[INFO] Checking legal files in: activemq-console-5.16.0-SNAPSHOT.jar
[INFO] 
[INFO] --- maven-install-plugin:2.5.2:install (default-install) @ activemq-console ---
[INFO] Installing <https://builds.apache.org/job/ActiveMQ-Java8-All-UnitTests/ws/activemq-console/target/activemq-console-5.16.0-SNAPSHOT.jar>
to /home/jenkins/jenkins-slave/maven-repositories/1/org/apache/activemq/activemq-console/5.16.0-SNAPSHOT/activemq-console-5.16.0-SNAPSHOT.jar
[INFO] Installing <https://builds.apache.org/job/ActiveMQ-Java8-All-UnitTests/ws/activemq-console/pom.xml>
to /home/jenkins/jenkins-slave/maven-repositories/1/org/apache/activemq/activemq-console/5.16.0-SNAPSHOT/activemq-console-5.16.0-SNAPSHOT.pom
[INFO]                                                                         
[INFO] ------------------------------------------------------------------------
[INFO] Skipping ActiveMQ :: Partition Management
[INFO] This project has been banned from the build due to previous failures.
[INFO] ------------------------------------------------------------------------
[INFO]                                                                         
[INFO] ------------------------------------------------------------------------
[INFO] Skipping ActiveMQ :: Runtime Configuration
[INFO] This project has been banned from the build due to previous failures.
[INFO] ------------------------------------------------------------------------
[INFO]                                                                         
[INFO] ------------------------------------------------------------------------
[INFO] Building ActiveMQ :: Tooling 5.16.0-SNAPSHOT
[INFO] ------------------------------------------------------------------------
[INFO] 
[INFO] --- maven-clean-plugin:3.0.0:clean (default-clean) @ activemq-tooling ---
[INFO] Deleting <https://builds.apache.org/job/ActiveMQ-Java8-All-UnitTests/ws/activemq-tooling/target>
[INFO] 
[INFO] --- maven-bundle-plugin:2.3.7:cleanVersions (cleanVersions) @ activemq-tooling ---
[INFO] 
[INFO] --- maven-remote-resources-plugin:1.5:process (process-resource-bundles) @ activemq-tooling
---
[INFO] 
[INFO] --- maven-site-plugin:3.5.1:attach-descriptor (attach-descriptor) @ activemq-tooling
---
[INFO] 
[INFO] --- ianal-maven-plugin:1.0-alpha-1:verify-legal-files (default) @ activemq-tooling
---
[INFO] 
[INFO] --- maven-install-plugin:2.5.2:install (default-install) @ activemq-tooling ---
[INFO] Installing <https://builds.apache.org/job/ActiveMQ-Java8-All-UnitTests/ws/activemq-tooling/pom.xml>
to /home/jenkins/jenkins-slave/maven-repositories/1/org/apache/activemq/tooling/activemq-tooling/5.16.0-SNAPSHOT/activemq-tooling-5.16.0-SNAPSHOT.pom
[INFO]                                                                         
[INFO] ------------------------------------------------------------------------
[INFO] Skipping ActiveMQ :: JUnit Rule
[INFO] This project has been banned from the build due to previous failures.
[INFO] ------------------------------------------------------------------------
[INFO]                                                                         
[INFO] ------------------------------------------------------------------------
[INFO] Skipping ActiveMQ :: Unit Tests
[INFO] This project has been banned from the build due to previous failures.
[INFO] ------------------------------------------------------------------------
[INFO] ------------------------------------------------------------------------
[INFO] Reactor Summary:
[INFO] 
[INFO] ActiveMQ ........................................... SUCCESS [  6.263 s]
[INFO] ActiveMQ :: Client ................................. SUCCESS [03:19 min]
[INFO] ActiveMQ :: Openwire Legacy Support ................ SUCCESS [  6.603 s]
[INFO] ActiveMQ :: JAAS ................................... SUCCESS [ 39.111 s]
[INFO] ActiveMQ :: Broker ................................. SUCCESS [01:13 min]
[INFO] ActiveMQ :: KahaDB Store ........................... SUCCESS [08:50 min]
[INFO] ActiveMQ :: STOMP Protocol ......................... SUCCESS [21:17 min]
[INFO] ActiveMQ :: MQTT Protocol .......................... SUCCESS [24:40 min]
[INFO] ActiveMQ :: JDBC Store ............................. SUCCESS [  5.448 s]
[INFO] ActiveMQ :: LevelDB Store .......................... FAILURE [34:31 min]
[INFO] ActiveMQ :: Generic JMS Pool ....................... SUCCESS [ 54.368 s]
[INFO] ActiveMQ :: Pool ................................... SUCCESS [  7.536 s]
[INFO] ActiveMQ :: RA ..................................... SUCCESS [02:07 min]
[INFO] ActiveMQ :: Spring ................................. SKIPPED
[INFO] ActiveMQ :: Console ................................ SUCCESS [ 16.541 s]
[INFO] ActiveMQ :: Partition Management ................... SKIPPED
[INFO] ActiveMQ :: Runtime Configuration .................. SKIPPED
[INFO] ActiveMQ :: Tooling ................................ SUCCESS [  1.528 s]
[INFO] ActiveMQ :: JUnit Rule ............................. SKIPPED
[INFO] ActiveMQ :: Unit Tests ............................. SKIPPED
[INFO] ------------------------------------------------------------------------
[INFO] BUILD FAILURE
[INFO] ------------------------------------------------------------------------
[INFO] Total time: 01:40 h
[INFO] Finished at: 2018-05-10T08:07:33+00:00
[INFO] Final Memory: 95M/1604M
[INFO] ------------------------------------------------------------------------
Waiting for Jenkins to finish collecting data
[ERROR] Failed to execute goal org.apache.maven.plugins:maven-surefire-plugin:2.16:test (default-test)
on project activemq-leveldb-store: Execution default-test of goal org.apache.maven.plugins:maven-surefire-plugin:2.16:test
failed: org.apache.maven.surefire.util.NestedRuntimeException: null; nested exception is java.io.IOException:
No space left on device -> [Help 1]
org.apache.maven.lifecycle.LifecycleExecutionException: Failed to execute goal org.apache.maven.plugins:maven-surefire-plugin:2.16:test
(default-test) on project activemq-leveldb-store: Execution default-test of goal org.apache.maven.plugins:maven-surefire-plugin:2.16:test
failed: org.apache.maven.surefire.util.NestedRuntimeException: null; nested exception is java.io.IOException:
No space left on device
	at org.apache.maven.lifecycle.internal.MojoExecutor.execute(MojoExecutor.java:212)
	at org.apache.maven.lifecycle.internal.MojoExecutor.execute(MojoExecutor.java:153)
	at org.apache.maven.lifecycle.internal.MojoExecutor.execute(MojoExecutor.java:145)
	at org.apache.maven.lifecycle.internal.LifecycleModuleBuilder.buildProject(LifecycleModuleBuilder.java:116)
	at org.apache.maven.lifecycle.internal.LifecycleModuleBuilder.buildProject(LifecycleModuleBuilder.java:80)
	at org.apache.maven.lifecycle.internal.builder.singlethreaded.SingleThreadedBuilder.build(SingleThreadedBuilder.java:51)
	at org.apache.maven.lifecycle.internal.LifecycleStarter.execute(LifecycleStarter.java:128)
	at org.apache.maven.DefaultMaven.doExecute(DefaultMaven.java:307)
	at org.apache.maven.DefaultMaven.doExecute(DefaultMaven.java:193)
	at org.apache.maven.DefaultMaven.execute(DefaultMaven.java:106)
	at org.jvnet.hudson.maven3.launcher.Maven33Launcher.main(Maven33Launcher.java:129)
	at sun.reflect.NativeMethodAccessorImpl.invoke0(Native Method)
	at sun.reflect.NativeMethodAccessorImpl.invoke(NativeMethodAccessorImpl.java:62)
	at sun.reflect.DelegatingMethodAccessorImpl.invoke(DelegatingMethodAccessorImpl.java:43)
	at java.lang.reflect.Method.invoke(Method.java:498)
	at org.codehaus.plexus.classworlds.launcher.Launcher.launchStandard(Launcher.java:330)
	at org.codehaus.plexus.classworlds.launcher.Launcher.launch(Launcher.java:238)
	at jenkins.maven3.agent.Maven33Main.launch(Maven33Main.java:176)
	at sun.reflect.NativeMethodAccessorImpl.invoke0(Native Method)
	at sun.reflect.NativeMethodAccessorImpl.invoke(NativeMethodAccessorImpl.java:62)
	at sun.reflect.DelegatingMethodAccessorImpl.invoke(DelegatingMethodAccessorImpl.java:43)
	at java.lang.reflect.Method.invoke(Method.java:498)
	at hudson.maven.Maven3Builder.call(Maven3Builder.java:139)
	at hudson.maven.Maven3Builder.call(Maven3Builder.java:70)
	at hudson.remoting.UserRequest.perform(UserRequest.java:207)
	at hudson.remoting.UserRequest.perform(UserRequest.java:53)
	at hudson.remoting.Request$2.run(Request.java:358)
	at hudson.remoting.InterceptingExecutorService$1.call(InterceptingExecutorService.java:72)
	at java.util.concurrent.FutureTask.run(FutureTask.java:266)
	at java.util.concurrent.ThreadPoolExecutor.runWorker(ThreadPoolExecutor.java:1149)
	at java.util.concurrent.ThreadPoolExecutor$Worker.run(ThreadPoolExecutor.java:624)
	at java.lang.Thread.run(Thread.java:748)
Caused by: org.apache.maven.plugin.PluginExecutionException: Execution default-test of goal
org.apache.maven.plugins:maven-surefire-plugin:2.16:test failed: org.apache.maven.surefire.util.NestedRuntimeException:
null; nested exception is java.io.IOException: No space left on device
	at org.apache.maven.plugin.DefaultBuildPluginManager.executeMojo(DefaultBuildPluginManager.java:145)
	at org.apache.maven.lifecycle.internal.MojoExecutor.execute(MojoExecutor.java:207)
	... 31 more
Caused by: java.lang.RuntimeException: org.apache.maven.surefire.util.NestedRuntimeException:
null; nested exception is java.io.IOException: No space left on device
	at org.apache.maven.plugin.surefire.booterclient.output.ThreadedStreamConsumer.close(ThreadedStreamConsumer.java:123)
	at org.apache.maven.plugin.surefire.booterclient.ForkStarter.fork(ForkStarter.java:463)
	at org.apache.maven.plugin.surefire.booterclient.ForkStarter.fork(ForkStarter.java:352)
	at org.apache.maven.plugin.surefire.booterclient.ForkStarter.run(ForkStarter.java:158)
	at org.apache.maven.plugin.surefire.AbstractSurefireMojo.executeProvider(AbstractSurefireMojo.java:958)
	at org.apache.maven.plugin.surefire.AbstractSurefireMojo.executeAfterPreconditionsChecked(AbstractSurefireMojo.java:822)
	at org.apache.maven.plugin.surefire.AbstractSurefireMojo.execute(AbstractSurefireMojo.java:720)
	at org.apache.maven.plugin.DefaultBuildPluginManager.executeMojo(DefaultBuildPluginManager.java:134)
	... 32 more
Caused by: org.apache.maven.surefire.util.NestedRuntimeException: null; nested exception is
java.io.IOException: No space left on device
	at org.apache.maven.plugin.surefire.report.ConsoleOutputFileReporter.writeTestOutput(ConsoleOutputFileReporter.java:102)
	at org.apache.maven.plugin.surefire.report.TestSetRunListener.writeTestOutput(TestSetRunListener.java:110)
	at org.apache.maven.plugin.surefire.booterclient.output.ForkClient.consumeLine(ForkClient.java:140)
	at org.apache.maven.plugin.surefire.booterclient.output.ThreadedStreamConsumer$Pumper.run(ThreadedStreamConsumer.java:67)
	... 1 more
Caused by: java.io.IOException: No space left on device
	at java.io.FileOutputStream.writeBytes(Native Method)
	at java.io.FileOutputStream.write(FileOutputStream.java:326)
	at org.apache.maven.plugin.surefire.report.ConsoleOutputFileReporter.writeTestOutput(ConsoleOutputFileReporter.java:98)
	... 4 more
[ERROR] 
[ERROR] Re-run Maven using the -X switch to enable full debug logging.
[ERROR] 
[ERROR] For more information about the errors and possible solutions, please read the following
articles:
[ERROR] [Help 1] http://cwiki.apache.org/confluence/display/MAVEN/PluginExecutionException
[ERROR] 
[ERROR] After correcting the problems, you can resume the build with the command
[ERROR]   mvn <goals> -rf :activemq-leveldb-store
[JENKINS] Archiving <https://builds.apache.org/job/ActiveMQ-Java8-All-UnitTests/ws/activemq-kahadb-store/pom.xml>
to org.apache.activemq/activemq-kahadb-store/5.16.0-SNAPSHOT/activemq-kahadb-store-5.16.0-SNAPSHOT.pom
[JENKINS] Archiving <https://builds.apache.org/job/ActiveMQ-Java8-All-UnitTests/ws/activemq-kahadb-store/target/activemq-kahadb-store-5.16.0-SNAPSHOT.jar>
to org.apache.activemq/activemq-kahadb-store/5.16.0-SNAPSHOT/activemq-kahadb-store-5.16.0-SNAPSHOT.jar
[Fast Archiver] No artifacts from ActiveMQ-Java8-All-UnitTests » ActiveMQ :: KahaDB Store
#809 to compare, so performing full copy of artifacts
[JENKINS] Archiving <https://builds.apache.org/job/ActiveMQ-Java8-All-UnitTests/ws/activemq-unit-tests/pom.xml>
to org.apache.activemq/activemq-unit-tests/5.16.0-SNAPSHOT/activemq-unit-tests-5.16.0-SNAPSHOT.pom
[Fast Archiver] Compressed 72.14 KB of artifacts by 88.7% relative to #808
[JENKINS] Archiving <https://builds.apache.org/job/ActiveMQ-Java8-All-UnitTests/ws/activemq-openwire-legacy/pom.xml>
to org.apache.activemq/activemq-openwire-legacy/5.16.0-SNAPSHOT/activemq-openwire-legacy-5.16.0-SNAPSHOT.pom
[JENKINS] Archiving <https://builds.apache.org/job/ActiveMQ-Java8-All-UnitTests/ws/activemq-openwire-legacy/target/activemq-openwire-legacy-5.16.0-SNAPSHOT.jar>
to org.apache.activemq/activemq-openwire-legacy/5.16.0-SNAPSHOT/activemq-openwire-legacy-5.16.0-SNAPSHOT.jar
[Fast Archiver] No artifacts from ActiveMQ-Java8-All-UnitTests » ActiveMQ :: Openwire Legacy
Support #809 to compare, so performing full copy of artifacts
[JENKINS] Archiving <https://builds.apache.org/job/ActiveMQ-Java8-All-UnitTests/ws/activemq-client/pom.xml>
to org.apache.activemq/activemq-client/5.16.0-SNAPSHOT/activemq-client-5.16.0-SNAPSHOT.pom
[JENKINS] Archiving <https://builds.apache.org/job/ActiveMQ-Java8-All-UnitTests/ws/activemq-client/target/activemq-client-5.16.0-SNAPSHOT.jar>
to org.apache.activemq/activemq-client/5.16.0-SNAPSHOT/activemq-client-5.16.0-SNAPSHOT.jar
[Fast Archiver] No artifacts from ActiveMQ-Java8-All-UnitTests » ActiveMQ :: Client #809
to compare, so performing full copy of artifacts
[JENKINS] Archiving <https://builds.apache.org/job/ActiveMQ-Java8-All-UnitTests/ws/activemq-tooling/activemq-junit/pom.xml>
to org.apache.activemq.tooling/activemq-junit/5.16.0-SNAPSHOT/activemq-junit-5.16.0-SNAPSHOT.pom
[Fast Archiver] No artifacts from ActiveMQ-Java8-All-UnitTests » ActiveMQ :: JUnit Rule #809
to compare, so performing full copy of artifacts
[JENKINS] Archiving <https://builds.apache.org/job/ActiveMQ-Java8-All-UnitTests/ws/activemq-tooling/pom.xml>
to org.apache.activemq.tooling/activemq-tooling/5.16.0-SNAPSHOT/activemq-tooling-5.16.0-SNAPSHOT.pom
[Fast Archiver] No artifacts from ActiveMQ-Java8-All-UnitTests » ActiveMQ :: Tooling #809
to compare, so performing full copy of artifacts
[JENKINS] Archiving <https://builds.apache.org/job/ActiveMQ-Java8-All-UnitTests/ws/activemq-jms-pool/pom.xml>
to org.apache.activemq/activemq-jms-pool/5.16.0-SNAPSHOT/activemq-jms-pool-5.16.0-SNAPSHOT.pom
[JENKINS] Archiving <https://builds.apache.org/job/ActiveMQ-Java8-All-UnitTests/ws/activemq-jms-pool/target/activemq-jms-pool-5.16.0-SNAPSHOT.jar>
to org.apache.activemq/activemq-jms-pool/5.16.0-SNAPSHOT/activemq-jms-pool-5.16.0-SNAPSHOT.jar
[Fast Archiver] No artifacts from ActiveMQ-Java8-All-UnitTests » ActiveMQ :: Generic JMS
Pool #809 to compare, so performing full copy of artifacts
[JENKINS] Archiving <https://builds.apache.org/job/ActiveMQ-Java8-All-UnitTests/ws/activemq-pool/pom.xml>
to org.apache.activemq/activemq-pool/5.16.0-SNAPSHOT/activemq-pool-5.16.0-SNAPSHOT.pom
[JENKINS] Archiving <https://builds.apache.org/job/ActiveMQ-Java8-All-UnitTests/ws/activemq-pool/target/activemq-pool-5.16.0-SNAPSHOT.jar>
to org.apache.activemq/activemq-pool/5.16.0-SNAPSHOT/activemq-pool-5.16.0-SNAPSHOT.jar
[Fast Archiver] No artifacts from ActiveMQ-Java8-All-UnitTests » ActiveMQ :: Pool #809 to
compare, so performing full copy of artifacts
[JENKINS] Archiving <https://builds.apache.org/job/ActiveMQ-Java8-All-UnitTests/ws/activemq-jdbc-store/pom.xml>
to org.apache.activemq/activemq-jdbc-store/5.16.0-SNAPSHOT/activemq-jdbc-store-5.16.0-SNAPSHOT.pom
[JENKINS] Archiving <https://builds.apache.org/job/ActiveMQ-Java8-All-UnitTests/ws/activemq-jdbc-store/target/activemq-jdbc-store-5.16.0-SNAPSHOT.jar>
to org.apache.activemq/activemq-jdbc-store/5.16.0-SNAPSHOT/activemq-jdbc-store-5.16.0-SNAPSHOT.jar
[Fast Archiver] No artifacts from ActiveMQ-Java8-All-UnitTests » ActiveMQ :: JDBC Store #809
to compare, so performing full copy of artifacts
[JENKINS] Archiving <https://builds.apache.org/job/ActiveMQ-Java8-All-UnitTests/ws/activemq-runtime-config/pom.xml>
to org.apache.activemq/activemq-runtime-config/5.16.0-SNAPSHOT/activemq-runtime-config-5.16.0-SNAPSHOT.pom
[Fast Archiver] No artifacts from ActiveMQ-Java8-All-UnitTests » ActiveMQ :: Runtime Configuration
#809 to compare, so performing full copy of artifacts
[JENKINS] Archiving <https://builds.apache.org/job/ActiveMQ-Java8-All-UnitTests/ws/pom.xml>
to org.apache.activemq/activemq-parent/5.16.0-SNAPSHOT/activemq-parent-5.16.0-SNAPSHOT.pom
[Fast Archiver] No artifacts from ActiveMQ-Java8-All-UnitTests » ActiveMQ #809 to compare,
so performing full copy of artifacts
[JENKINS] Archiving <https://builds.apache.org/job/ActiveMQ-Java8-All-UnitTests/ws/activemq-stomp/pom.xml>
to org.apache.activemq/activemq-stomp/5.16.0-SNAPSHOT/activemq-stomp-5.16.0-SNAPSHOT.pom
[JENKINS] Archiving <https://builds.apache.org/job/ActiveMQ-Java8-All-UnitTests/ws/activemq-stomp/target/activemq-stomp-5.16.0-SNAPSHOT.jar>
to org.apache.activemq/activemq-stomp/5.16.0-SNAPSHOT/activemq-stomp-5.16.0-SNAPSHOT.jar
[Fast Archiver] No artifacts from ActiveMQ-Java8-All-UnitTests » ActiveMQ :: STOMP Protocol
#809 to compare, so performing full copy of artifacts
[JENKINS] Archiving <https://builds.apache.org/job/ActiveMQ-Java8-All-UnitTests/ws/activemq-broker/pom.xml>
to org.apache.activemq/activemq-broker/5.16.0-SNAPSHOT/activemq-broker-5.16.0-SNAPSHOT.pom
[JENKINS] Archiving <https://builds.apache.org/job/ActiveMQ-Java8-All-UnitTests/ws/activemq-broker/target/activemq-broker-5.16.0-SNAPSHOT.jar>
to org.apache.activemq/activemq-broker/5.16.0-SNAPSHOT/activemq-broker-5.16.0-SNAPSHOT.jar
[JENKINS] Archiving <https://builds.apache.org/job/ActiveMQ-Java8-All-UnitTests/ws/activemq-broker/target/activemq-broker-5.16.0-SNAPSHOT-tests.jar>
to org.apache.activemq/activemq-broker/5.16.0-SNAPSHOT/activemq-broker-5.16.0-SNAPSHOT-tests.jar
[Fast Archiver] No artifacts from ActiveMQ-Java8-All-UnitTests » ActiveMQ :: Broker #809
to compare, so performing full copy of artifacts
[JENKINS] Archiving <https://builds.apache.org/job/ActiveMQ-Java8-All-UnitTests/ws/activemq-mqtt/pom.xml>
to org.apache.activemq/activemq-mqtt/5.16.0-SNAPSHOT/activemq-mqtt-5.16.0-SNAPSHOT.pom
[JENKINS] Archiving <https://builds.apache.org/job/ActiveMQ-Java8-All-UnitTests/ws/activemq-mqtt/target/activemq-mqtt-5.16.0-SNAPSHOT.jar>
to org.apache.activemq/activemq-mqtt/5.16.0-SNAPSHOT/activemq-mqtt-5.16.0-SNAPSHOT.jar
[Fast Archiver] No artifacts from ActiveMQ-Java8-All-UnitTests » ActiveMQ :: MQTT Protocol
#809 to compare, so performing full copy of artifacts
[JENKINS] Archiving <https://builds.apache.org/job/ActiveMQ-Java8-All-UnitTests/ws/activemq-jaas/pom.xml>
to org.apache.activemq/activemq-jaas/5.16.0-SNAPSHOT/activemq-jaas-5.16.0-SNAPSHOT.pom
[JENKINS] Archiving <https://builds.apache.org/job/ActiveMQ-Java8-All-UnitTests/ws/activemq-jaas/target/activemq-jaas-5.16.0-SNAPSHOT.jar>
to org.apache.activemq/activemq-jaas/5.16.0-SNAPSHOT/activemq-jaas-5.16.0-SNAPSHOT.jar
[Fast Archiver] No artifacts from ActiveMQ-Java8-All-UnitTests » ActiveMQ :: JAAS #809 to
compare, so performing full copy of artifacts
[JENKINS] Archiving <https://builds.apache.org/job/ActiveMQ-Java8-All-UnitTests/ws/activemq-ra/pom.xml>
to org.apache.activemq/activemq-ra/5.16.0-SNAPSHOT/activemq-ra-5.16.0-SNAPSHOT.pom
[JENKINS] Archiving <https://builds.apache.org/job/ActiveMQ-Java8-All-UnitTests/ws/activemq-ra/target/activemq-ra-5.16.0-SNAPSHOT.jar>
to org.apache.activemq/activemq-ra/5.16.0-SNAPSHOT/activemq-ra-5.16.0-SNAPSHOT.jar
[JENKINS] Archiving <https://builds.apache.org/job/ActiveMQ-Java8-All-UnitTests/ws/activemq-ra/target/xbean/activemq-ra.xsd>
to org.apache.activemq/activemq-ra/5.16.0-SNAPSHOT/activemq-ra-5.16.0-SNAPSHOT.xsd
[JENKINS] Archiving <https://builds.apache.org/job/ActiveMQ-Java8-All-UnitTests/ws/activemq-ra/target/xbean/activemq-ra.xsd.html>
to org.apache.activemq/activemq-ra/5.16.0-SNAPSHOT/activemq-ra-5.16.0-SNAPSHOT-schema.html
[JENKINS] Archiving <https://builds.apache.org/job/ActiveMQ-Java8-All-UnitTests/ws/activemq-ra/target/xbean/activemq-ra.xsd.html>
to org.apache.activemq/activemq-ra/5.16.0-SNAPSHOT/activemq-ra-5.16.0-SNAPSHOT.xsd.html
[Fast Archiver] No artifacts from ActiveMQ-Java8-All-UnitTests » ActiveMQ :: RA #809 to compare,
so performing full copy of artifacts
[JENKINS] Archiving <https://builds.apache.org/job/ActiveMQ-Java8-All-UnitTests/ws/activemq-partition/pom.xml>
to org.apache.activemq/activemq-partition/5.16.0-SNAPSHOT/activemq-partition-5.16.0-SNAPSHOT.pom
[Fast Archiver] No artifacts from ActiveMQ-Java8-All-UnitTests » ActiveMQ :: Partition Management
#809 to compare, so performing full copy of artifacts
[JENKINS] Archiving <https://builds.apache.org/job/ActiveMQ-Java8-All-UnitTests/ws/activemq-console/pom.xml>
to org.apache.activemq/activemq-console/5.16.0-SNAPSHOT/activemq-console-5.16.0-SNAPSHOT.pom
[JENKINS] Archiving <https://builds.apache.org/job/ActiveMQ-Java8-All-UnitTests/ws/activemq-console/target/activemq-console-5.16.0-SNAPSHOT.jar>
to org.apache.activemq/activemq-console/5.16.0-SNAPSHOT/activemq-console-5.16.0-SNAPSHOT.jar
[Fast Archiver] No artifacts from ActiveMQ-Java8-All-UnitTests » ActiveMQ :: Console #809
to compare, so performing full copy of artifacts
[JENKINS] Archiving <https://builds.apache.org/job/ActiveMQ-Java8-All-UnitTests/ws/activemq-spring/pom.xml>
to org.apache.activemq/activemq-spring/5.16.0-SNAPSHOT/activemq-spring-5.16.0-SNAPSHOT.pom
[Fast Archiver] No artifacts from ActiveMQ-Java8-All-UnitTests » ActiveMQ :: Spring #809
to compare, so performing full copy of artifacts
[JENKINS] Archiving <https://builds.apache.org/job/ActiveMQ-Java8-All-UnitTests/ws/activemq-leveldb-store/pom.xml>
to org.apache.activemq/activemq-leveldb-store/5.16.0-SNAPSHOT/activemq-leveldb-store-5.16.0-SNAPSHOT.pom
[Fast Archiver] No artifacts from ActiveMQ-Java8-All-UnitTests » ActiveMQ :: LevelDB Store
#809 to compare, so performing full copy of artifacts
[locks-and-latches] Releasing all the locks
[locks-and-latches] All the locks released
channel stopped

Mime
View raw message