activemq-commits mailing list archives

Site index · List index
Message view « Date » · « Thread »
Top « Date » · « Thread »
From Apache Jenkins Server <jenk...@builds.apache.org>
Subject Build failed in Jenkins: ActiveMQ-Artemis-Master #1761
Date Tue, 17 Apr 2018 19:33:51 GMT
See <https://builds.apache.org/job/ActiveMQ-Artemis-Master/1761/display/redirect?page=changes>

Changes:

[clebertsuconic] NO-JIRA Adding examples verification into travis

[clebertsuconic] NO-JIRA fixing checkstyle on virtual topic mapping example

[clebertsuconic] NO-JIRA Adding example to run-examples.sh

------------------------------------------
[...truncated 20.33 KB...]
	at sun.net.www.http.HttpClient.parseHTTPHeader(HttpClient.java:840) [rt.jar:1.8.0_152]
	at sun.net.www.http.HttpClient.parseHTTP(HttpClient.java:678) [rt.jar:1.8.0_152]
	at sun.net.www.protocol.http.HttpURLConnection.getInputStream0(HttpURLConnection.java:1587)
[rt.jar:1.8.0_152]
	at sun.net.www.protocol.http.HttpURLConnection.getInputStream(HttpURLConnection.java:1492)
[rt.jar:1.8.0_152]
	at org.apache.activemq.artemis.core.server.NetworkHealthCheck.check(NetworkHealthCheck.java:394)
[:]
	at org.apache.activemq.artemis.utils.NetworkHealthTest.testCheckUsingHTTP(NetworkHealthTest.java:217)
[:]
	at sun.reflect.NativeMethodAccessorImpl.invoke0(Native Method) [rt.jar:1.8.0_152]
	at sun.reflect.NativeMethodAccessorImpl.invoke(NativeMethodAccessorImpl.java:62) [rt.jar:1.8.0_152]
	at sun.reflect.DelegatingMethodAccessorImpl.invoke(DelegatingMethodAccessorImpl.java:43)
[rt.jar:1.8.0_152]
	at java.lang.reflect.Method.invoke(Method.java:498) [rt.jar:1.8.0_152]
	at org.junit.runners.model.FrameworkMethod$1.runReflectiveCall(FrameworkMethod.java:47) [junit-4.11.jar:]
	at org.junit.internal.runners.model.ReflectiveCallable.run(ReflectiveCallable.java:12) [junit-4.11.jar:]
	at org.junit.runners.model.FrameworkMethod.invokeExplosively(FrameworkMethod.java:44) [junit-4.11.jar:]
	at org.junit.internal.runners.statements.InvokeMethod.evaluate(InvokeMethod.java:17) [junit-4.11.jar:]
	at org.junit.internal.runners.statements.RunBefores.evaluate(RunBefores.java:26) [junit-4.11.jar:]
	at org.junit.internal.runners.statements.RunAfters.evaluate(RunAfters.java:27) [junit-4.11.jar:]
	at org.junit.runners.ParentRunner.runLeaf(ParentRunner.java:271) [junit-4.11.jar:]
	at org.junit.runners.BlockJUnit4ClassRunner.runChild(BlockJUnit4ClassRunner.java:70) [junit-4.11.jar:]
	at org.junit.runners.BlockJUnit4ClassRunner.runChild(BlockJUnit4ClassRunner.java:50) [junit-4.11.jar:]
	at org.junit.runners.ParentRunner$3.run(ParentRunner.java:238) [junit-4.11.jar:]
	at org.junit.runners.ParentRunner$1.schedule(ParentRunner.java:63) [junit-4.11.jar:]
	at org.junit.runners.ParentRunner.runChildren(ParentRunner.java:236) [junit-4.11.jar:]
	at org.junit.runners.ParentRunner.access$000(ParentRunner.java:53) [junit-4.11.jar:]
	at org.junit.runners.ParentRunner$2.evaluate(ParentRunner.java:229) [junit-4.11.jar:]
	at org.junit.runners.ParentRunner.run(ParentRunner.java:309) [junit-4.11.jar:]
	at org.apache.maven.surefire.junit4.JUnit4Provider.execute(JUnit4Provider.java:283) [surefire-junit4-2.18.1.jar:2.18.1]
	at org.apache.maven.surefire.junit4.JUnit4Provider.executeWithRerun(JUnit4Provider.java:173)
[surefire-junit4-2.18.1.jar:2.18.1]
	at org.apache.maven.surefire.junit4.JUnit4Provider.executeTestSet(JUnit4Provider.java:153)
[surefire-junit4-2.18.1.jar:2.18.1]
	at org.apache.maven.surefire.junit4.JUnit4Provider.invoke(JUnit4Provider.java:128) [surefire-junit4-2.18.1.jar:2.18.1]
	at org.apache.maven.surefire.booter.ForkedBooter.invokeProviderInSameClassLoader(ForkedBooter.java:203)
[surefire-booter-2.18.1.jar:2.18.1]
	at org.apache.maven.surefire.booter.ForkedBooter.runSuitesInProcess(ForkedBooter.java:155)
[surefire-booter-2.18.1.jar:2.18.1]
	at org.apache.maven.surefire.booter.ForkedBooter.main(ForkedBooter.java:103) [surefire-booter-2.18.1.jar:2.18.1]

[main] 19:33:41,170 WARN  [org.apache.activemq.artemis.logs] AMQ202006: Failed to check Url
http://localhost:8787.: java.net.ConnectException: Connection refused (Connection refused)
	at java.net.PlainSocketImpl.socketConnect(Native Method) [rt.jar:1.8.0_152]
	at java.net.AbstractPlainSocketImpl.doConnect(AbstractPlainSocketImpl.java:350) [rt.jar:1.8.0_152]
	at java.net.AbstractPlainSocketImpl.connectToAddress(AbstractPlainSocketImpl.java:206) [rt.jar:1.8.0_152]
	at java.net.AbstractPlainSocketImpl.connect(AbstractPlainSocketImpl.java:188) [rt.jar:1.8.0_152]
	at java.net.SocksSocketImpl.connect(SocksSocketImpl.java:392) [rt.jar:1.8.0_152]
	at java.net.Socket.connect(Socket.java:589) [rt.jar:1.8.0_152]
	at java.net.Socket.connect(Socket.java:538) [rt.jar:1.8.0_152]
	at sun.net.NetworkClient.doConnect(NetworkClient.java:180) [rt.jar:1.8.0_152]
	at sun.net.www.http.HttpClient.openServer(HttpClient.java:463) [rt.jar:1.8.0_152]
	at sun.net.www.http.HttpClient.openServer(HttpClient.java:558) [rt.jar:1.8.0_152]
	at sun.net.www.http.HttpClient.<init>(HttpClient.java:242) [rt.jar:1.8.0_152]
	at sun.net.www.http.HttpClient.New(HttpClient.java:339) [rt.jar:1.8.0_152]
	at sun.net.www.http.HttpClient.New(HttpClient.java:357) [rt.jar:1.8.0_152]
	at sun.net.www.protocol.http.HttpURLConnection.getNewHttpClient(HttpURLConnection.java:1220)
[rt.jar:1.8.0_152]
	at sun.net.www.protocol.http.HttpURLConnection.plainConnect0(HttpURLConnection.java:1156)
[rt.jar:1.8.0_152]
	at sun.net.www.protocol.http.HttpURLConnection.plainConnect(HttpURLConnection.java:1050)
[rt.jar:1.8.0_152]
	at sun.net.www.protocol.http.HttpURLConnection.connect(HttpURLConnection.java:984) [rt.jar:1.8.0_152]
	at sun.net.www.protocol.http.HttpURLConnection.getInputStream0(HttpURLConnection.java:1564)
[rt.jar:1.8.0_152]
	at sun.net.www.protocol.http.HttpURLConnection.getInputStream(HttpURLConnection.java:1492)
[rt.jar:1.8.0_152]
	at org.apache.activemq.artemis.core.server.NetworkHealthCheck.check(NetworkHealthCheck.java:394)
[:]
	at org.apache.activemq.artemis.utils.NetworkHealthTest.testCheckUsingHTTP(NetworkHealthTest.java:222)
[:]
	at sun.reflect.NativeMethodAccessorImpl.invoke0(Native Method) [rt.jar:1.8.0_152]
	at sun.reflect.NativeMethodAccessorImpl.invoke(NativeMethodAccessorImpl.java:62) [rt.jar:1.8.0_152]
	at sun.reflect.DelegatingMethodAccessorImpl.invoke(DelegatingMethodAccessorImpl.java:43)
[rt.jar:1.8.0_152]
	at java.lang.reflect.Method.invoke(Method.java:498) [rt.jar:1.8.0_152]
	at org.junit.runners.model.FrameworkMethod$1.runReflectiveCall(FrameworkMethod.java:47) [junit-4.11.jar:]
	at org.junit.internal.runners.model.ReflectiveCallable.run(ReflectiveCallable.java:12) [junit-4.11.jar:]
	at org.junit.runners.model.FrameworkMethod.invokeExplosively(FrameworkMethod.java:44) [junit-4.11.jar:]
	at org.junit.internal.runners.statements.InvokeMethod.evaluate(InvokeMethod.java:17) [junit-4.11.jar:]
	at org.junit.internal.runners.statements.RunBefores.evaluate(RunBefores.java:26) [junit-4.11.jar:]
	at org.junit.internal.runners.statements.RunAfters.evaluate(RunAfters.java:27) [junit-4.11.jar:]
	at org.junit.runners.ParentRunner.runLeaf(ParentRunner.java:271) [junit-4.11.jar:]
	at org.junit.runners.BlockJUnit4ClassRunner.runChild(BlockJUnit4ClassRunner.java:70) [junit-4.11.jar:]
	at org.junit.runners.BlockJUnit4ClassRunner.runChild(BlockJUnit4ClassRunner.java:50) [junit-4.11.jar:]
	at org.junit.runners.ParentRunner$3.run(ParentRunner.java:238) [junit-4.11.jar:]
	at org.junit.runners.ParentRunner$1.schedule(ParentRunner.java:63) [junit-4.11.jar:]
	at org.junit.runners.ParentRunner.runChildren(ParentRunner.java:236) [junit-4.11.jar:]
	at org.junit.runners.ParentRunner.access$000(ParentRunner.java:53) [junit-4.11.jar:]
	at org.junit.runners.ParentRunner$2.evaluate(ParentRunner.java:229) [junit-4.11.jar:]
	at org.junit.runners.ParentRunner.run(ParentRunner.java:309) [junit-4.11.jar:]
	at org.apache.maven.surefire.junit4.JUnit4Provider.execute(JUnit4Provider.java:283) [surefire-junit4-2.18.1.jar:2.18.1]
	at org.apache.maven.surefire.junit4.JUnit4Provider.executeWithRerun(JUnit4Provider.java:173)
[surefire-junit4-2.18.1.jar:2.18.1]
	at org.apache.maven.surefire.junit4.JUnit4Provider.executeTestSet(JUnit4Provider.java:153)
[surefire-junit4-2.18.1.jar:2.18.1]
	at org.apache.maven.surefire.junit4.JUnit4Provider.invoke(JUnit4Provider.java:128) [surefire-junit4-2.18.1.jar:2.18.1]
	at org.apache.maven.surefire.booter.ForkedBooter.invokeProviderInSameClassLoader(ForkedBooter.java:203)
[surefire-booter-2.18.1.jar:2.18.1]
	at org.apache.maven.surefire.booter.ForkedBooter.runSuitesInProcess(ForkedBooter.java:155)
[surefire-booter-2.18.1.jar:2.18.1]
	at org.apache.maven.surefire.booter.ForkedBooter.main(ForkedBooter.java:103) [surefire-booter-2.18.1.jar:2.18.1]

[Network-Checker-0 (NetworkChecker)] 19:33:41,731 WARN  [org.apache.activemq.artemis.logs]
AMQ202006: Failed to check Url http://localhost:8787.: java.net.ConnectException: Connection
refused (Connection refused)
	at java.net.PlainSocketImpl.socketConnect(Native Method) [rt.jar:1.8.0_152]
	at java.net.AbstractPlainSocketImpl.doConnect(AbstractPlainSocketImpl.java:350) [rt.jar:1.8.0_152]
	at java.net.AbstractPlainSocketImpl.connectToAddress(AbstractPlainSocketImpl.java:206) [rt.jar:1.8.0_152]
	at java.net.AbstractPlainSocketImpl.connect(AbstractPlainSocketImpl.java:188) [rt.jar:1.8.0_152]
	at java.net.SocksSocketImpl.connect(SocksSocketImpl.java:392) [rt.jar:1.8.0_152]
	at java.net.Socket.connect(Socket.java:589) [rt.jar:1.8.0_152]
	at java.net.Socket.connect(Socket.java:538) [rt.jar:1.8.0_152]
	at sun.net.NetworkClient.doConnect(NetworkClient.java:180) [rt.jar:1.8.0_152]
	at sun.net.www.http.HttpClient.openServer(HttpClient.java:463) [rt.jar:1.8.0_152]
	at sun.net.www.http.HttpClient.openServer(HttpClient.java:558) [rt.jar:1.8.0_152]
	at sun.net.www.http.HttpClient.parseHTTPHeader(HttpClient.java:840) [rt.jar:1.8.0_152]
	at sun.net.www.http.HttpClient.parseHTTP(HttpClient.java:678) [rt.jar:1.8.0_152]
	at sun.net.www.protocol.http.HttpURLConnection.getInputStream0(HttpURLConnection.java:1587)
[rt.jar:1.8.0_152]
	at sun.net.www.protocol.http.HttpURLConnection.getInputStream(HttpURLConnection.java:1492)
[rt.jar:1.8.0_152]
	at org.apache.activemq.artemis.core.server.NetworkHealthCheck.check(NetworkHealthCheck.java:394)
[:]
	at org.apache.activemq.artemis.core.server.NetworkHealthCheck.check(NetworkHealthCheck.java:316)
[:]
	at org.apache.activemq.artemis.core.server.NetworkHealthCheck.run(NetworkHealthCheck.java:273)
[:]
	at org.apache.activemq.artemis.core.server.ActiveMQScheduledComponent$2.run(ActiveMQScheduledComponent.java:284)
[:]
	at org.apache.activemq.artemis.core.server.ActiveMQScheduledComponent$3.run(ActiveMQScheduledComponent.java:294)
[:]
	at java.util.concurrent.Executors$RunnableAdapter.call(Executors.java:511) [rt.jar:1.8.0_152]
	at java.util.concurrent.FutureTask.runAndReset(FutureTask.java:308) [rt.jar:1.8.0_152]
	at java.util.concurrent.ScheduledThreadPoolExecutor$ScheduledFutureTask.access$301(ScheduledThreadPoolExecutor.java:180)
[rt.jar:1.8.0_152]
	at java.util.concurrent.ScheduledThreadPoolExecutor$ScheduledFutureTask.run(ScheduledThreadPoolExecutor.java:294)
[rt.jar:1.8.0_152]
	at java.util.concurrent.ThreadPoolExecutor.runWorker(ThreadPoolExecutor.java:1149) [rt.jar:1.8.0_152]
	at java.util.concurrent.ThreadPoolExecutor$Worker.run(ThreadPoolExecutor.java:624) [rt.jar:1.8.0_152]
	at org.apache.activemq.artemis.utils.ActiveMQThreadFactory$1.run(ActiveMQThreadFactory.java:118)
[:]

[Network-Checker-0 (NetworkChecker)] 19:33:41,734 INFO  [org.apache.activemq.artemis.logs]
AMQ201001: Network is unhealthy, stopping service org.apache.activemq.artemis.utils.NetworkHealthTest$1@2de8284b
[Network-Checker-0 (NetworkChecker)] 19:33:41,838 INFO  [org.apache.activemq.artemis.logs]
AMQ201000: Network is healthy, starting service org.apache.activemq.artemis.utils.NetworkHealthTest$1@2de8284b
Tests run: 7, Failures: 0, Errors: 0, Skipped: 0, Time elapsed: 1.067 sec - in org.apache.activemq.artemis.utils.NetworkHealthTest
Running org.apache.activemq.artemis.utils.PairTest
Tests run: 1, Failures: 0, Errors: 0, Skipped: 0, Time elapsed: 0.002 sec - in org.apache.activemq.artemis.utils.PairTest
Running org.apache.activemq.artemis.utils.PasswordMaskingUtilTest
Tests run: 2, Failures: 0, Errors: 0, Skipped: 0, Time elapsed: 0.003 sec - in org.apache.activemq.artemis.utils.PasswordMaskingUtilTest
Running org.apache.activemq.artemis.utils.ReferenceCounterTest
Tests run: 3, Failures: 0, Errors: 0, Skipped: 0, Time elapsed: 0.126 sec - in org.apache.activemq.artemis.utils.ReferenceCounterTest
Running org.apache.activemq.artemis.utils.SimpleFutureTest
Tests run: 2, Failures: 0, Errors: 0, Skipped: 0, Time elapsed: 0.054 sec - in org.apache.activemq.artemis.utils.SimpleFutureTest
Running org.apache.activemq.artemis.utils.SimpleStringTest
Tests run: 1, Failures: 0, Errors: 0, Skipped: 0, Time elapsed: 0.276 sec - in org.apache.activemq.artemis.utils.SimpleStringTest
Running org.apache.activemq.artemis.utils.TimeUnitsTest
Tests run: 1, Failures: 0, Errors: 0, Skipped: 0, Time elapsed: 0.105 sec - in org.apache.activemq.artemis.utils.TimeUnitsTest
Running org.apache.activemq.artemis.utils.TypedPropertiesConversionTest
Tests run: 10, Failures: 0, Errors: 0, Skipped: 0, Time elapsed: 0.016 sec - in org.apache.activemq.artemis.utils.TypedPropertiesConversionTest
Running org.apache.activemq.artemis.utils.TypedPropertiesTest
Tests run: 16, Failures: 0, Errors: 0, Skipped: 0, Time elapsed: 0.039 sec - in org.apache.activemq.artemis.utils.TypedPropertiesTest
Running org.apache.activemq.artemis.utils.URIParserTest
fruit:Fruit{host='port', port=-1, userInfo='some:guy'super=FruitBase{name='fruit', fluentName='something',
color='green'}}
queryString1: 
queryString2: key1=value1
queryString3: key1=value1&key3=value3
queryString4: key1=value1&key2=value2&key3=value3
Tests run: 5, Failures: 0, Errors: 0, Skipped: 0, Time elapsed: 0.088 sec - in org.apache.activemq.artemis.utils.URIParserTest
Running org.apache.activemq.artemis.utils.actors.OrderedExecutorSanityTest
execution 0 in 1075 milliseconds
execution 1 in 537 milliseconds
execution 2 in 563 milliseconds
execution 3 in 446 milliseconds
execution 4 in 125 milliseconds
execution 5 in 112 milliseconds
execution 6 in 114 milliseconds
execution 7 in 158 milliseconds
execution 8 in 906 milliseconds
execution 9 in 535 milliseconds
Tests run: 4, Failures: 0, Errors: 0, Skipped: 0, Time elapsed: 4.847 sec - in org.apache.activemq.artemis.utils.actors.OrderedExecutorSanityTest
Running org.apache.activemq.artemis.utils.collections.ConcurrentLongHashMapTest
Tests run: 11, Failures: 0, Errors: 0, Skipped: 0, Time elapsed: 0.534 sec - in org.apache.activemq.artemis.utils.collections.ConcurrentLongHashMapTest
Running org.apache.activemq.artemis.utils.collections.ConcurrentLongHashSetTest
Tests run: 8, Failures: 0, Errors: 0, Skipped: 0, Time elapsed: 0.484 sec - in org.apache.activemq.artemis.utils.collections.ConcurrentLongHashSetTest
Running org.apache.activemq.artemis.utils.critical.CriticalAnalyzerTest
component org.apache.activemq.artemis.utils.critical.CriticalComponentImpl@6973b51b received
component org.apache.activemq.artemis.utils.critical.CriticalAnalyzerTest$1@40ef3420 received
Tests run: 5, Failures: 0, Errors: 0, Skipped: 0, Time elapsed: 0.224 sec - in org.apache.activemq.artemis.utils.critical.CriticalAnalyzerTest

Results :

Failed tests: 
  ActiveMQScheduledComponentTest.testUsingOwnExecutorsOnDemand:172 null

Tests run: 111, Failures: 1, Errors: 0, Skipped: 0

[INFO] ------------------------------------------------------------------------
[INFO] Reactor Summary:
[INFO] 
[INFO] ActiveMQ Artemis Parent ............................ SUCCESS [  5.356 s]
[INFO] ActiveMQ Artemis Commons ........................... FAILURE [ 20.732 s]
[INFO] ActiveMQ Artemis Core Client ....................... SKIPPED
[INFO] ActiveMQ Artemis Selector Implementation ........... SKIPPED
[INFO] ActiveMQ Artemis JMS Client ........................ SKIPPED
[INFO] ActiveMQ Artemis Native POM ........................ SKIPPED
[INFO] ActiveMQ Artemis Journal ........................... SKIPPED
[INFO] ActiveMQ Artemis JDBC Store ........................ SKIPPED
[INFO] ActiveMQ Artemis Server ............................ SKIPPED
[INFO] ActiveMQ Artemis Protocols ......................... SKIPPED
[INFO] ActiveMQ Artemis AMQP Protocol ..................... SKIPPED
[INFO] ActiveMQ Artemis STOMP Protocol .................... SKIPPED
[INFO] ActiveMQ Artemis OpenWire Protocol ................. SKIPPED
[INFO] ActiveMQ Artemis HQClient Protocol ................. SKIPPED
[INFO] ActiveMQ Artemis HornetQ Protocol .................. SKIPPED
[INFO] ActiveMQ Artemis MQTT Protocol ..................... SKIPPED
[INFO] ActiveMQ Artemis DTO ............................... SKIPPED
[INFO] ActiveMQ Artemis Service Extensions ................ SKIPPED
[INFO] ActiveMQ Artemis JMS Server ........................ SKIPPED
[INFO] ActiveMQ Artemis CDI Integration ................... SKIPPED
[INFO] ActiveMQ Artemis Boot .............................. SKIPPED
[INFO] ActiveMQ Artemis Tools ............................. SKIPPED
[INFO] ActiveMQ Artemis CLI ............................... SKIPPED
[INFO] ActiveMQ Artemis Web ............................... SKIPPED
[INFO] ActiveMQ Artemis Web ............................... SKIPPED
[INFO] ActiveMQ Artemis Core Client All ................... SKIPPED
[INFO] ActiveMQ Artemis Client OSGi ....................... SKIPPED
[INFO] ActiveMQ Artemis JUnit Rules ....................... SKIPPED
[INFO] ActiveMQ Artemis JMS Client All .................... SKIPPED
[INFO] ActiveMQ Artemis JMS Client OSGi ................... SKIPPED
[INFO] ActiveMQ Artemis RAR POM ........................... SKIPPED
[INFO] ActiveMQ Artemis REST Interface Implementation ..... SKIPPED
[INFO] ActiveMQ Artemis Maven Plugin ...................... SKIPPED
[INFO] ActiveMQ Artemis Server OSGi ....................... SKIPPED
[INFO] ActiveMQ Artemis Cons .............................. SKIPPED
[INFO] ActiveMQ Artemis HawtIO Branding ................... SKIPPED
[INFO] ActiveMQ Artemis HawtIO Plugin ..................... SKIPPED
[INFO] ActiveMQ Artemis Console ........................... SKIPPED
[INFO] ActiveMQ Artemis Spring Integration ................ SKIPPED
[INFO] Apache ActiveMQ Artemis Distribution ............... SKIPPED
[INFO] ActiveMQ Artemis Tests POM ......................... SKIPPED
[INFO] ActiveMQ Artemis Test Support ...................... SKIPPED
[INFO] ActiveMQ Artemis Unit Tests ........................ SKIPPED
[INFO] ActiveMQ Artemis Joram Tests ....................... SKIPPED
[INFO] ActiveMQ Artemis timing Tests ...................... SKIPPED
[INFO] ActiveMQ Artemis JMS Tests ......................... SKIPPED
[INFO] ActiveMQ Artemis Features .......................... SKIPPED
[INFO] ActiveMQ Artemis Integration Tests ................. SKIPPED
[INFO] ActiveMQ Artemis Client Integration Tests .......... SKIPPED
[INFO] ActiveMQ Artemis Compatibility Tests ............... SKIPPED
[INFO] ActiveMQ Artemis soak Tests ........................ SKIPPED
[INFO] ActiveMQ Artemis stress Tests ...................... SKIPPED
[INFO] ActiveMQ Artemis performance Tests ................. SKIPPED
[INFO] Smoke Tests ........................................ SKIPPED
[INFO] ActiveMQ Artemis Extra Tests ....................... SKIPPED
[INFO] ------------------------------------------------------------------------
[INFO] BUILD FAILURE
[INFO] ------------------------------------------------------------------------
[INFO] Total time: 28.566 s
[INFO] Finished at: 2018-04-17T19:33:48+00:00
[INFO] Final Memory: 87M/1936M
[INFO] ------------------------------------------------------------------------
[ERROR] Failed to execute goal org.apache.maven.plugins:maven-surefire-plugin:2.18.1:test
(default-test) on project artemis-commons: There are test failures.
[ERROR] 
[ERROR] Please refer to <https://builds.apache.org/job/ActiveMQ-Artemis-Master/ws/artemis-commons/target/surefire-reports>
for the individual test results.
[ERROR] -> [Help 1]
[ERROR] 
[ERROR] To see the full stack trace of the errors, re-run Maven with the -e switch.
[ERROR] Re-run Maven using the -X switch to enable full debug logging.
[ERROR] 
[ERROR] For more information about the errors and possible solutions, please read the following
articles:
[ERROR] [Help 1] http://cwiki.apache.org/confluence/display/MAVEN/MojoFailureException
[ERROR] 
[ERROR] After correcting the problems, you can resume the build with the command
[ERROR]   mvn <goals> -rf :artemis-commons
Build step 'Invoke top-level Maven targets' marked build as failure
Performing Post build task...
Could not match :Too many files with unapproved license  : False
Logical operation result is FALSE
Skipping script  : cat ratReport.txt
END OF POST BUILD TASK 	: 0
Recording test results

Mime
View raw message