activemq-commits mailing list archives

Site index · List index
Message view « Date » · « Thread »
Top « Date » · « Thread »
From Apache Jenkins Server <jenk...@builds.apache.org>
Subject Build failed in Jenkins: ActiveMQ-Artemis-Master #1773
Date Wed, 25 Apr 2018 20:36:32 GMT
See <https://builds.apache.org/job/ActiveMQ-Artemis-Master/1773/display/redirect?page=changes>

Changes:

[jbertram] ARTEMIS-1830 only return prepared txns with listPreparedTxns mgmnt op

[clebertsuconic] ARTEMIS-1832 Removing dead HAAutomaticBackupSharedStoreTest

[clebertsuconic] ARTEMIS-1824 running broker from path with non-ascii chars

------------------------------------------
[...truncated 1.25 MB...]
[main] 20:34:12,687 INFO  [org.apache.activemq.artemis.core.server] **** end #test testAddHead()
***
[main] 20:34:12,687 INFO  [org.apache.activemq.artemis.core.server] **** start #test testAddTail()
***
[main] 20:34:12,694 INFO  [org.apache.activemq.artemis.core.server] **** end #test testAddTail()
***
[main] 20:34:12,695 INFO  [org.apache.activemq.artemis.core.server] **** start #test testAddHeadAndTail()
***
[main] 20:34:12,704 INFO  [org.apache.activemq.artemis.core.server] **** end #test testAddHeadAndTail()
***
[main] 20:34:12,705 INFO  [org.apache.activemq.artemis.core.server] **** start #test testCreateIteratorAfterAddElements()
***
[main] 20:34:12,711 INFO  [org.apache.activemq.artemis.core.server] **** end #test testCreateIteratorAfterAddElements()
***
[main] 20:34:12,712 INFO  [org.apache.activemq.artemis.core.server] **** start #test testClear()
***
[main] 20:34:12,718 INFO  [org.apache.activemq.artemis.core.server] **** end #test testClear()
***
[main] 20:34:12,718 INFO  [org.apache.activemq.artemis.core.server] **** start #test testPoll()
***
[main] 20:34:12,724 INFO  [org.apache.activemq.artemis.core.server] **** end #test testPoll()
***
[main] 20:34:12,725 INFO  [org.apache.activemq.artemis.core.server] **** start #test testRemoveHead1()
***
[main] 20:34:12,731 INFO  [org.apache.activemq.artemis.core.server] **** end #test testRemoveHead1()
***
[main] 20:34:12,731 INFO  [org.apache.activemq.artemis.core.server] **** start #test testRemoveHead2()
***
[main] 20:34:12,738 INFO  [org.apache.activemq.artemis.core.server] **** end #test testRemoveHead2()
***
[main] 20:34:12,738 INFO  [org.apache.activemq.artemis.core.server] **** start #test testRemoveHead3()
***
[main] 20:34:12,747 INFO  [org.apache.activemq.artemis.core.server] **** end #test testRemoveHead3()
***
[main] 20:34:12,747 INFO  [org.apache.activemq.artemis.core.server] **** start #test testRemoveTail1()
***
[main] 20:34:12,754 INFO  [org.apache.activemq.artemis.core.server] **** end #test testRemoveTail1()
***
[main] 20:34:12,755 INFO  [org.apache.activemq.artemis.core.server] **** start #test testRemoveTail2()
***
[main] 20:34:12,762 INFO  [org.apache.activemq.artemis.core.server] **** end #test testRemoveTail2()
***
[main] 20:34:12,762 INFO  [org.apache.activemq.artemis.core.server] **** start #test testRemoveTail3()
***
[main] 20:34:12,769 INFO  [org.apache.activemq.artemis.core.server] **** end #test testRemoveTail3()
***
[main] 20:34:12,770 INFO  [org.apache.activemq.artemis.core.server] **** start #test testRemoveInTurn()
***
[main] 20:34:12,776 INFO  [org.apache.activemq.artemis.core.server] **** end #test testRemoveInTurn()
***
[main] 20:34:12,777 INFO  [org.apache.activemq.artemis.core.server] **** start #test testRemoveMiddle()
***
[main] 20:34:12,783 INFO  [org.apache.activemq.artemis.core.server] **** end #test testRemoveMiddle()
***
[main] 20:34:12,783 INFO  [org.apache.activemq.artemis.core.server] **** start #test testAddHeadAndRemove()
***
Jumping 500
[main] 20:34:12,789 INFO  [org.apache.activemq.artemis.utils.ThreadLeakCheckRule] #test forceGC
[main] 20:34:12,999 INFO  [org.apache.activemq.artemis.utils.ThreadLeakCheckRule] #test forceGC
Done 
[main] 20:34:13,002 INFO  [org.apache.activemq.artemis.core.server] **** end #test testAddHeadAndRemove()
***
[main] 20:34:13,003 INFO  [org.apache.activemq.artemis.core.server] **** start #test testMultipleIterators1()
***
[main] 20:34:13,007 INFO  [org.apache.activemq.artemis.core.server] **** end #test testMultipleIterators1()
***
[main] 20:34:13,007 INFO  [org.apache.activemq.artemis.core.server] **** start #test testMultipleIterators2()
***
[main] 20:34:13,011 INFO  [org.apache.activemq.artemis.core.server] **** end #test testMultipleIterators2()
***
[main] 20:34:13,012 INFO  [org.apache.activemq.artemis.core.server] **** start #test testResizing()
***
[main] 20:34:13,019 INFO  [org.apache.activemq.artemis.core.server] **** end #test testResizing()
***
[main] 20:34:13,019 INFO  [org.apache.activemq.artemis.core.server] **** start #test testRepeatAndRemove()
***
[main] 20:34:13,024 INFO  [org.apache.activemq.artemis.core.server] **** end #test testRepeatAndRemove()
***
[main] 20:34:13,024 INFO  [org.apache.activemq.artemis.core.server] **** start #test testIterateNoElements()
***
[main] 20:34:13,029 INFO  [org.apache.activemq.artemis.core.server] **** end #test testIterateNoElements()
***
[main] 20:34:13,029 INFO  [org.apache.activemq.artemis.core.server] **** start #test testAddAndRemove()
***
[main] 20:34:13,038 INFO  [org.apache.activemq.artemis.utils.ThreadLeakCheckRule] #test forceGC
[main] 20:34:13,333 INFO  [org.apache.activemq.artemis.utils.ThreadLeakCheckRule] #test forceGC
Done 
[main] 20:34:13,844 INFO  [org.apache.activemq.artemis.utils.ThreadLeakCheckRule] #test forceGC
[main] 20:34:29,552 INFO  [org.apache.activemq.artemis.utils.ThreadLeakCheckRule] #test forceGC
Done 
[main] 20:34:29,555 INFO  [org.apache.activemq.artemis.core.server] **** end #test testAddAndRemove()
***
[main] 20:34:29,560 INFO  [org.apache.activemq.artemis.core.server] **** start #test testRemoveHeadAndTail1()
***
[main] 20:34:29,564 INFO  [org.apache.activemq.artemis.core.server] **** end #test testRemoveHeadAndTail1()
***
[main] 20:34:29,564 INFO  [org.apache.activemq.artemis.core.server] **** start #test testRemoveHeadAndTail2()
***
[main] 20:34:29,568 INFO  [org.apache.activemq.artemis.core.server] **** end #test testRemoveHeadAndTail2()
***
[main] 20:34:29,568 INFO  [org.apache.activemq.artemis.core.server] **** start #test testRemoveHeadAndTail3()
***
[main] 20:34:29,572 INFO  [org.apache.activemq.artemis.core.server] **** end #test testRemoveHeadAndTail3()
***
[main] 20:34:29,572 INFO  [org.apache.activemq.artemis.core.server] **** start #test testRepeat()
***
[main] 20:34:29,576 INFO  [org.apache.activemq.artemis.core.server] **** end #test testRepeat()
***
[main] 20:34:29,576 INFO  [org.apache.activemq.artemis.core.server] **** start #test testCreateIteratorBeforeAddElements()
***
[main] 20:34:29,580 INFO  [org.apache.activemq.artemis.core.server] **** end #test testCreateIteratorBeforeAddElements()
***
[main] 20:34:29,580 INFO  [org.apache.activemq.artemis.core.server] **** start #test testRemoveAll()
***
[main] 20:34:29,584 INFO  [org.apache.activemq.artemis.core.server] **** end #test testRemoveAll()
***
[main] 20:34:29,584 INFO  [org.apache.activemq.artemis.core.server] **** start #test testRemoveOdd()
***
[main] 20:34:29,588 INFO  [org.apache.activemq.artemis.core.server] **** end #test testRemoveOdd()
***
[main] 20:34:29,588 INFO  [org.apache.activemq.artemis.core.server] **** start #test testIterateThenAddMoreAndIterateAgain()
***
[main] 20:34:29,591 INFO  [org.apache.activemq.artemis.core.server] **** end #test testIterateThenAddMoreAndIterateAgain()
***
Tests run: 29, Failures: 1, Errors: 0, Skipped: 0, Time elapsed: 16.91 sec <<< FAILURE!
- in org.apache.activemq.artemis.tests.unit.util.LinkedListTest
testAddAndRemove(org.apache.activemq.artemis.tests.unit.util.LinkedListTest)  Time elapsed:
16.531 sec  <<< FAILURE!
java.lang.AssertionError: expected:<100> but was:<73134>
	at org.junit.Assert.fail(Assert.java:88)
	at org.junit.Assert.failNotEquals(Assert.java:743)
	at org.junit.Assert.assertEquals(Assert.java:118)
	at org.junit.Assert.assertEquals(Assert.java:555)
	at org.junit.Assert.assertEquals(Assert.java:542)
	at org.apache.activemq.artemis.tests.unit.util.LinkedListTest.assertCount(LinkedListTest.java:187)
	at org.apache.activemq.artemis.tests.unit.util.LinkedListTest.testAddAndRemove(LinkedListTest.java:82)

Running org.apache.activemq.artemis.tests.unit.util.MemorySizeTest
[main] 20:34:38,890 WARN  [org.apache.activemq.artemis.core.client] AMQ212047: Warning: JVM
allocated more data what would make results invalid 9,348,055,040:9,481,224,192
[main] 20:34:38,890 INFO  [org.apache.activemq.artemis.tests.unit] Server message size is
1184
[main] 20:34:47,699 WARN  [org.apache.activemq.artemis.core.client] AMQ212047: Warning: JVM
allocated more data what would make results invalid 9,609,674,752:9,634,840,576
[main] 20:34:47,700 INFO  [org.apache.activemq.artemis.tests.unit] Message reference size
is 64
Tests run: 1, Failures: 0, Errors: 0, Skipped: 0, Time elapsed: 18.105 sec - in org.apache.activemq.artemis.tests.unit.util.MemorySizeTest
Running org.apache.activemq.artemis.tests.unit.util.ObjectInputStreamWithClassLoaderTest
[main] 20:34:47,701 INFO  [org.apache.activemq.artemis.core.server] **** start #test testClassLoaderIsolationWithProxy()
***
Deserialized Object org.apache.activemq.artemis.tests.unit.util.ObjectInputStreamWithClassLoaderTest$AnObjectImpl@67b7c170
[main] 20:34:47,756 INFO  [org.apache.activemq.artemis.core.server] **** end #test testClassLoaderIsolationWithProxy()
***
[main] 20:34:47,756 INFO  [org.apache.activemq.artemis.core.server] **** start #test testWhiteBlackListAgainstListObject()
***
[main] 20:34:47,766 INFO  [org.apache.activemq.artemis.core.server] **** end #test testWhiteBlackListAgainstListObject()
***
[main] 20:34:47,767 INFO  [org.apache.activemq.artemis.core.server] **** start #test testWhiteBlackListAgainstArrayObject()
***
[main] 20:34:47,773 INFO  [org.apache.activemq.artemis.core.server] **** end #test testWhiteBlackListAgainstArrayObject()
***
[main] 20:34:47,773 INFO  [org.apache.activemq.artemis.core.server] **** start #test testWhiteBlackListAnonymousObject()
***
[main] 20:34:47,780 INFO  [org.apache.activemq.artemis.core.server] **** end #test testWhiteBlackListAnonymousObject()
***
[main] 20:34:47,780 INFO  [org.apache.activemq.artemis.core.server] **** start #test testWhiteBlackListLocalObject()
***
[main] 20:34:47,787 INFO  [org.apache.activemq.artemis.core.server] **** end #test testWhiteBlackListLocalObject()
***
[main] 20:34:47,787 INFO  [org.apache.activemq.artemis.core.server] **** start #test testWhiteBlackListSystemProperty()
***
[main] 20:34:47,792 INFO  [org.apache.activemq.artemis.core.server] **** end #test testWhiteBlackListSystemProperty()
***
[main] 20:34:47,792 INFO  [org.apache.activemq.artemis.core.server] **** start #test testClassLoaderIsolation()
***
[main] 20:34:47,808 INFO  [org.apache.activemq.artemis.core.server] **** end #test testClassLoaderIsolation()
***
[main] 20:34:47,808 INFO  [org.apache.activemq.artemis.core.server] **** start #test testWhiteBlackList()
***
[main] 20:34:47,816 INFO  [org.apache.activemq.artemis.core.server] **** end #test testWhiteBlackList()
***
[main] 20:34:47,816 INFO  [org.apache.activemq.artemis.core.server] **** start #test testWhiteBlackListAgainstListMapObject()
***
[main] 20:34:47,826 INFO  [org.apache.activemq.artemis.core.server] **** end #test testWhiteBlackListAgainstListMapObject()
***
Tests run: 9, Failures: 0, Errors: 0, Skipped: 0, Time elapsed: 0.125 sec - in org.apache.activemq.artemis.tests.unit.util.ObjectInputStreamWithClassLoaderTest
Running org.apache.activemq.artemis.tests.unit.util.ReusableLatchTest
[main] 20:34:47,827 INFO  [org.apache.activemq.artemis.core.server] **** start #test testLatchWithParameterizedDown()
***
[main] 20:34:47,831 INFO  [org.apache.activemq.artemis.core.server] **** end #test testLatchWithParameterizedDown()
***
[main] 20:34:47,832 INFO  [org.apache.activemq.artemis.core.server] **** start #test testLatchOnSingleThread()
***
[main] 20:34:47,836 INFO  [org.apache.activemq.artemis.core.server] **** end #test testLatchOnSingleThread()
***
[main] 20:34:47,836 INFO  [org.apache.activemq.artemis.core.server] **** start #test testReuseLatch()
***
[main] 20:34:47,846 INFO  [org.apache.activemq.artemis.core.server] **** end #test testReuseLatch()
***
[main] 20:34:47,847 INFO  [org.apache.activemq.artemis.core.server] **** start #test testLatchOnMultiThread()
***
[main] 20:34:47,944 INFO  [org.apache.activemq.artemis.core.server] **** end #test testLatchOnMultiThread()
***
Tests run: 4, Failures: 0, Errors: 0, Skipped: 0, Time elapsed: 0.118 sec - in org.apache.activemq.artemis.tests.unit.util.ReusableLatchTest
Running org.apache.activemq.artemis.tests.unit.util.SoftValueMapTest
[main] 20:34:47,946 INFO  [org.apache.activemq.artemis.core.server] **** start #test testEvictionsLeastUsed()
***
[main] 20:34:47,947 INFO  [org.apache.activemq.artemis.utils.ThreadLeakCheckRule] #test forceGC
[main] 20:34:48,238 INFO  [org.apache.activemq.artemis.utils.ThreadLeakCheckRule] #test forceGC
Done 
SoftCache.size 200
Soft cache has 200 elements
[main] 20:34:48,242 INFO  [org.apache.activemq.artemis.core.server] **** end #test testEvictionsLeastUsed()
***
[main] 20:34:48,242 INFO  [org.apache.activemq.artemis.core.server] **** start #test testEvictions()
***
[main] 20:34:48,244 INFO  [org.apache.activemq.artemis.utils.ThreadLeakCheckRule] #test forceGC
[main] 20:34:48,310 INFO  [org.apache.activemq.artemis.utils.ThreadLeakCheckRule] #test forceGC
Done 
SoftCache.size 100
Soft cache has 100 elements
[main] 20:35:59,983 INFO  [org.apache.activemq.artemis.core.server] **** end #test testEvictions()
***
[main] 20:35:59,984 INFO  [org.apache.activemq.artemis.core.server] **** start #test testEvictOldestElement()
***
[main] 20:35:59,987 INFO  [org.apache.activemq.artemis.core.server] **** end #test testEvictOldestElement()
***
Tests run: 3, Failures: 0, Errors: 0, Skipped: 0, Time elapsed: 72.042 sec - in org.apache.activemq.artemis.tests.unit.util.SoftValueMapTest
Running org.apache.activemq.artemis.tests.unit.util.UTF8Test
[main] 20:35:59,989 INFO  [org.apache.activemq.artemis.core.server] **** start #test testValidateUTFOnDataInput()
***
[main] 20:36:00,335 INFO  [org.apache.activemq.artemis.core.server] **** end #test testValidateUTFOnDataInput()
***
[main] 20:36:00,336 INFO  [org.apache.activemq.artemis.core.server] **** start #test testValidateUTF()
***
[main] 20:36:00,339 INFO  [org.apache.activemq.artemis.core.server] **** end #test testValidateUTF()
***
[main] 20:36:00,340 INFO  [org.apache.activemq.artemis.core.server] **** start #test testBigSize()
***
[main] 20:36:00,358 INFO  [org.apache.activemq.artemis.core.server] **** end #test testBigSize()
***
[main] 20:36:00,359 INFO  [org.apache.activemq.artemis.core.server] **** start #test testValidateUTFWithLastAsciiChars()
***
[main] 20:36:00,368 INFO  [org.apache.activemq.artemis.core.server] **** end #test testValidateUTFWithLastAsciiChars()
***
[main] 20:36:00,369 INFO  [org.apache.activemq.artemis.core.server] **** start #test testValidateUTFWithENDChars()
***
[main] 20:36:00,371 INFO  [org.apache.activemq.artemis.core.server] **** end #test testValidateUTFWithENDChars()
***
Tests run: 5, Failures: 0, Errors: 0, Skipped: 0, Time elapsed: 0.383 sec - in org.apache.activemq.artemis.tests.unit.util.UTF8Test
Running org.apache.activemq.artemis.tests.unit.util.UUIDGeneratorTest
[main] 20:36:00,373 INFO  [org.apache.activemq.artemis.core.server] **** start #test testZeroPaddedBytes()
***
[main] 20:36:00,375 INFO  [org.apache.activemq.artemis.core.server] **** end #test testZeroPaddedBytes()
***
[main] 20:36:00,375 INFO  [org.apache.activemq.artemis.core.server] **** start #test testGetHardwareAddress()
***
[main] 20:36:00,379 INFO  [org.apache.activemq.artemis.core.server] **** end #test testGetHardwareAddress()
***
Tests run: 2, Failures: 0, Errors: 0, Skipped: 0, Time elapsed: 0.008 sec - in org.apache.activemq.artemis.tests.unit.util.UUIDGeneratorTest
Running org.apache.activemq.artemis.tests.unit.util.UUIDTest
[main] 20:36:00,381 INFO  [org.apache.activemq.artemis.core.server] **** start #test testStringToUuidConversion()
***
[main] 20:36:00,621 INFO  [org.apache.activemq.artemis.core.server] **** end #test testStringToUuidConversion()
***
[main] 20:36:00,621 INFO  [org.apache.activemq.artemis.core.server] **** start #test testManyUUIDs()
***
[main] 20:36:00,740 INFO  [org.apache.activemq.artemis.core.server] **** end #test testManyUUIDs()
***
Tests run: 2, Failures: 0, Errors: 0, Skipped: 0, Time elapsed: 0.361 sec - in org.apache.activemq.artemis.tests.unit.util.UUIDTest
Running org.apache.activemq.artemis.tests.unit.util.VersionLoaderTest
[main] 20:36:00,742 INFO  [org.apache.activemq.artemis.core.server] **** start #test testLoadVersion()
***
[main] 20:36:00,745 INFO  [org.apache.activemq.artemis.core.server] **** end #test testLoadVersion()
***
Tests run: 1, Failures: 0, Errors: 0, Skipped: 0, Time elapsed: 0.004 sec - in org.apache.activemq.artemis.tests.unit.util.VersionLoaderTest

Results :

Failed tests: 
  LinkedListTest.testAddAndRemove:82->assertCount:187->Assert.assertEquals:542->Assert.assertEquals:555->Assert.assertEquals:118->Assert.failNotEquals:743->Assert.fail:88
expected:<100> but was:<73134>

Tests run: 631, Failures: 1, Errors: 0, Skipped: 0

[INFO] ------------------------------------------------------------------------
[INFO] Reactor Summary:
[INFO] 
[INFO] ActiveMQ Artemis Parent ............................ SUCCESS [  4.300 s]
[INFO] ActiveMQ Artemis Commons ........................... SUCCESS [ 20.967 s]
[INFO] ActiveMQ Artemis Core Client ....................... SUCCESS [ 10.678 s]
[INFO] ActiveMQ Artemis Selector Implementation ........... SUCCESS [  3.495 s]
[INFO] ActiveMQ Artemis JMS Client ........................ SUCCESS [  3.853 s]
[INFO] ActiveMQ Artemis Native POM ........................ SUCCESS [  6.660 s]
[INFO] ActiveMQ Artemis Journal ........................... SUCCESS [  2.911 s]
[INFO] ActiveMQ Artemis JDBC Store ........................ SUCCESS [ 26.595 s]
[INFO] ActiveMQ Artemis Server ............................ SUCCESS [05:01 min]
[INFO] ActiveMQ Artemis Protocols ......................... SUCCESS [  0.140 s]
[INFO] ActiveMQ Artemis AMQP Protocol ..................... SUCCESS [  4.904 s]
[INFO] ActiveMQ Artemis STOMP Protocol .................... SUCCESS [  2.032 s]
[INFO] ActiveMQ Artemis OpenWire Protocol ................. SUCCESS [  2.736 s]
[INFO] ActiveMQ Artemis HQClient Protocol ................. SUCCESS [  0.696 s]
[INFO] ActiveMQ Artemis HornetQ Protocol .................. SUCCESS [  1.006 s]
[INFO] ActiveMQ Artemis MQTT Protocol ..................... SUCCESS [  1.618 s]
[INFO] ActiveMQ Artemis DTO ............................... SUCCESS [  2.099 s]
[INFO] ActiveMQ Artemis Service Extensions ................ SUCCESS [  1.740 s]
[INFO] ActiveMQ Artemis JMS Server ........................ SUCCESS [  1.682 s]
[INFO] ActiveMQ Artemis CDI Integration ................... SUCCESS [  7.543 s]
[INFO] ActiveMQ Artemis Boot .............................. SUCCESS [  0.257 s]
[INFO] ActiveMQ Artemis Tools ............................. SUCCESS [  1.009 s]
[INFO] ActiveMQ Artemis CLI ............................... SUCCESS [ 40.757 s]
[INFO] ActiveMQ Artemis Web ............................... SUCCESS [  6.155 s]
[INFO] ActiveMQ Artemis Web ............................... SUCCESS [01:12 min]
[INFO] ActiveMQ Artemis Core Client All ................... SUCCESS [ 14.702 s]
[INFO] ActiveMQ Artemis Client OSGi ....................... SUCCESS [  1.359 s]
[INFO] ActiveMQ Artemis JUnit Rules ....................... SUCCESS [ 12.777 s]
[INFO] ActiveMQ Artemis JMS Client All .................... SUCCESS [ 12.617 s]
[INFO] ActiveMQ Artemis JMS Client OSGi ................... SUCCESS [  1.372 s]
[INFO] ActiveMQ Artemis RAR POM ........................... SUCCESS [  2.067 s]
[INFO] ActiveMQ Artemis REST Interface Implementation ..... SUCCESS [  4.637 s]
[INFO] ActiveMQ Artemis Maven Plugin ...................... SUCCESS [  3.775 s]
[INFO] ActiveMQ Artemis Server OSGi ....................... SUCCESS [  9.299 s]
[INFO] ActiveMQ Artemis Cons .............................. SUCCESS [  0.141 s]
[INFO] ActiveMQ Artemis HawtIO Branding ................... SUCCESS [  5.041 s]
[INFO] ActiveMQ Artemis HawtIO Plugin ..................... SUCCESS [  0.628 s]
[INFO] ActiveMQ Artemis Console ........................... SUCCESS [  3.989 s]
[INFO] ActiveMQ Artemis Spring Integration ................ SUCCESS [  0.913 s]
[INFO] Apache ActiveMQ Artemis Distribution ............... SUCCESS [ 25.450 s]
[INFO] ActiveMQ Artemis Tests POM ......................... SUCCESS [  0.512 s]
[INFO] ActiveMQ Artemis Test Support ...................... SUCCESS [  1.484 s]
[INFO] ActiveMQ Artemis Unit Tests ........................ FAILURE [04:16 min]
[INFO] ActiveMQ Artemis Joram Tests ....................... SKIPPED
[INFO] ActiveMQ Artemis timing Tests ...................... SKIPPED
[INFO] ActiveMQ Artemis JMS Tests ......................... SKIPPED
[INFO] ActiveMQ Artemis Features .......................... SKIPPED
[INFO] ActiveMQ Artemis Integration Tests ................. SKIPPED
[INFO] ActiveMQ Artemis Client Integration Tests .......... SKIPPED
[INFO] ActiveMQ Artemis Compatibility Tests ............... SKIPPED
[INFO] ActiveMQ Artemis soak Tests ........................ SKIPPED
[INFO] ActiveMQ Artemis stress Tests ...................... SKIPPED
[INFO] ActiveMQ Artemis performance Tests ................. SKIPPED
[INFO] Smoke Tests ........................................ SKIPPED
[INFO] ActiveMQ Artemis Extra Tests ....................... SKIPPED
[INFO] ------------------------------------------------------------------------
[INFO] BUILD FAILURE
[INFO] ------------------------------------------------------------------------
[INFO] Total time: 14:47 min
[INFO] Finished at: 2018-04-25T20:36:03+00:00
[INFO] Final Memory: 350M/6960M
[INFO] ------------------------------------------------------------------------
[ERROR] Failed to execute goal org.apache.maven.plugins:maven-surefire-plugin:2.18.1:test
(default-test) on project unit-tests: There are test failures.
[ERROR] 
[ERROR] Please refer to <https://builds.apache.org/job/ActiveMQ-Artemis-Master/ws/tests/unit-tests/target/surefire-reports>
for the individual test results.
[ERROR] -> [Help 1]
[ERROR] 
[ERROR] To see the full stack trace of the errors, re-run Maven with the -e switch.
[ERROR] Re-run Maven using the -X switch to enable full debug logging.
[ERROR] 
[ERROR] For more information about the errors and possible solutions, please read the following
articles:
[ERROR] [Help 1] http://cwiki.apache.org/confluence/display/MAVEN/MojoFailureException
[ERROR] 
[ERROR] After correcting the problems, you can resume the build with the command
[ERROR]   mvn <goals> -rf :unit-tests
Build step 'Invoke top-level Maven targets' marked build as failure
Performing Post build task...
Could not match :Too many files with unapproved license  : False
Logical operation result is FALSE
Skipping script  : cat ratReport.txt
END OF POST BUILD TASK 	: 0
Recording test results

Mime
View raw message