activemq-commits mailing list archives

Site index · List index
Message view « Date » · « Thread »
Top « Date » · « Thread »
From Apache Jenkins Server <jenk...@builds.apache.org>
Subject Build failed in Jenkins: ActiveMQ-Artemis-Master #1747
Date Tue, 10 Apr 2018 16:57:03 GMT
See <https://builds.apache.org/job/ActiveMQ-Artemis-Master/1747/display/redirect?page=changes>

Changes:

[christopher.l.shannon] ARTEMIS-1799 - Add a NotificationActiveMQServerPlugin

------------------------------------------
[...truncated 1.35 MB...]
	at org.apache.maven.surefire.junit4.JUnit4Provider.invoke(JUnit4Provider.java:128) [surefire-junit4-2.18.1.jar:2.18.1]
	at org.apache.maven.surefire.booter.ForkedBooter.invokeProviderInSameClassLoader(ForkedBooter.java:203)
[surefire-booter-2.18.1.jar:2.18.1]
	at org.apache.maven.surefire.booter.ForkedBooter.runSuitesInProcess(ForkedBooter.java:155)
[surefire-booter-2.18.1.jar:2.18.1]
	at org.apache.maven.surefire.booter.ForkedBooter.main(ForkedBooter.java:103) [surefire-booter-2.18.1.jar:2.18.1]

[main] 16:56:30,622 INFO  [org.apache.activemq.artemis.ra] AMQ151003: resource adaptor stopped
[main] 16:56:30,624 INFO  [org.apache.activemq.artemis.core.server] AMQ221002: Apache ActiveMQ
Artemis Message Broker version 2.6.0-SNAPSHOT [1ca47200-3ce0-11e8-a45f-024232019dc9] stopped,
uptime 2.056 seconds
[main] 16:56:30,629 INFO  [org.apache.activemq.artemis.core.server] **** end #test testForConnectionLeakDuringActivationWhenSessionCreationFails()
***
[main] 16:56:30,630 INFO  [org.apache.activemq.artemis.core.server] **** start #test testCreateConnectionFactoryThrowsException()
***
[main] 16:56:30,636 INFO  [org.apache.activemq.artemis.core.server] **** end #test testCreateConnectionFactoryThrowsException()
***
[main] 16:56:30,637 INFO  [org.apache.activemq.artemis.core.server] **** start #test testCreateConnectionFactoryMultipleConnectorsOverrideAndParams()
***
[main] 16:56:30,644 INFO  [org.apache.activemq.artemis.core.server] **** end #test testCreateConnectionFactoryMultipleConnectorsOverrideAndParams()
***
[main] 16:56:30,645 INFO  [org.apache.activemq.artemis.core.server] **** start #test test2DefaultConnectionFactorySame()
***
[main] 16:56:30,660 INFO  [org.apache.activemq.artemis.core.server] **** end #test test2DefaultConnectionFactorySame()
***
Tests run: 16, Failures: 0, Errors: 0, Skipped: 0, Time elapsed: 2.493 sec - in org.apache.activemq.artemis.tests.unit.ra.ResourceAdapterTest
Running org.apache.activemq.artemis.tests.unit.ra.referenceable.DestinationObjectFactoryTest
[main] 16:56:30,661 INFO  [org.apache.activemq.artemis.core.server] **** start #test testReference()
***
[main] 16:56:30,666 INFO  [org.apache.activemq.artemis.core.server] **** end #test testReference()
***
Tests run: 1, Failures: 0, Errors: 0, Skipped: 0, Time elapsed: 0.005 sec - in org.apache.activemq.artemis.tests.unit.ra.referenceable.DestinationObjectFactoryTest
Running org.apache.activemq.artemis.tests.unit.util.ActiveMQBufferInputStreamTest
[main] 16:56:30,667 INFO  [org.apache.activemq.artemis.core.server] **** start #test testReadBytes()
***
[main] 16:56:30,674 INFO  [org.apache.activemq.artemis.core.server] **** end #test testReadBytes()
***
Tests run: 1, Failures: 0, Errors: 0, Skipped: 0, Time elapsed: 0.007 sec - in org.apache.activemq.artemis.tests.unit.util.ActiveMQBufferInputStreamTest
Running org.apache.activemq.artemis.tests.unit.util.LinkedListTest
[main] 16:56:30,675 INFO  [org.apache.activemq.artemis.core.server] **** start #test testAddHead()
***
[main] 16:56:30,700 INFO  [org.apache.activemq.artemis.core.server] **** end #test testAddHead()
***
[main] 16:56:30,701 INFO  [org.apache.activemq.artemis.core.server] **** start #test testAddTail()
***
[main] 16:56:30,706 INFO  [org.apache.activemq.artemis.core.server] **** end #test testAddTail()
***
[main] 16:56:30,706 INFO  [org.apache.activemq.artemis.core.server] **** start #test testAddHeadAndTail()
***
[main] 16:56:30,710 INFO  [org.apache.activemq.artemis.core.server] **** end #test testAddHeadAndTail()
***
[main] 16:56:30,710 INFO  [org.apache.activemq.artemis.core.server] **** start #test testCreateIteratorAfterAddElements()
***
[main] 16:56:30,715 INFO  [org.apache.activemq.artemis.core.server] **** end #test testCreateIteratorAfterAddElements()
***
[main] 16:56:30,715 INFO  [org.apache.activemq.artemis.core.server] **** start #test testClear()
***
[main] 16:56:30,720 INFO  [org.apache.activemq.artemis.core.server] **** end #test testClear()
***
[main] 16:56:30,720 INFO  [org.apache.activemq.artemis.core.server] **** start #test testPoll()
***
[main] 16:56:30,724 INFO  [org.apache.activemq.artemis.core.server] **** end #test testPoll()
***
[main] 16:56:30,725 INFO  [org.apache.activemq.artemis.core.server] **** start #test testRemoveHead1()
***
[main] 16:56:30,730 INFO  [org.apache.activemq.artemis.core.server] **** end #test testRemoveHead1()
***
[main] 16:56:30,730 INFO  [org.apache.activemq.artemis.core.server] **** start #test testRemoveHead2()
***
[main] 16:56:30,735 INFO  [org.apache.activemq.artemis.core.server] **** end #test testRemoveHead2()
***
[main] 16:56:30,735 INFO  [org.apache.activemq.artemis.core.server] **** start #test testRemoveHead3()
***
[main] 16:56:30,739 INFO  [org.apache.activemq.artemis.core.server] **** end #test testRemoveHead3()
***
[main] 16:56:30,740 INFO  [org.apache.activemq.artemis.core.server] **** start #test testRemoveTail1()
***
[main] 16:56:30,744 INFO  [org.apache.activemq.artemis.core.server] **** end #test testRemoveTail1()
***
[main] 16:56:30,744 INFO  [org.apache.activemq.artemis.core.server] **** start #test testRemoveTail2()
***
[main] 16:56:30,748 INFO  [org.apache.activemq.artemis.core.server] **** end #test testRemoveTail2()
***
[main] 16:56:30,749 INFO  [org.apache.activemq.artemis.core.server] **** start #test testRemoveTail3()
***
[main] 16:56:30,753 INFO  [org.apache.activemq.artemis.core.server] **** end #test testRemoveTail3()
***
[main] 16:56:30,753 INFO  [org.apache.activemq.artemis.core.server] **** start #test testRemoveInTurn()
***
[main] 16:56:30,757 INFO  [org.apache.activemq.artemis.core.server] **** end #test testRemoveInTurn()
***
[main] 16:56:30,757 INFO  [org.apache.activemq.artemis.core.server] **** start #test testRemoveMiddle()
***
[main] 16:56:30,760 INFO  [org.apache.activemq.artemis.core.server] **** end #test testRemoveMiddle()
***
[main] 16:56:30,761 INFO  [org.apache.activemq.artemis.core.server] **** start #test testAddHeadAndRemove()
***
Jumping 500
[main] 16:56:30,768 INFO  [org.apache.activemq.artemis.utils.ThreadLeakCheckRule] #test forceGC
[main] 16:56:30,919 INFO  [org.apache.activemq.artemis.utils.ThreadLeakCheckRule] #test forceGC
Done 
[main] 16:56:30,921 INFO  [org.apache.activemq.artemis.core.server] **** end #test testAddHeadAndRemove()
***
[main] 16:56:30,922 INFO  [org.apache.activemq.artemis.core.server] **** start #test testMultipleIterators1()
***
[main] 16:56:30,925 INFO  [org.apache.activemq.artemis.core.server] **** end #test testMultipleIterators1()
***
[main] 16:56:30,926 INFO  [org.apache.activemq.artemis.core.server] **** start #test testMultipleIterators2()
***
[main] 16:56:30,928 INFO  [org.apache.activemq.artemis.core.server] **** end #test testMultipleIterators2()
***
[main] 16:56:30,928 INFO  [org.apache.activemq.artemis.core.server] **** start #test testResizing()
***
[main] 16:56:30,946 INFO  [org.apache.activemq.artemis.core.server] **** end #test testResizing()
***
[main] 16:56:30,946 INFO  [org.apache.activemq.artemis.core.server] **** start #test testRepeatAndRemove()
***
[main] 16:56:30,949 INFO  [org.apache.activemq.artemis.core.server] **** end #test testRepeatAndRemove()
***
[main] 16:56:30,949 INFO  [org.apache.activemq.artemis.core.server] **** start #test testIterateNoElements()
***
[main] 16:56:30,952 INFO  [org.apache.activemq.artemis.core.server] **** end #test testIterateNoElements()
***
[main] 16:56:30,952 INFO  [org.apache.activemq.artemis.core.server] **** start #test testAddAndRemove()
***
[main] 16:56:30,960 INFO  [org.apache.activemq.artemis.utils.ThreadLeakCheckRule] #test forceGC
[main] 16:56:31,015 INFO  [org.apache.activemq.artemis.utils.ThreadLeakCheckRule] #test forceGC
Done 
[main] 16:56:31,260 INFO  [org.apache.activemq.artemis.utils.ThreadLeakCheckRule] #test forceGC
[main] 16:56:32,566 INFO  [org.apache.activemq.artemis.utils.ThreadLeakCheckRule] #test forceGC
Done 
[main] 16:56:32,566 INFO  [org.apache.activemq.artemis.utils.ThreadLeakCheckRule] #test forceGC
[main] 16:56:32,673 INFO  [org.apache.activemq.artemis.utils.ThreadLeakCheckRule] #test forceGC
Done 
[main] 16:56:32,923 INFO  [org.apache.activemq.artemis.utils.ThreadLeakCheckRule] #test forceGC
[main] 16:56:33,647 INFO  [org.apache.activemq.artemis.utils.ThreadLeakCheckRule] #test forceGC
Done 
[main] 16:56:33,647 INFO  [org.apache.activemq.artemis.utils.ThreadLeakCheckRule] #test forceGC
[main] 16:56:33,770 INFO  [org.apache.activemq.artemis.utils.ThreadLeakCheckRule] #test forceGC
Done 
[main] 16:56:33,771 INFO  [org.apache.activemq.artemis.utils.ThreadLeakCheckRule] #test forceGC
[main] 16:56:33,849 INFO  [org.apache.activemq.artemis.utils.ThreadLeakCheckRule] #test forceGC
Done 
[main] 16:56:34,375 INFO  [org.apache.activemq.artemis.utils.ThreadLeakCheckRule] #test forceGC
[main] 16:56:34,476 INFO  [org.apache.activemq.artemis.utils.ThreadLeakCheckRule] #test forceGC
Done 
[main] 16:56:34,981 INFO  [org.apache.activemq.artemis.utils.ThreadLeakCheckRule] #test forceGC
[main] 16:56:35,067 INFO  [org.apache.activemq.artemis.utils.ThreadLeakCheckRule] #test forceGC
Done 
[main] 16:56:35,586 INFO  [org.apache.activemq.artemis.utils.ThreadLeakCheckRule] #test forceGC
[main] 16:56:35,689 INFO  [org.apache.activemq.artemis.utils.ThreadLeakCheckRule] #test forceGC
Done 
[main] 16:56:35,689 INFO  [org.apache.activemq.artemis.utils.ThreadLeakCheckRule] #test forceGC
[main] 16:56:35,736 INFO  [org.apache.activemq.artemis.utils.ThreadLeakCheckRule] #test forceGC
Done 
[main] 16:56:35,750 INFO  [org.apache.activemq.artemis.core.server] **** end #test testAddAndRemove()
***
[main] 16:56:35,751 INFO  [org.apache.activemq.artemis.core.server] **** start #test testRemoveHeadAndTail1()
***
[main] 16:56:35,756 INFO  [org.apache.activemq.artemis.core.server] **** end #test testRemoveHeadAndTail1()
***
[main] 16:56:35,756 INFO  [org.apache.activemq.artemis.core.server] **** start #test testRemoveHeadAndTail2()
***
[main] 16:56:35,762 INFO  [org.apache.activemq.artemis.core.server] **** end #test testRemoveHeadAndTail2()
***
[main] 16:56:35,763 INFO  [org.apache.activemq.artemis.core.server] **** start #test testRemoveHeadAndTail3()
***
[main] 16:56:35,765 INFO  [org.apache.activemq.artemis.core.server] **** end #test testRemoveHeadAndTail3()
***
[main] 16:56:35,766 INFO  [org.apache.activemq.artemis.core.server] **** start #test testRepeat()
***
[main] 16:56:35,769 INFO  [org.apache.activemq.artemis.core.server] **** end #test testRepeat()
***
[main] 16:56:35,769 INFO  [org.apache.activemq.artemis.core.server] **** start #test testCreateIteratorBeforeAddElements()
***
[main] 16:56:35,772 INFO  [org.apache.activemq.artemis.core.server] **** end #test testCreateIteratorBeforeAddElements()
***
[main] 16:56:35,772 INFO  [org.apache.activemq.artemis.core.server] **** start #test testRemoveAll()
***
[main] 16:56:35,781 INFO  [org.apache.activemq.artemis.core.server] **** end #test testRemoveAll()
***
[main] 16:56:35,781 INFO  [org.apache.activemq.artemis.core.server] **** start #test testRemoveOdd()
***
[main] 16:56:35,784 INFO  [org.apache.activemq.artemis.core.server] **** end #test testRemoveOdd()
***
[main] 16:56:35,785 INFO  [org.apache.activemq.artemis.core.server] **** start #test testIterateThenAddMoreAndIterateAgain()
***
[main] 16:56:35,788 INFO  [org.apache.activemq.artemis.core.server] **** end #test testIterateThenAddMoreAndIterateAgain()
***
Tests run: 29, Failures: 0, Errors: 0, Skipped: 0, Time elapsed: 5.113 sec - in org.apache.activemq.artemis.tests.unit.util.LinkedListTest
Running org.apache.activemq.artemis.tests.unit.util.MemorySizeTest
[main] 16:56:44,294 WARN  [org.apache.activemq.artemis.core.client] AMQ212047: Warning: JVM
allocated more data what would make results invalid 2,217,738,240:1,750,597,632
[main] 16:56:44,294 INFO  [org.apache.activemq.artemis.tests.unit] Server message size is
1184
[main] 16:56:52,642 WARN  [org.apache.activemq.artemis.core.client] AMQ212047: Warning: JVM
allocated more data what would make results invalid 1,750,597,632:1,870,659,584
[main] 16:56:52,642 INFO  [org.apache.activemq.artemis.tests.unit] Message reference size
is 64
Tests run: 1, Failures: 0, Errors: 0, Skipped: 0, Time elapsed: 16.852 sec - in org.apache.activemq.artemis.tests.unit.util.MemorySizeTest
Running org.apache.activemq.artemis.tests.unit.util.ObjectInputStreamWithClassLoaderTest
[main] 16:56:52,644 INFO  [org.apache.activemq.artemis.core.server] **** start #test testClassLoaderIsolationWithProxy()
***
Deserialized Object org.apache.activemq.artemis.tests.unit.util.ObjectInputStreamWithClassLoaderTest$AnObjectImpl@24fabd0f
[main] 16:56:52,719 INFO  [org.apache.activemq.artemis.core.server] **** end #test testClassLoaderIsolationWithProxy()
***
[main] 16:56:52,719 INFO  [org.apache.activemq.artemis.core.server] **** start #test testWhiteBlackListAgainstListObject()
***
[main] 16:56:52,734 INFO  [org.apache.activemq.artemis.core.server] **** end #test testWhiteBlackListAgainstListObject()
***
[main] 16:56:52,734 INFO  [org.apache.activemq.artemis.core.server] **** start #test testWhiteBlackListAgainstArrayObject()
***
[main] 16:56:52,740 INFO  [org.apache.activemq.artemis.core.server] **** end #test testWhiteBlackListAgainstArrayObject()
***
[main] 16:56:52,741 INFO  [org.apache.activemq.artemis.core.server] **** start #test testWhiteBlackListAnonymousObject()
***
[main] 16:56:52,754 INFO  [org.apache.activemq.artemis.core.server] **** end #test testWhiteBlackListAnonymousObject()
***
[main] 16:56:52,755 INFO  [org.apache.activemq.artemis.core.server] **** start #test testWhiteBlackListLocalObject()
***
[main] 16:56:52,765 INFO  [org.apache.activemq.artemis.core.server] **** end #test testWhiteBlackListLocalObject()
***
[main] 16:56:52,766 INFO  [org.apache.activemq.artemis.core.server] **** start #test testWhiteBlackListSystemProperty()
***
[main] 16:56:52,772 INFO  [org.apache.activemq.artemis.core.server] **** end #test testWhiteBlackListSystemProperty()
***
[main] 16:56:52,772 INFO  [org.apache.activemq.artemis.core.server] **** start #test testClassLoaderIsolation()
***
[main] 16:56:52,790 INFO  [org.apache.activemq.artemis.core.server] **** end #test testClassLoaderIsolation()
***
[main] 16:56:52,790 INFO  [org.apache.activemq.artemis.core.server] **** start #test testWhiteBlackList()
***
[main] 16:56:52,799 INFO  [org.apache.activemq.artemis.core.server] **** end #test testWhiteBlackList()
***
[main] 16:56:52,800 INFO  [org.apache.activemq.artemis.core.server] **** start #test testWhiteBlackListAgainstListMapObject()
***
[main] 16:56:52,811 INFO  [org.apache.activemq.artemis.core.server] **** end #test testWhiteBlackListAgainstListMapObject()
***
Tests run: 9, Failures: 0, Errors: 0, Skipped: 0, Time elapsed: 0.165 sec - in org.apache.activemq.artemis.tests.unit.util.ObjectInputStreamWithClassLoaderTest
Running org.apache.activemq.artemis.tests.unit.util.ReusableLatchTest
[main] 16:56:52,813 INFO  [org.apache.activemq.artemis.core.server] **** start #test testLatchWithParameterizedDown()
***
[main] 16:56:52,818 INFO  [org.apache.activemq.artemis.core.server] **** end #test testLatchWithParameterizedDown()
***
[main] 16:56:52,819 INFO  [org.apache.activemq.artemis.core.server] **** start #test testLatchOnSingleThread()
***
[main] 16:56:52,824 INFO  [org.apache.activemq.artemis.core.server] **** end #test testLatchOnSingleThread()
***
[main] 16:56:52,824 INFO  [org.apache.activemq.artemis.core.server] **** start #test testReuseLatch()
***
[main] 16:56:52,838 INFO  [org.apache.activemq.artemis.core.server] **** end #test testReuseLatch()
***
[main] 16:56:52,838 INFO  [org.apache.activemq.artemis.core.server] **** start #test testLatchOnMultiThread()
***
[main] 16:56:52,925 INFO  [org.apache.activemq.artemis.core.server] **** end #test testLatchOnMultiThread()
***
Tests run: 4, Failures: 0, Errors: 0, Skipped: 0, Time elapsed: 0.113 sec - in org.apache.activemq.artemis.tests.unit.util.ReusableLatchTest
Running org.apache.activemq.artemis.tests.unit.util.SoftValueMapTest
[main] 16:56:52,925 INFO  [org.apache.activemq.artemis.core.server] **** start #test testEvictionsLeastUsed()
***
[main] 16:56:52,927 INFO  [org.apache.activemq.artemis.utils.ThreadLeakCheckRule] #test forceGC
[main] 16:56:53,018 INFO  [org.apache.activemq.artemis.utils.ThreadLeakCheckRule] #test forceGC
Done 
SoftCache.size 200
Soft cache has 200 elements
[main] 16:56:53,027 INFO  [org.apache.activemq.artemis.core.server] **** end #test testEvictionsLeastUsed()
***
[main] 16:56:53,027 INFO  [org.apache.activemq.artemis.core.server] **** start #test testEvictions()
***
[main] 16:56:53,029 INFO  [org.apache.activemq.artemis.utils.ThreadLeakCheckRule] #test forceGC
[main] 16:56:53,073 INFO  [org.apache.activemq.artemis.utils.ThreadLeakCheckRule] #test forceGC
Done 
SUREFIRE-859: Java HotSpot(TM) 64-Bit Server VM warning: INFO: os::commit_memory(0x000000073a180000,
685768704, 0) failed; error='Cannot allocate memory' (errno=12)
#
# There is insufficient memory for the Java Runtime Environment to continue.
# Native memory allocation (mmap) failed to map 685768704 bytes for committing reserved memory.
# An error report file with more information is saved as:
# <https://builds.apache.org/job/ActiveMQ-Artemis-Master/ws/tests/unit-tests/hs_err_pid12604.log>

Results :

Tests run: 616, Failures: 0, Errors: 0, Skipped: 0

[INFO] ------------------------------------------------------------------------
[INFO] Reactor Summary:
[INFO] 
[INFO] ActiveMQ Artemis Parent ............................ SUCCESS [  6.130 s]
[INFO] ActiveMQ Artemis Commons ........................... SUCCESS [ 19.381 s]
[INFO] ActiveMQ Artemis Core Client ....................... SUCCESS [  8.750 s]
[INFO] ActiveMQ Artemis Selector Implementation ........... SUCCESS [  2.617 s]
[INFO] ActiveMQ Artemis JMS Client ........................ SUCCESS [  3.030 s]
[INFO] ActiveMQ Artemis Native POM ........................ SUCCESS [  4.948 s]
[INFO] ActiveMQ Artemis Journal ........................... SUCCESS [  2.307 s]
[INFO] ActiveMQ Artemis JDBC Store ........................ SUCCESS [  5.153 s]
[INFO] ActiveMQ Artemis Server ............................ SUCCESS [01:27 min]
[INFO] ActiveMQ Artemis Protocols ......................... SUCCESS [  0.145 s]
[INFO] ActiveMQ Artemis AMQP Protocol ..................... SUCCESS [  3.803 s]
[INFO] ActiveMQ Artemis STOMP Protocol .................... SUCCESS [  1.580 s]
[INFO] ActiveMQ Artemis OpenWire Protocol ................. SUCCESS [  2.874 s]
[INFO] ActiveMQ Artemis HQClient Protocol ................. SUCCESS [  0.941 s]
[INFO] ActiveMQ Artemis HornetQ Protocol .................. SUCCESS [  1.199 s]
[INFO] ActiveMQ Artemis MQTT Protocol ..................... SUCCESS [  2.243 s]
[INFO] ActiveMQ Artemis DTO ............................... SUCCESS [  2.540 s]
[INFO] ActiveMQ Artemis Service Extensions ................ SUCCESS [  1.185 s]
[INFO] ActiveMQ Artemis JMS Server ........................ SUCCESS [  1.166 s]
[INFO] ActiveMQ Artemis CDI Integration ................... SUCCESS [  4.209 s]
[INFO] ActiveMQ Artemis Boot .............................. SUCCESS [  0.183 s]
[INFO] ActiveMQ Artemis Tools ............................. SUCCESS [  0.632 s]
[INFO] ActiveMQ Artemis CLI ............................... SUCCESS [ 25.228 s]
[INFO] ActiveMQ Artemis Web ............................... SUCCESS [  4.731 s]
[INFO] ActiveMQ Artemis Web ............................... SUCCESS [01:14 min]
[INFO] ActiveMQ Artemis Core Client All ................... SUCCESS [ 15.434 s]
[INFO] ActiveMQ Artemis Client OSGi ....................... SUCCESS [  2.311 s]
[INFO] ActiveMQ Artemis JUnit Rules ....................... SUCCESS [ 13.336 s]
[INFO] ActiveMQ Artemis JMS Client All .................... SUCCESS [ 10.204 s]
[INFO] ActiveMQ Artemis JMS Client OSGi ................... SUCCESS [  1.232 s]
[INFO] ActiveMQ Artemis RAR POM ........................... SUCCESS [  1.754 s]
[INFO] ActiveMQ Artemis REST Interface Implementation ..... SUCCESS [  3.492 s]
[INFO] ActiveMQ Artemis Maven Plugin ...................... SUCCESS [  2.197 s]
[INFO] ActiveMQ Artemis Server OSGi ....................... SUCCESS [  8.341 s]
[INFO] ActiveMQ Artemis Cons .............................. SUCCESS [  0.088 s]
[INFO] ActiveMQ Artemis HawtIO Branding ................... SUCCESS [  3.736 s]
[INFO] ActiveMQ Artemis HawtIO Plugin ..................... SUCCESS [  0.409 s]
[INFO] ActiveMQ Artemis Console ........................... SUCCESS [  3.529 s]
[INFO] ActiveMQ Artemis Spring Integration ................ SUCCESS [  0.614 s]
[INFO] Apache ActiveMQ Artemis Distribution ............... SUCCESS [ 22.065 s]
[INFO] ActiveMQ Artemis Tests POM ......................... SUCCESS [  0.684 s]
[INFO] ActiveMQ Artemis Test Support ...................... SUCCESS [  1.643 s]
[INFO] ActiveMQ Artemis Unit Tests ........................ FAILURE [02:08 min]
[INFO] ActiveMQ Artemis Joram Tests ....................... SKIPPED
[INFO] ActiveMQ Artemis timing Tests ...................... SKIPPED
[INFO] ActiveMQ Artemis JMS Tests ......................... SKIPPED
[INFO] ActiveMQ Artemis Features .......................... SKIPPED
[INFO] ActiveMQ Artemis Integration Tests ................. SKIPPED
[INFO] ActiveMQ Artemis Client Integration Tests .......... SKIPPED
[INFO] ActiveMQ Artemis Compatibility Tests ............... SKIPPED
[INFO] ActiveMQ Artemis soak Tests ........................ SKIPPED
[INFO] ActiveMQ Artemis stress Tests ...................... SKIPPED
[INFO] ActiveMQ Artemis performance Tests ................. SKIPPED
[INFO] Smoke Tests ........................................ SKIPPED
[INFO] ActiveMQ Artemis Extra Tests ....................... SKIPPED
[INFO] ------------------------------------------------------------------------
[INFO] BUILD FAILURE
[INFO] ------------------------------------------------------------------------
[INFO] Total time: 08:09 min
[INFO] Finished at: 2018-04-10T16:56:54+00:00
[INFO] Final Memory: 269M/1669M
[INFO] ------------------------------------------------------------------------
[ERROR] Failed to execute goal org.apache.maven.plugins:maven-surefire-plugin:2.18.1:test
(default-test) on project unit-tests: Execution default-test of goal org.apache.maven.plugins:maven-surefire-plugin:2.18.1:test
failed: The forked VM terminated without properly saying goodbye. VM crash or System.exit
called?
[ERROR] Command was /bin/sh -c cd <https://builds.apache.org/job/ActiveMQ-Artemis-Master/ws/tests/unit-tests>
&& /usr/local/asfpackages/java/jdk1.8.0_152/jre/bin/java -Djava.util.logging.manager=org.jboss.logmanager.LogManager
-Dlogging.configuration=<https://builds.apache.org/job/ActiveMQ-Artemis-Master/ws/tests/unit-tests/../../tests/config/logging.properties>
-Djava.library.path=<https://builds.apache.org/job/ActiveMQ-Artemis-Master/ws/tests/unit-tests/../../artemis-native/bin>
-Djgroups.bind_addr=localhost -Dorg.apache.activemq.artemis.api.core.UDPBroadcastEndpointFactory.localBindAddress=localhost
-Djava.net.preferIPv4Stack=true -Dbasedir=<https://builds.apache.org/job/ActiveMQ-Artemis-Master/ws/tests/unit-tests>
-jar <https://builds.apache.org/job/ActiveMQ-Artemis-Master/ws/tests/unit-tests/target/surefire/surefirebooter246107106170054167.jar>
<https://builds.apache.org/job/ActiveMQ-Artemis-Master/ws/tests/unit-tests/target/surefire/surefire2193055827040546590tmp>
<https://builds.apache.org/job/ActiveMQ-Artemis-Master/ws/tests/unit-tests/target/surefire/surefire_151929437403165877325tmp>
[ERROR] -> [Help 1]
[ERROR] 
[ERROR] To see the full stack trace of the errors, re-run Maven with the -e switch.
[ERROR] Re-run Maven using the -X switch to enable full debug logging.
[ERROR] 
[ERROR] For more information about the errors and possible solutions, please read the following
articles:
[ERROR] [Help 1] http://cwiki.apache.org/confluence/display/MAVEN/PluginExecutionException
[ERROR] 
[ERROR] After correcting the problems, you can resume the build with the command
[ERROR]   mvn <goals> -rf :unit-tests
Build step 'Invoke top-level Maven targets' marked build as failure
Performing Post build task...
Could not match :Too many files with unapproved license  : False
Logical operation result is FALSE
Skipping script  : cat ratReport.txt
END OF POST BUILD TASK 	: 0
Recording test results
Not sending mail to unregistered user christopher.l.shannon@gmail.com

Mime
View raw message