activemq-commits mailing list archives

Site index · List index
Message view « Date » · « Thread »
Top « Date » · « Thread »
From Apache Jenkins Server <jenk...@builds.apache.org>
Subject Build failed in Jenkins: ActiveMQ-Artemis-Master #1757
Date Tue, 17 Apr 2018 15:14:07 GMT
See <https://builds.apache.org/job/ActiveMQ-Artemis-Master/1757/display/redirect?page=changes>

Changes:

[clebertsuconic] ARTEMIS-1788 JDBC HA should use JDBC Network Timeout

[clebertsuconic] ARTEMIS-1653 Allow database tables to be created externally

[clebertsuconic] ARTEMIS-1810 JDBCSequentialFileFactoryDriver should check <=0 read

[clebertsuconic] NO-JIRA: Fix test regression

[clebertsuconic] ARTEMIS-1808 LargeServerMessageImpl leaks direct ByteBuffer

------------------------------------------
[...truncated 301.25 KB...]
[main] 15:08:32,214 INFO  [org.apache.activemq.artemis.core.server] AMQ221002: Apache ActiveMQ
Artemis Message Broker version 2.6.0-SNAPSHOT [31510e74-4251-11e8-bdd7-02425a5578ee] stopped,
uptime 0.016 seconds
[main] 15:08:32,214 INFO  [org.apache.activemq.artemis.core.server] AMQ221000: live Message
Broker is starting with configuration Broker Configuration (clustered=false,journalDirectory=target/data/journal,bindingsDirectory=data/bindings,largeMessagesDirectory=data/largemessages,pagingDirectory=data/paging)
[main] 15:08:32,215 INFO  [org.apache.activemq.artemis.core.server] AMQ221043: Protocol module
found: [artemis-server]. Adding protocol support for: CORE
[main] 15:08:32,220 INFO  [org.apache.activemq.artemis.core.server] AMQ221007: Server is now
live
[main] 15:08:32,220 INFO  [org.apache.activemq.artemis.core.server] AMQ221001: Apache ActiveMQ
Artemis Message Broker version 2.6.0-SNAPSHOT [localhost, nodeID=31537f76-4251-11e8-bdd7-02425a5578ee]

[main] 15:08:32,222 INFO  [org.apache.activemq.artemis.core.server] AMQ221002: Apache ActiveMQ
Artemis Message Broker version 2.6.0-SNAPSHOT [31537f76-4251-11e8-bdd7-02425a5578ee] stopped,
uptime 0.008 seconds
[main] 15:08:32,222 INFO  [org.apache.activemq.artemis.core.server] AMQ221000: live Message
Broker is starting with configuration Broker Configuration (clustered=false,journalDirectory=target/data/journal,bindingsDirectory=data/bindings,largeMessagesDirectory=data/largemessages,pagingDirectory=data/paging)
[main] 15:08:32,222 INFO  [org.apache.activemq.artemis.core.server] AMQ221043: Protocol module
found: [artemis-server]. Adding protocol support for: CORE
[main] 15:08:32,228 INFO  [org.apache.activemq.artemis.core.server] AMQ221007: Server is now
live
[main] 15:08:32,228 INFO  [org.apache.activemq.artemis.core.server] AMQ221001: Apache ActiveMQ
Artemis Message Broker version 2.6.0-SNAPSHOT [localhost, nodeID=3154b7f7-4251-11e8-bdd7-02425a5578ee]

[main] 15:08:32,229 INFO  [org.apache.activemq.artemis.core.server] AMQ221002: Apache ActiveMQ
Artemis Message Broker version 2.6.0-SNAPSHOT [3154b7f7-4251-11e8-bdd7-02425a5578ee] stopped,
uptime 0.007 seconds
Tests run: 2, Failures: 0, Errors: 0, Skipped: 0, Time elapsed: 0.032 sec - in org.apache.activemq.artemis.core.server.impl.EmbeddedServerTest
Running org.apache.activemq.artemis.core.server.impl.ScheduledDeliveryHandlerTest
Tests run: 6, Failures: 0, Errors: 0, Skipped: 0, Time elapsed: 1.033 sec - in org.apache.activemq.artemis.core.server.impl.ScheduledDeliveryHandlerTest
Running org.apache.activemq.artemis.core.server.impl.jdbc.JdbcLeaseLockTest
[main] 15:08:33,265 INFO  [org.apache.activemq.artemis.core.server] **** start #test shouldRenewExpiredLockNotAcquiredByOthers[create_tables_prior_test]()
***
[main] 15:08:45,076 INFO  [org.apache.activemq.artemis.core.server] **** end #test shouldRenewExpiredLockNotAcquiredByOthers[create_tables_prior_test]()
***
[main] 15:08:45,077 INFO  [org.apache.activemq.artemis.core.server] **** start #test shouldNotCorruptGuardedState[create_tables_prior_test]()
***
[main] 15:08:54,673 INFO  [org.apache.activemq.artemis.core.server] **** end #test shouldNotCorruptGuardedState[create_tables_prior_test]()
***
[main] 15:08:54,674 INFO  [org.apache.activemq.artemis.core.server] **** start #test shouldNotRenewLockAcquiredByOthers[create_tables_prior_test]()
***
[main] 15:09:04,957 WARN  [org.apache.activemq.artemis.core.server.impl.jdbc.JdbcLeaseLock]
668afae9-da0d-4168-b793-80ef490354d9 has failed to release a lock
[main] 15:09:06,261 INFO  [org.apache.activemq.artemis.core.server] **** end #test shouldNotRenewLockAcquiredByOthers[create_tables_prior_test]()
***
[main] 15:09:06,261 INFO  [org.apache.activemq.artemis.core.server] **** start #test shouldNotAcquireLockWhenAlreadyHeldByOthers[create_tables_prior_test]()
***
[main] 15:09:15,041 INFO  [org.apache.activemq.artemis.core.server] **** end #test shouldNotAcquireLockWhenAlreadyHeldByOthers[create_tables_prior_test]()
***
[main] 15:09:15,042 INFO  [org.apache.activemq.artemis.core.server] **** start #test shouldNotRenewReleasedLock[create_tables_prior_test]()
***
[main] 15:09:24,197 INFO  [org.apache.activemq.artemis.core.server] **** end #test shouldNotRenewReleasedLock[create_tables_prior_test]()
***
[main] 15:09:24,197 INFO  [org.apache.activemq.artemis.core.server] **** start #test shouldOtherAcquireExpiredLock[create_tables_prior_test]()
***
[main] 15:09:36,522 WARN  [org.apache.activemq.artemis.core.server.impl.jdbc.JdbcLeaseLock]
e54c05f3-e115-4443-8b4c-69d4b5dd7ce2 has failed to release a lock
[main] 15:09:37,575 INFO  [org.apache.activemq.artemis.core.server] **** end #test shouldOtherAcquireExpiredLock[create_tables_prior_test]()
***
[main] 15:09:37,576 INFO  [org.apache.activemq.artemis.core.server] **** start #test shouldRenewAcquiredLock[create_tables_prior_test]()
***
[main] 15:09:47,724 INFO  [org.apache.activemq.artemis.core.server] **** end #test shouldRenewAcquiredLock[create_tables_prior_test]()
***
[main] 15:09:47,725 INFO  [org.apache.activemq.artemis.core.server] **** start #test shouldAcquireLock[create_tables_prior_test]()
***
[main] 15:09:58,035 INFO  [org.apache.activemq.artemis.core.server] **** end #test shouldAcquireLock[create_tables_prior_test]()
***
[main] 15:09:58,036 INFO  [org.apache.activemq.artemis.core.server] **** start #test shouldNotAcquireLockTwice[create_tables_prior_test]()
***
[main] 15:10:07,482 INFO  [org.apache.activemq.artemis.core.server] **** end #test shouldNotAcquireLockTwice[create_tables_prior_test]()
***
[main] 15:10:07,483 INFO  [org.apache.activemq.artemis.core.server] **** start #test shouldAcquireExpiredLock[create_tables_prior_test]()
***
[main] 15:10:20,859 INFO  [org.apache.activemq.artemis.core.server] **** end #test shouldAcquireExpiredLock[create_tables_prior_test]()
***
[main] 15:10:20,859 INFO  [org.apache.activemq.artemis.core.server] **** start #test shouldRenewExpiredLockNotAcquiredByOthers[create_tables_prior_test]()
***
[main] 15:10:32,791 INFO  [org.apache.activemq.artemis.core.server] **** end #test shouldRenewExpiredLockNotAcquiredByOthers[create_tables_prior_test]()
***
[main] 15:10:32,792 INFO  [org.apache.activemq.artemis.core.server] **** start #test shouldNotCorruptGuardedState[create_tables_prior_test]()
***
[main] 15:10:43,082 INFO  [org.apache.activemq.artemis.core.server] **** end #test shouldNotCorruptGuardedState[create_tables_prior_test]()
***
[main] 15:10:43,083 INFO  [org.apache.activemq.artemis.core.server] **** start #test shouldNotRenewLockAcquiredByOthers[create_tables_prior_test]()
***
[main] 15:11:05,219 WARN  [org.apache.activemq.artemis.core.server.impl.jdbc.JdbcLeaseLock]
9b8e0273-5024-4dd3-945b-6a779fad4a32 has failed to release a lock
[main] 15:11:09,816 INFO  [org.apache.activemq.artemis.core.server] **** end #test shouldNotRenewLockAcquiredByOthers[create_tables_prior_test]()
***
[main] 15:11:09,817 INFO  [org.apache.activemq.artemis.core.server] **** start #test shouldNotAcquireLockWhenAlreadyHeldByOthers[create_tables_prior_test]()
***
[main] 15:11:51,511 INFO  [org.apache.activemq.artemis.core.server] **** end #test shouldNotAcquireLockWhenAlreadyHeldByOthers[create_tables_prior_test]()
***
[main] 15:11:51,512 INFO  [org.apache.activemq.artemis.core.server] **** start #test shouldNotRenewReleasedLock[create_tables_prior_test]()
***
[main] 15:12:12,354 INFO  [org.apache.activemq.artemis.core.server] **** end #test shouldNotRenewReleasedLock[create_tables_prior_test]()
***
[main] 15:12:12,355 INFO  [org.apache.activemq.artemis.core.server] **** start #test shouldOtherAcquireExpiredLock[create_tables_prior_test]()
***
[main] 15:12:28,861 WARN  [org.apache.activemq.artemis.core.server.impl.jdbc.JdbcLeaseLock]
5b0d0000-dcbd-43fd-a3ff-a99d4b51d538 has failed to release a lock
[main] 15:12:31,634 INFO  [org.apache.activemq.artemis.core.server] **** end #test shouldOtherAcquireExpiredLock[create_tables_prior_test]()
***
[main] 15:12:31,634 INFO  [org.apache.activemq.artemis.core.server] **** start #test shouldRenewAcquiredLock[create_tables_prior_test]()
***
[main] 15:12:47,360 INFO  [org.apache.activemq.artemis.core.server] **** end #test shouldRenewAcquiredLock[create_tables_prior_test]()
***
[main] 15:12:47,361 INFO  [org.apache.activemq.artemis.core.server] **** start #test shouldAcquireLock[create_tables_prior_test]()
***
[main] 15:13:02,683 INFO  [org.apache.activemq.artemis.core.server] **** end #test shouldAcquireLock[create_tables_prior_test]()
***
[main] 15:13:02,683 INFO  [org.apache.activemq.artemis.core.server] **** start #test shouldNotAcquireLockTwice[create_tables_prior_test]()
***
[main] 15:13:15,188 INFO  [org.apache.activemq.artemis.core.server] **** end #test shouldNotAcquireLockTwice[create_tables_prior_test]()
***
[main] 15:13:15,190 INFO  [org.apache.activemq.artemis.core.server] **** start #test shouldAcquireExpiredLock[create_tables_prior_test]()
***
[main] 15:13:25,985 INFO  [org.apache.activemq.artemis.core.server] **** end #test shouldAcquireExpiredLock[create_tables_prior_test]()
***
Tests run: 20, Failures: 0, Errors: 0, Skipped: 0, Time elapsed: 292.723 sec - in org.apache.activemq.artemis.core.server.impl.jdbc.JdbcLeaseLockTest
Running org.apache.activemq.artemis.core.server.impl.jdbc.JdbcSharedStateManagerTest
[main] 15:13:25,987 INFO  [org.apache.activemq.artemis.core.server] **** start #test shouldStartTwoIfTableNotExist()
***
[main] 15:13:37,097 INFO  [org.apache.activemq.artemis.core.server] **** end #test shouldStartTwoIfTableNotExist()
***
[main] 15:13:37,104 INFO  [org.apache.activemq.artemis.core.server] **** start #test shouldStartIfTableNotExist()
***
[main] 15:13:45,429 INFO  [org.apache.activemq.artemis.core.server] **** end #test shouldStartIfTableNotExist()
***
[main] 15:13:45,430 INFO  [org.apache.activemq.artemis.core.server] **** start #test shouldStartIfTableExistInitialized()
***
[main] 15:13:53,810 INFO  [org.apache.activemq.artemis.core.server] **** end #test shouldStartIfTableExistInitialized()
***
[main] 15:13:53,810 INFO  [org.apache.activemq.artemis.core.server] **** start #test shouldStartIfTableExistEmpty()
***
[main] 15:14:04,488 INFO  [org.apache.activemq.artemis.core.server] **** end #test shouldStartIfTableExistEmpty()
***
Tests run: 4, Failures: 0, Errors: 1, Skipped: 0, Time elapsed: 38.503 sec <<< FAILURE!
- in org.apache.activemq.artemis.core.server.impl.jdbc.JdbcSharedStateManagerTest
shouldStartTwoIfTableNotExist(org.apache.activemq.artemis.core.server.impl.jdbc.JdbcSharedStateManagerTest)
 Time elapsed: 11.118 sec  <<< ERROR!
java.lang.Exception: test timed out after 10000 milliseconds
	at java.io.FileDescriptor.sync(Native Method)
	at org.apache.derby.impl.io.DirRandomAccessFile.sync(Unknown Source)
	at org.apache.derby.impl.store.raw.data.RAFContainer.writeRAFHeader(Unknown Source)
	at org.apache.derby.impl.store.raw.data.RAFContainer.run(Unknown Source)
	at java.security.AccessController.doPrivileged(Native Method)
	at org.apache.derby.impl.store.raw.data.RAFContainer.stubbify(Unknown Source)
	at org.apache.derby.impl.store.raw.data.RAFContainer.removeContainer(Unknown Source)
	at org.apache.derby.impl.store.raw.data.BaseContainerHandle.removeContainer(Unknown Source)
	at org.apache.derby.impl.store.raw.data.ContainerOperation.doMe(Unknown Source)
	at org.apache.derby.impl.store.raw.log.FileLogger.logAndDo(Unknown Source)
	at org.apache.derby.impl.store.raw.xact.Xact.logAndDo(Unknown Source)
	at org.apache.derby.impl.store.raw.data.ReclaimSpaceHelper.reclaimContainer(Unknown Source)
	at org.apache.derby.impl.store.raw.data.ReclaimSpaceHelper.reclaimSpace(Unknown Source)
	at org.apache.derby.impl.store.raw.data.BaseDataFileFactory.reclaimSpace(Unknown Source)
	at org.apache.derby.impl.store.raw.data.ReclaimSpace.performWork(Unknown Source)
	at org.apache.derby.impl.store.raw.xact.Xact.postTermination(Unknown Source)
	at org.apache.derby.impl.store.raw.xact.Xact.completeCommit(Unknown Source)
	at org.apache.derby.impl.store.raw.xact.Xact.commit(Unknown Source)
	at org.apache.derby.impl.store.raw.xact.Xact.commit(Unknown Source)
	at org.apache.derby.impl.store.access.RAMTransaction.commit(Unknown Source)
	at org.apache.derby.impl.sql.conn.GenericLanguageConnectionContext.doCommit(Unknown Source)
	at org.apache.derby.impl.sql.conn.GenericLanguageConnectionContext.userCommit(Unknown Source)
	at org.apache.derby.impl.jdbc.TransactionResourceImpl.commit(Unknown Source)
	at org.apache.derby.impl.jdbc.EmbedConnection.commit(Unknown Source)
	at org.apache.activemq.artemis.jdbc.store.drivers.AbstractJDBCDriver.destroy(AbstractJDBCDriver.java:168)
	at org.apache.activemq.artemis.core.server.impl.jdbc.JdbcSharedStateManagerTest.shouldStartTwoIfTableNotExist(JdbcSharedStateManagerTest.java:103)

Running org.apache.activemq.artemis.core.server.management.JMXAccessControlListTest
Tests run: 14, Failures: 0, Errors: 0, Skipped: 0, Time elapsed: 0.002 sec - in org.apache.activemq.artemis.core.server.management.JMXAccessControlListTest
Running org.apache.activemq.artemis.core.settings.AddressSettingsTest
[main] 15:14:04,495 INFO  [org.apache.activemq.artemis.core.server] **** start #test testMultipleMergeAll()
***
[main] 15:14:04,497 INFO  [org.apache.activemq.artemis.core.server] **** end #test testMultipleMergeAll()
***
[main] 15:14:04,497 INFO  [org.apache.activemq.artemis.core.server] **** start #test testMultipleMerge()
***
[main] 15:14:04,499 INFO  [org.apache.activemq.artemis.core.server] **** end #test testMultipleMerge()
***
[main] 15:14:04,499 INFO  [org.apache.activemq.artemis.core.server] **** start #test testDefaults()
***
[main] 15:14:04,502 INFO  [org.apache.activemq.artemis.core.server] **** end #test testDefaults()
***
[main] 15:14:04,503 INFO  [org.apache.activemq.artemis.core.server] **** start #test testSingleMerge()
***
[main] 15:14:04,505 INFO  [org.apache.activemq.artemis.core.server] **** end #test testSingleMerge()
***
Tests run: 4, Failures: 0, Errors: 0, Skipped: 0, Time elapsed: 0.01 sec - in org.apache.activemq.artemis.core.settings.AddressSettingsTest
Running org.apache.activemq.artemis.core.settings.RepositoryTest
[main] 15:14:04,506 INFO  [org.apache.activemq.artemis.core.server] **** start #test testMultipleWildcards()
***
[main] 15:14:04,510 INFO  [org.apache.activemq.artemis.core.server] **** end #test testMultipleWildcards()
***
[main] 15:14:04,511 INFO  [org.apache.activemq.artemis.core.server] **** start #test testMatchingDocs()
***
[main] 15:14:04,513 INFO  [org.apache.activemq.artemis.core.server] **** end #test testMatchingDocs()
***
[main] 15:14:04,513 INFO  [org.apache.activemq.artemis.core.server] **** start #test testWithoutWildcard()
***
[main] 15:14:04,515 INFO  [org.apache.activemq.artemis.core.server] **** end #test testWithoutWildcard()
***
[main] 15:14:04,515 INFO  [org.apache.activemq.artemis.core.server] **** start #test testSingletwo()
***
[main] 15:14:04,517 INFO  [org.apache.activemq.artemis.core.server] **** end #test testSingletwo()
***
[main] 15:14:04,517 INFO  [org.apache.activemq.artemis.core.server] **** start #test testIllegalMatches()
***
[main] 15:14:04,519 INFO  [org.apache.activemq.artemis.core.server] **** end #test testIllegalMatches()
***
[main] 15:14:04,519 INFO  [org.apache.activemq.artemis.core.server] **** start #test testAddListener()
***
[main] 15:14:04,522 INFO  [org.apache.activemq.artemis.core.server] **** end #test testAddListener()
***
[main] 15:14:04,522 INFO  [org.apache.activemq.artemis.core.server] **** start #test testDefault()
***
[main] 15:14:04,523 INFO  [org.apache.activemq.artemis.core.server] **** end #test testDefault()
***
[main] 15:14:04,524 INFO  [org.apache.activemq.artemis.core.server] **** start #test testMatchingDocsCustomUnderscorDelimiter()
***
[main] 15:14:04,525 INFO  [org.apache.activemq.artemis.core.server] **** end #test testMatchingDocsCustomUnderscorDelimiter()
***
[main] 15:14:04,525 INFO  [org.apache.activemq.artemis.core.server] **** start #test testSingleMatch()
***
[main] 15:14:04,527 INFO  [org.apache.activemq.artemis.core.server] **** end #test testSingleMatch()
***
[main] 15:14:04,527 INFO  [org.apache.activemq.artemis.core.server] **** start #test testRepositoryMerge()
***
[main] 15:14:04,530 INFO  [org.apache.activemq.artemis.core.server] **** end #test testRepositoryMerge()
***
[main] 15:14:04,530 INFO  [org.apache.activemq.artemis.core.server] **** start #test testMatchingDocsCustomForwardSlashDelimiter()
***
[main] 15:14:04,532 INFO  [org.apache.activemq.artemis.core.server] **** end #test testMatchingDocsCustomForwardSlashDelimiter()
***
Tests run: 11, Failures: 0, Errors: 0, Skipped: 0, Time elapsed: 0.026 sec - in org.apache.activemq.artemis.core.settings.RepositoryTest
Running org.apache.activemq.artemis.core.transaction.impl.TransactionImplTest
[main] 15:14:04,533 INFO  [org.apache.activemq.artemis.core.server] **** start #test testTimeoutThenRollbackWithRollback()
***
rollback...
[main] 15:14:04,541 INFO  [org.apache.activemq.artemis.core.server] **** end #test testTimeoutThenRollbackWithRollback()
***
[main] 15:14:04,541 INFO  [org.apache.activemq.artemis.core.server] **** start #test testTimeoutAndThenCommitWithARollback()
***
rollback...
[main] 15:14:04,544 INFO  [org.apache.activemq.artemis.core.server] **** end #test testTimeoutAndThenCommitWithARollback()
***
Tests run: 2, Failures: 0, Errors: 0, Skipped: 0, Time elapsed: 0.012 sec - in org.apache.activemq.artemis.core.transaction.impl.TransactionImplTest
Running org.apache.activemq.artemis.core.version.impl.VersionImplTest
Tests run: 3, Failures: 0, Errors: 0, Skipped: 0, Time elapsed: 0.002 sec - in org.apache.activemq.artemis.core.version.impl.VersionImplTest
Running org.apache.activemq.artemis.spi.core.security.jaas.Krb5LoginModuleTest
Tests run: 2, Failures: 0, Errors: 0, Skipped: 0, Time elapsed: 0.002 sec - in org.apache.activemq.artemis.spi.core.security.jaas.Krb5LoginModuleTest
Running org.apache.activemq.artemis.tests.util.SimpleStringTest
Tests run: 20, Failures: 0, Errors: 0, Skipped: 0, Time elapsed: 0.275 sec - in org.apache.activemq.artemis.tests.util.SimpleStringTest
Running org.apache.activemq.artemis.uri.AcceptorParserTest
config:TransportConfiguration(name=test, factory=org-apache-activemq-artemis-core-remoting-impl-netty-NettyAcceptorFactory)
?tcpReceiveBufferSize=1048576&port=8080&host=localhost&protocols=openwire&tcpSendBufferSize=1048576&banana=x
config:TransportConfiguration(name=test, factory=org-apache-activemq-artemis-core-remoting-impl-netty-NettyAcceptorFactory)
?tcpReceiveBufferSize=1048576&port=5672&host=0-0-0-0&tcpSendBufferSize=1048576&virtualTopicConsumerWildcards=Consumer-*->;2
Consumer.*.>;2
Tests run: 2, Failures: 0, Errors: 0, Skipped: 0, Time elapsed: 0.001 sec - in org.apache.activemq.artemis.uri.AcceptorParserTest
Running org.apache.activemq.artemis.uri.ClusterConnectionConfigurationTest
Tests run: 5, Failures: 0, Errors: 0, Skipped: 0, Time elapsed: 0.005 sec - in org.apache.activemq.artemis.uri.ClusterConnectionConfigurationTest

Results :

Tests in error: 
  JdbcSharedStateManagerTest.shouldStartTwoIfTableNotExist:103 ยป  test timed out...

Tests run: 265, Failures: 0, Errors: 1, Skipped: 0

[INFO] ------------------------------------------------------------------------
[INFO] Reactor Summary:
[INFO] 
[INFO] ActiveMQ Artemis Parent ............................ SUCCESS [  4.993 s]
[INFO] ActiveMQ Artemis Commons ........................... SUCCESS [ 17.415 s]
[INFO] ActiveMQ Artemis Core Client ....................... SUCCESS [  9.135 s]
[INFO] ActiveMQ Artemis Selector Implementation ........... SUCCESS [  3.098 s]
[INFO] ActiveMQ Artemis JMS Client ........................ SUCCESS [  3.347 s]
[INFO] ActiveMQ Artemis Native POM ........................ SUCCESS [  9.823 s]
[INFO] ActiveMQ Artemis Journal ........................... SUCCESS [  2.771 s]
[INFO] ActiveMQ Artemis JDBC Store ........................ SUCCESS [ 28.019 s]
[INFO] ActiveMQ Artemis Server ............................ FAILURE [07:16 min]
[INFO] ActiveMQ Artemis Protocols ......................... SKIPPED
[INFO] ActiveMQ Artemis AMQP Protocol ..................... SKIPPED
[INFO] ActiveMQ Artemis STOMP Protocol .................... SKIPPED
[INFO] ActiveMQ Artemis OpenWire Protocol ................. SKIPPED
[INFO] ActiveMQ Artemis HQClient Protocol ................. SKIPPED
[INFO] ActiveMQ Artemis HornetQ Protocol .................. SKIPPED
[INFO] ActiveMQ Artemis MQTT Protocol ..................... SKIPPED
[INFO] ActiveMQ Artemis DTO ............................... SKIPPED
[INFO] ActiveMQ Artemis Service Extensions ................ SKIPPED
[INFO] ActiveMQ Artemis JMS Server ........................ SKIPPED
[INFO] ActiveMQ Artemis CDI Integration ................... SKIPPED
[INFO] ActiveMQ Artemis Boot .............................. SKIPPED
[INFO] ActiveMQ Artemis Tools ............................. SKIPPED
[INFO] ActiveMQ Artemis CLI ............................... SKIPPED
[INFO] ActiveMQ Artemis Web ............................... SKIPPED
[INFO] ActiveMQ Artemis Web ............................... SKIPPED
[INFO] ActiveMQ Artemis Core Client All ................... SKIPPED
[INFO] ActiveMQ Artemis Client OSGi ....................... SKIPPED
[INFO] ActiveMQ Artemis JUnit Rules ....................... SKIPPED
[INFO] ActiveMQ Artemis JMS Client All .................... SKIPPED
[INFO] ActiveMQ Artemis JMS Client OSGi ................... SKIPPED
[INFO] ActiveMQ Artemis RAR POM ........................... SKIPPED
[INFO] ActiveMQ Artemis REST Interface Implementation ..... SKIPPED
[INFO] ActiveMQ Artemis Maven Plugin ...................... SKIPPED
[INFO] ActiveMQ Artemis Server OSGi ....................... SKIPPED
[INFO] ActiveMQ Artemis Cons .............................. SKIPPED
[INFO] ActiveMQ Artemis HawtIO Branding ................... SKIPPED
[INFO] ActiveMQ Artemis HawtIO Plugin ..................... SKIPPED
[INFO] ActiveMQ Artemis Console ........................... SKIPPED
[INFO] ActiveMQ Artemis Spring Integration ................ SKIPPED
[INFO] Apache ActiveMQ Artemis Distribution ............... SKIPPED
[INFO] ActiveMQ Artemis Tests POM ......................... SKIPPED
[INFO] ActiveMQ Artemis Test Support ...................... SKIPPED
[INFO] ActiveMQ Artemis Unit Tests ........................ SKIPPED
[INFO] ActiveMQ Artemis Joram Tests ....................... SKIPPED
[INFO] ActiveMQ Artemis timing Tests ...................... SKIPPED
[INFO] ActiveMQ Artemis JMS Tests ......................... SKIPPED
[INFO] ActiveMQ Artemis Features .......................... SKIPPED
[INFO] ActiveMQ Artemis Integration Tests ................. SKIPPED
[INFO] ActiveMQ Artemis Client Integration Tests .......... SKIPPED
[INFO] ActiveMQ Artemis Compatibility Tests ............... SKIPPED
[INFO] ActiveMQ Artemis soak Tests ........................ SKIPPED
[INFO] ActiveMQ Artemis stress Tests ...................... SKIPPED
[INFO] ActiveMQ Artemis performance Tests ................. SKIPPED
[INFO] Smoke Tests ........................................ SKIPPED
[INFO] ActiveMQ Artemis Extra Tests ....................... SKIPPED
[INFO] ------------------------------------------------------------------------
[INFO] BUILD FAILURE
[INFO] ------------------------------------------------------------------------
[INFO] Total time: 08:38 min
[INFO] Finished at: 2018-04-17T15:14:04+00:00
[INFO] Final Memory: 195M/3446M
[INFO] ------------------------------------------------------------------------
[ERROR] Failed to execute goal org.apache.maven.plugins:maven-surefire-plugin:2.18.1:test
(default-test) on project artemis-server: There are test failures.
[ERROR] 
[ERROR] Please refer to <https://builds.apache.org/job/ActiveMQ-Artemis-Master/ws/artemis-server/target/surefire-reports>
for the individual test results.
[ERROR] -> [Help 1]
[ERROR] 
[ERROR] To see the full stack trace of the errors, re-run Maven with the -e switch.
[ERROR] Re-run Maven using the -X switch to enable full debug logging.
[ERROR] 
[ERROR] For more information about the errors and possible solutions, please read the following
articles:
[ERROR] [Help 1] http://cwiki.apache.org/confluence/display/MAVEN/MojoFailureException
[ERROR] 
[ERROR] After correcting the problems, you can resume the build with the command
[ERROR]   mvn <goals> -rf :artemis-server
Build step 'Invoke top-level Maven targets' marked build as failure
Performing Post build task...
Could not match :Too many files with unapproved license  : False
Logical operation result is FALSE
Skipping script  : cat ratReport.txt
END OF POST BUILD TASK 	: 0
Recording test results

Mime
View raw message