activemq-commits mailing list archives

Site index · List index
Message view « Date » · « Thread »
Top « Date » · « Thread »
From Apache Jenkins Server <jenk...@builds.apache.org>
Subject Build failed in Jenkins: ActiveMQ-Artemis-Master #1689
Date Wed, 07 Mar 2018 02:35:50 GMT
See <https://builds.apache.org/job/ActiveMQ-Artemis-Master/1689/display/redirect?page=changes>

Changes:

[jbertram] NO-JIRA fix checkstyle

------------------------------------------
[...truncated 1.33 MB...]
[main] 02:34:20,658 INFO  [org.apache.activemq.artemis.core.server] **** end #test testPoll()
***
[main] 02:34:20,658 INFO  [org.apache.activemq.artemis.core.server] **** start #test testRemoveHead1()
***
[main] 02:34:20,665 INFO  [org.apache.activemq.artemis.core.server] **** end #test testRemoveHead1()
***
[main] 02:34:20,665 INFO  [org.apache.activemq.artemis.core.server] **** start #test testRemoveHead2()
***
[main] 02:34:20,673 INFO  [org.apache.activemq.artemis.core.server] **** end #test testRemoveHead2()
***
[main] 02:34:20,673 INFO  [org.apache.activemq.artemis.core.server] **** start #test testRemoveHead3()
***
[main] 02:34:20,680 INFO  [org.apache.activemq.artemis.core.server] **** end #test testRemoveHead3()
***
[main] 02:34:20,680 INFO  [org.apache.activemq.artemis.core.server] **** start #test testRemoveTail1()
***
[main] 02:34:20,686 INFO  [org.apache.activemq.artemis.core.server] **** end #test testRemoveTail1()
***
[main] 02:34:20,687 INFO  [org.apache.activemq.artemis.core.server] **** start #test testRemoveTail2()
***
[main] 02:34:20,693 INFO  [org.apache.activemq.artemis.core.server] **** end #test testRemoveTail2()
***
[main] 02:34:20,693 INFO  [org.apache.activemq.artemis.core.server] **** start #test testRemoveTail3()
***
[main] 02:34:20,698 INFO  [org.apache.activemq.artemis.core.server] **** end #test testRemoveTail3()
***
[main] 02:34:20,699 INFO  [org.apache.activemq.artemis.core.server] **** start #test testRemoveInTurn()
***
[main] 02:34:20,704 INFO  [org.apache.activemq.artemis.core.server] **** end #test testRemoveInTurn()
***
[main] 02:34:20,705 INFO  [org.apache.activemq.artemis.core.server] **** start #test testRemoveMiddle()
***
[main] 02:34:20,710 INFO  [org.apache.activemq.artemis.core.server] **** end #test testRemoveMiddle()
***
[main] 02:34:20,710 INFO  [org.apache.activemq.artemis.core.server] **** start #test testAddHeadAndRemove()
***
Jumping 500
[main] 02:34:20,715 INFO  [org.apache.activemq.artemis.utils.ThreadLeakCheckRule] #test forceGC
[main] 02:34:21,365 INFO  [org.apache.activemq.artemis.utils.ThreadLeakCheckRule] #test forceGC
Done 
[main] 02:34:21,372 INFO  [org.apache.activemq.artemis.core.server] **** end #test testAddHeadAndRemove()
***
[main] 02:34:21,373 INFO  [org.apache.activemq.artemis.core.server] **** start #test testMultipleIterators1()
***
[main] 02:34:21,380 INFO  [org.apache.activemq.artemis.core.server] **** end #test testMultipleIterators1()
***
[main] 02:34:21,380 INFO  [org.apache.activemq.artemis.core.server] **** start #test testMultipleIterators2()
***
[main] 02:34:21,387 INFO  [org.apache.activemq.artemis.core.server] **** end #test testMultipleIterators2()
***
[main] 02:34:21,387 INFO  [org.apache.activemq.artemis.core.server] **** start #test testResizing()
***
[main] 02:34:21,399 INFO  [org.apache.activemq.artemis.core.server] **** end #test testResizing()
***
[main] 02:34:21,399 INFO  [org.apache.activemq.artemis.core.server] **** start #test testRepeatAndRemove()
***
[main] 02:34:21,406 INFO  [org.apache.activemq.artemis.core.server] **** end #test testRepeatAndRemove()
***
[main] 02:34:21,406 INFO  [org.apache.activemq.artemis.core.server] **** start #test testIterateNoElements()
***
[main] 02:34:21,413 INFO  [org.apache.activemq.artemis.core.server] **** end #test testIterateNoElements()
***
[main] 02:34:21,413 INFO  [org.apache.activemq.artemis.core.server] **** start #test testAddAndRemove()
***
[main] 02:34:21,421 INFO  [org.apache.activemq.artemis.utils.ThreadLeakCheckRule] #test forceGC
[main] 02:34:21,780 INFO  [org.apache.activemq.artemis.utils.ThreadLeakCheckRule] #test forceGC
Done 
[main] 02:34:22,255 INFO  [org.apache.activemq.artemis.utils.ThreadLeakCheckRule] #test forceGC
[main] 02:34:22,944 INFO  [org.apache.activemq.artemis.utils.ThreadLeakCheckRule] #test forceGC
Done 
[main] 02:34:22,944 INFO  [org.apache.activemq.artemis.utils.ThreadLeakCheckRule] #test forceGC
[main] 02:34:23,202 INFO  [org.apache.activemq.artemis.utils.ThreadLeakCheckRule] #test forceGC
Done 
[main] 02:34:23,675 INFO  [org.apache.activemq.artemis.utils.ThreadLeakCheckRule] #test forceGC
[main] 02:34:24,113 INFO  [org.apache.activemq.artemis.utils.ThreadLeakCheckRule] #test forceGC
Done 
[main] 02:34:24,114 INFO  [org.apache.activemq.artemis.utils.ThreadLeakCheckRule] #test forceGC
[main] 02:34:24,287 INFO  [org.apache.activemq.artemis.utils.ThreadLeakCheckRule] #test forceGC
Done 
[main] 02:34:24,713 INFO  [org.apache.activemq.artemis.utils.ThreadLeakCheckRule] #test forceGC
[main] 02:34:25,101 INFO  [org.apache.activemq.artemis.utils.ThreadLeakCheckRule] #test forceGC
Done 
[main] 02:34:25,101 INFO  [org.apache.activemq.artemis.utils.ThreadLeakCheckRule] #test forceGC
[main] 02:34:25,253 INFO  [org.apache.activemq.artemis.utils.ThreadLeakCheckRule] #test forceGC
Done 
[main] 02:34:25,576 INFO  [org.apache.activemq.artemis.utils.ThreadLeakCheckRule] #test forceGC
[main] 02:34:25,951 INFO  [org.apache.activemq.artemis.utils.ThreadLeakCheckRule] #test forceGC
Done 
[main] 02:34:25,952 INFO  [org.apache.activemq.artemis.utils.ThreadLeakCheckRule] #test forceGC
[main] 02:34:26,177 INFO  [org.apache.activemq.artemis.utils.ThreadLeakCheckRule] #test forceGC
Done 
[main] 02:34:26,522 INFO  [org.apache.activemq.artemis.utils.ThreadLeakCheckRule] #test forceGC
[main] 02:34:26,956 INFO  [org.apache.activemq.artemis.utils.ThreadLeakCheckRule] #test forceGC
Done 
[main] 02:34:26,957 INFO  [org.apache.activemq.artemis.utils.ThreadLeakCheckRule] #test forceGC
[main] 02:34:27,131 INFO  [org.apache.activemq.artemis.utils.ThreadLeakCheckRule] #test forceGC
Done 
[main] 02:34:27,131 INFO  [org.apache.activemq.artemis.utils.ThreadLeakCheckRule] #test forceGC
[main] 02:34:27,212 INFO  [org.apache.activemq.artemis.utils.ThreadLeakCheckRule] #test forceGC
Done 
[main] 02:34:27,218 INFO  [org.apache.activemq.artemis.core.server] **** end #test testAddAndRemove()
***
[main] 02:34:27,219 INFO  [org.apache.activemq.artemis.core.server] **** start #test testRemoveHeadAndTail1()
***
[main] 02:34:27,226 INFO  [org.apache.activemq.artemis.core.server] **** end #test testRemoveHeadAndTail1()
***
[main] 02:34:27,227 INFO  [org.apache.activemq.artemis.core.server] **** start #test testRemoveHeadAndTail2()
***
[main] 02:34:27,234 INFO  [org.apache.activemq.artemis.core.server] **** end #test testRemoveHeadAndTail2()
***
[main] 02:34:27,235 INFO  [org.apache.activemq.artemis.core.server] **** start #test testRemoveHeadAndTail3()
***
[main] 02:34:27,241 INFO  [org.apache.activemq.artemis.core.server] **** end #test testRemoveHeadAndTail3()
***
[main] 02:34:27,241 INFO  [org.apache.activemq.artemis.core.server] **** start #test testRepeat()
***
[main] 02:34:27,248 INFO  [org.apache.activemq.artemis.core.server] **** end #test testRepeat()
***
[main] 02:34:27,248 INFO  [org.apache.activemq.artemis.core.server] **** start #test testCreateIteratorBeforeAddElements()
***
[main] 02:34:27,255 INFO  [org.apache.activemq.artemis.core.server] **** end #test testCreateIteratorBeforeAddElements()
***
[main] 02:34:27,255 INFO  [org.apache.activemq.artemis.core.server] **** start #test testRemoveAll()
***
[main] 02:34:27,261 INFO  [org.apache.activemq.artemis.core.server] **** end #test testRemoveAll()
***
[main] 02:34:27,261 INFO  [org.apache.activemq.artemis.core.server] **** start #test testRemoveOdd()
***
[main] 02:34:27,267 INFO  [org.apache.activemq.artemis.core.server] **** end #test testRemoveOdd()
***
[main] 02:34:27,268 INFO  [org.apache.activemq.artemis.core.server] **** start #test testIterateThenAddMoreAndIterateAgain()
***
[main] 02:34:27,275 INFO  [org.apache.activemq.artemis.core.server] **** end #test testIterateThenAddMoreAndIterateAgain()
***
Tests run: 29, Failures: 0, Errors: 0, Skipped: 0, Time elapsed: 6.653 sec - in org.apache.activemq.artemis.tests.unit.util.LinkedListTest
Running org.apache.activemq.artemis.tests.unit.util.MemorySizeTest
[main] 02:34:37,557 WARN  [org.apache.activemq.artemis.core.client] AMQ212047: Warning: JVM
allocated more data what would make results invalid 9,080,668,160:9,117,368,320
[main] 02:34:37,557 INFO  [org.apache.activemq.artemis.tests.unit] Server message size is
1216
[main] 02:34:46,377 WARN  [org.apache.activemq.artemis.core.client] AMQ212047: Warning: JVM
allocated more data what would make results invalid 9,201,778,688:9,236,905,984
[main] 02:34:46,377 INFO  [org.apache.activemq.artemis.tests.unit] Message reference size
is 80
Tests run: 1, Failures: 0, Errors: 0, Skipped: 0, Time elapsed: 19.102 sec - in org.apache.activemq.artemis.tests.unit.util.MemorySizeTest
Running org.apache.activemq.artemis.tests.unit.util.ObjectInputStreamWithClassLoaderTest
[main] 02:34:46,379 INFO  [org.apache.activemq.artemis.core.server] **** start #test testClassLoaderIsolationWithProxy()
***
Deserialized Object org.apache.activemq.artemis.tests.unit.util.ObjectInputStreamWithClassLoaderTest$AnObjectImpl@4fc3c165
[main] 02:34:46,431 INFO  [org.apache.activemq.artemis.core.server] **** end #test testClassLoaderIsolationWithProxy()
***
[main] 02:34:46,432 INFO  [org.apache.activemq.artemis.core.server] **** start #test testWhiteBlackListAgainstListObject()
***
[main] 02:34:46,442 INFO  [org.apache.activemq.artemis.core.server] **** end #test testWhiteBlackListAgainstListObject()
***
[main] 02:34:46,442 INFO  [org.apache.activemq.artemis.core.server] **** start #test testWhiteBlackListAgainstArrayObject()
***
[main] 02:34:46,450 INFO  [org.apache.activemq.artemis.core.server] **** end #test testWhiteBlackListAgainstArrayObject()
***
[main] 02:34:46,451 INFO  [org.apache.activemq.artemis.core.server] **** start #test testWhiteBlackListAnonymousObject()
***
[main] 02:34:46,460 INFO  [org.apache.activemq.artemis.core.server] **** end #test testWhiteBlackListAnonymousObject()
***
[main] 02:34:46,460 INFO  [org.apache.activemq.artemis.core.server] **** start #test testWhiteBlackListLocalObject()
***
[main] 02:34:46,470 INFO  [org.apache.activemq.artemis.core.server] **** end #test testWhiteBlackListLocalObject()
***
[main] 02:34:46,470 INFO  [org.apache.activemq.artemis.core.server] **** start #test testWhiteBlackListSystemProperty()
***
[main] 02:34:46,476 INFO  [org.apache.activemq.artemis.core.server] **** end #test testWhiteBlackListSystemProperty()
***
[main] 02:34:46,477 INFO  [org.apache.activemq.artemis.core.server] **** start #test testClassLoaderIsolation()
***
[main] 02:34:46,498 INFO  [org.apache.activemq.artemis.core.server] **** end #test testClassLoaderIsolation()
***
[main] 02:34:46,498 INFO  [org.apache.activemq.artemis.core.server] **** start #test testWhiteBlackList()
***
[main] 02:34:46,507 INFO  [org.apache.activemq.artemis.core.server] **** end #test testWhiteBlackList()
***
[main] 02:34:46,508 INFO  [org.apache.activemq.artemis.core.server] **** start #test testWhiteBlackListAgainstListMapObject()
***
[main] 02:34:46,520 INFO  [org.apache.activemq.artemis.core.server] **** end #test testWhiteBlackListAgainstListMapObject()
***
Tests run: 9, Failures: 0, Errors: 0, Skipped: 0, Time elapsed: 0.141 sec - in org.apache.activemq.artemis.tests.unit.util.ObjectInputStreamWithClassLoaderTest
Running org.apache.activemq.artemis.tests.unit.util.ReusableLatchTest
[main] 02:34:46,522 INFO  [org.apache.activemq.artemis.core.server] **** start #test testLatchWithParameterizedDown()
***
[main] 02:34:46,526 INFO  [org.apache.activemq.artemis.core.server] **** end #test testLatchWithParameterizedDown()
***
[main] 02:34:46,526 INFO  [org.apache.activemq.artemis.core.server] **** start #test testLatchOnSingleThread()
***
[main] 02:34:46,531 INFO  [org.apache.activemq.artemis.core.server] **** end #test testLatchOnSingleThread()
***
[main] 02:34:46,531 INFO  [org.apache.activemq.artemis.core.server] **** start #test testReuseLatch()
***
[main] 02:34:46,538 INFO  [org.apache.activemq.artemis.core.server] **** end #test testReuseLatch()
***
[main] 02:34:46,539 INFO  [org.apache.activemq.artemis.core.server] **** start #test testLatchOnMultiThread()
***
[main] 02:34:47,025 INFO  [org.apache.activemq.artemis.core.server] **** end #test testLatchOnMultiThread()
***
Tests run: 4, Failures: 0, Errors: 0, Skipped: 0, Time elapsed: 0.504 sec - in org.apache.activemq.artemis.tests.unit.util.ReusableLatchTest
Running org.apache.activemq.artemis.tests.unit.util.SoftValueMapTest
[main] 02:34:47,026 INFO  [org.apache.activemq.artemis.core.server] **** start #test testEvictionsLeastUsed()
***
[main] 02:34:47,028 INFO  [org.apache.activemq.artemis.utils.ThreadLeakCheckRule] #test forceGC
[main] 02:34:47,492 INFO  [org.apache.activemq.artemis.utils.ThreadLeakCheckRule] #test forceGC
Done 
SoftCache.size 200
Soft cache has 200 elements
[main] 02:34:47,499 INFO  [org.apache.activemq.artemis.core.server] **** end #test testEvictionsLeastUsed()
***
[main] 02:34:47,500 INFO  [org.apache.activemq.artemis.core.server] **** start #test testEvictions()
***
[main] 02:34:47,502 INFO  [org.apache.activemq.artemis.utils.ThreadLeakCheckRule] #test forceGC
[main] 02:34:47,572 INFO  [org.apache.activemq.artemis.utils.ThreadLeakCheckRule] #test forceGC
Done 
SoftCache.size 100
Soft cache has 100 elements
[main] 02:35:39,469 INFO  [org.apache.activemq.artemis.core.server] **** end #test testEvictions()
***
[main] 02:35:39,470 INFO  [org.apache.activemq.artemis.core.server] **** start #test testEvictOldestElement()
***
[main] 02:35:39,472 INFO  [org.apache.activemq.artemis.core.server] **** end #test testEvictOldestElement()
***
Tests run: 3, Failures: 0, Errors: 0, Skipped: 0, Time elapsed: 52.446 sec - in org.apache.activemq.artemis.tests.unit.util.SoftValueMapTest
Running org.apache.activemq.artemis.tests.unit.util.UTF8Test
[main] 02:35:39,475 INFO  [org.apache.activemq.artemis.core.server] **** start #test testValidateUTFOnDataInput()
***
[main] 02:35:39,958 INFO  [org.apache.activemq.artemis.core.server] **** end #test testValidateUTFOnDataInput()
***
[main] 02:35:39,958 INFO  [org.apache.activemq.artemis.core.server] **** start #test testValidateUTF()
***
[main] 02:35:39,960 INFO  [org.apache.activemq.artemis.core.server] **** end #test testValidateUTF()
***
[main] 02:35:39,961 INFO  [org.apache.activemq.artemis.core.server] **** start #test testBigSize()
***
[main] 02:35:39,980 INFO  [org.apache.activemq.artemis.core.server] **** end #test testBigSize()
***
[main] 02:35:39,980 INFO  [org.apache.activemq.artemis.core.server] **** start #test testValidateUTFWithLastAsciiChars()
***
[main] 02:35:39,987 INFO  [org.apache.activemq.artemis.core.server] **** end #test testValidateUTFWithLastAsciiChars()
***
[main] 02:35:39,988 INFO  [org.apache.activemq.artemis.core.server] **** start #test testValidateUTFWithENDChars()
***
[main] 02:35:39,993 INFO  [org.apache.activemq.artemis.core.server] **** end #test testValidateUTFWithENDChars()
***
Tests run: 5, Failures: 0, Errors: 0, Skipped: 0, Time elapsed: 0.52 sec - in org.apache.activemq.artemis.tests.unit.util.UTF8Test
Running org.apache.activemq.artemis.tests.unit.util.UUIDGeneratorTest
[main] 02:35:39,995 INFO  [org.apache.activemq.artemis.core.server] **** start #test testZeroPaddedBytes()
***
[main] 02:35:39,998 INFO  [org.apache.activemq.artemis.core.server] **** end #test testZeroPaddedBytes()
***
[main] 02:35:39,999 INFO  [org.apache.activemq.artemis.core.server] **** start #test testGetHardwareAddress()
***
[main] 02:35:40,009 INFO  [org.apache.activemq.artemis.core.server] **** end #test testGetHardwareAddress()
***
Tests run: 2, Failures: 0, Errors: 0, Skipped: 0, Time elapsed: 0.016 sec - in org.apache.activemq.artemis.tests.unit.util.UUIDGeneratorTest
Running org.apache.activemq.artemis.tests.unit.util.UUIDTest
[main] 02:35:40,011 INFO  [org.apache.activemq.artemis.core.server] **** start #test testStringToUuidConversion()
***
[main] 02:35:40,232 INFO  [org.apache.activemq.artemis.core.server] **** end #test testStringToUuidConversion()
***
[main] 02:35:40,233 INFO  [org.apache.activemq.artemis.core.server] **** start #test testManyUUIDs()
***
[main] 02:35:40,297 INFO  [org.apache.activemq.artemis.core.server] **** end #test testManyUUIDs()
***
Tests run: 2, Failures: 0, Errors: 0, Skipped: 0, Time elapsed: 0.288 sec - in org.apache.activemq.artemis.tests.unit.util.UUIDTest
Running org.apache.activemq.artemis.tests.unit.util.VersionLoaderTest
[main] 02:35:40,299 INFO  [org.apache.activemq.artemis.core.server] **** start #test testLoadVersion()
***
[main] 02:35:40,303 INFO  [org.apache.activemq.artemis.core.server] **** end #test testLoadVersion()
***
Tests run: 1, Failures: 0, Errors: 0, Skipped: 0, Time elapsed: 0.004 sec - in org.apache.activemq.artemis.tests.unit.util.VersionLoaderTest

Results :

Failed tests: 
  ActiveMQResourceAdapterConfigTest.testConfiguration:460->Assert.fail:88 methods not shown
please see previous and add

Tests run: 629, Failures: 1, Errors: 0, Skipped: 0

[INFO] ------------------------------------------------------------------------
[INFO] Reactor Summary:
[INFO] 
[INFO] ActiveMQ Artemis Parent ............................ SUCCESS [  4.445 s]
[INFO] ActiveMQ Artemis Commons ........................... SUCCESS [ 19.977 s]
[INFO] ActiveMQ Artemis Core Client ....................... SUCCESS [ 11.838 s]
[INFO] ActiveMQ Artemis Selector Implementation ........... SUCCESS [  4.179 s]
[INFO] ActiveMQ Artemis JMS Client ........................ SUCCESS [  4.793 s]
[INFO] ActiveMQ Artemis Native POM ........................ SUCCESS [  5.820 s]
[INFO] ActiveMQ Artemis Journal ........................... SUCCESS [  3.760 s]
[INFO] ActiveMQ Artemis JDBC Store ........................ SUCCESS [ 20.005 s]
[INFO] ActiveMQ Artemis Server ............................ SUCCESS [03:26 min]
[INFO] ActiveMQ Artemis Protocols ......................... SUCCESS [  0.128 s]
[INFO] ActiveMQ Artemis AMQP Protocol ..................... SUCCESS [  5.547 s]
[INFO] ActiveMQ Artemis STOMP Protocol .................... SUCCESS [  2.270 s]
[INFO] ActiveMQ Artemis OpenWire Protocol ................. SUCCESS [  2.466 s]
[INFO] ActiveMQ Artemis HQClient Protocol ................. SUCCESS [  0.828 s]
[INFO] ActiveMQ Artemis HornetQ Protocol .................. SUCCESS [  1.197 s]
[INFO] ActiveMQ Artemis MQTT Protocol ..................... SUCCESS [  1.816 s]
[INFO] ActiveMQ Artemis DTO ............................... SUCCESS [  2.300 s]
[INFO] ActiveMQ Artemis Service Extensions ................ SUCCESS [  1.919 s]
[INFO] ActiveMQ Artemis JMS Server ........................ SUCCESS [  1.954 s]
[INFO] ActiveMQ Artemis CDI Integration ................... SUCCESS [  5.566 s]
[INFO] ActiveMQ Artemis Boot .............................. SUCCESS [  0.239 s]
[INFO] ActiveMQ Artemis Tools ............................. SUCCESS [  0.916 s]
[INFO] ActiveMQ Artemis CLI ............................... SUCCESS [ 33.194 s]
[INFO] ActiveMQ Artemis Web ............................... SUCCESS [  5.771 s]
[INFO] ActiveMQ Artemis Web ............................... SUCCESS [ 58.341 s]
[INFO] ActiveMQ Artemis Core Client All ................... SUCCESS [ 14.837 s]
[INFO] ActiveMQ Artemis Client OSGi ....................... SUCCESS [  1.539 s]
[INFO] ActiveMQ Artemis JUnit Rules ....................... SUCCESS [  7.474 s]
[INFO] ActiveMQ Artemis JMS Client All .................... SUCCESS [ 13.975 s]
[INFO] ActiveMQ Artemis JMS Client OSGi ................... SUCCESS [  1.519 s]
[INFO] ActiveMQ Artemis RAR POM ........................... SUCCESS [  2.525 s]
[INFO] ActiveMQ Artemis REST Interface Implementation ..... SUCCESS [  3.924 s]
[INFO] ActiveMQ Artemis Maven Plugin ...................... SUCCESS [  2.983 s]
[INFO] ActiveMQ Artemis Server OSGi ....................... SUCCESS [  5.404 s]
[INFO] ActiveMQ Artemis Cons .............................. SUCCESS [  0.112 s]
[INFO] ActiveMQ Artemis HawtIO Branding ................... SUCCESS [  5.057 s]
[INFO] ActiveMQ Artemis HawtIO Plugin ..................... SUCCESS [  0.710 s]
[INFO] ActiveMQ Artemis Console ........................... SUCCESS [  5.088 s]
[INFO] ActiveMQ Artemis Spring Integration ................ SUCCESS [  0.861 s]
[INFO] Apache ActiveMQ Artemis Distribution ............... SUCCESS [ 31.683 s]
[INFO] ActiveMQ Artemis Tests POM ......................... SUCCESS [  0.527 s]
[INFO] ActiveMQ Artemis Test Support ...................... SUCCESS [  1.950 s]
[INFO] ActiveMQ Artemis Unit Tests ........................ FAILURE [03:55 min]
[INFO] ActiveMQ Artemis Joram Tests ....................... SKIPPED
[INFO] ActiveMQ Artemis timing Tests ...................... SKIPPED
[INFO] ActiveMQ Artemis JMS Tests ......................... SKIPPED
[INFO] ActiveMQ Artemis Features .......................... SKIPPED
[INFO] ActiveMQ Artemis Integration Tests ................. SKIPPED
[INFO] ActiveMQ Artemis Client Integration Tests .......... SKIPPED
[INFO] ActiveMQ Artemis Compatibility Tests ............... SKIPPED
[INFO] ActiveMQ Artemis soak Tests ........................ SKIPPED
[INFO] ActiveMQ Artemis stress Tests ...................... SKIPPED
[INFO] ActiveMQ Artemis performance Tests ................. SKIPPED
[INFO] Smoke Tests ........................................ SKIPPED
[INFO] ActiveMQ Artemis Extra Tests ....................... SKIPPED
[INFO] ------------------------------------------------------------------------
[INFO] BUILD FAILURE
[INFO] ------------------------------------------------------------------------
[INFO] Total time: 12:23 min
[INFO] Finished at: 2018-03-07T02:35:42+00:00
[INFO] Final Memory: 360M/6107M
[INFO] ------------------------------------------------------------------------
[ERROR] Failed to execute goal org.apache.maven.plugins:maven-surefire-plugin:2.18.1:test
(default-test) on project unit-tests: There are test failures.
[ERROR] 
[ERROR] Please refer to <https://builds.apache.org/job/ActiveMQ-Artemis-Master/ws/tests/unit-tests/target/surefire-reports>
for the individual test results.
[ERROR] -> [Help 1]
[ERROR] 
[ERROR] To see the full stack trace of the errors, re-run Maven with the -e switch.
[ERROR] Re-run Maven using the -X switch to enable full debug logging.
[ERROR] 
[ERROR] For more information about the errors and possible solutions, please read the following
articles:
[ERROR] [Help 1] http://cwiki.apache.org/confluence/display/MAVEN/MojoFailureException
[ERROR] 
[ERROR] After correcting the problems, you can resume the build with the command
[ERROR]   mvn <goals> -rf :unit-tests
Build step 'Invoke top-level Maven targets' marked build as failure
Performing Post build task...
Could not match :Too many files with unapproved license  : False
Logical operation result is FALSE
Skipping script  : cat ratReport.txt
END OF POST BUILD TASK 	: 0
Recording test results

Mime
View raw message