activemq-commits mailing list archives

Site index · List index
Message view « Date » · « Thread »
Top « Date » · « Thread »
From Apache Jenkins Server <jenk...@builds.apache.org>
Subject Build failed in Jenkins: ActiveMQ-Artemis-Master #1539
Date Thu, 11 Jan 2018 15:53:34 GMT
See <https://builds.apache.org/job/ActiveMQ-Artemis-Master/1539/display/redirect?page=changes>

Changes:

[jbertram] ARTEMIS-1576 Fix test that was broken with changes on this issue

[jbertram] ARTEMIS-1598 modify SslHandler name in connector

------------------------------------------
[...truncated 1.60 MB...]
[INFO] 
[INFO] --- maven-install-plugin:2.4:install (default-install) @ activemq-branding ---
[INFO] Installing <https://builds.apache.org/job/ActiveMQ-Artemis-Master/ws/artemis-hawtio/activemq-branding/target/activemq-branding-2.5.0-SNAPSHOT.war>
to /home/jenkins/.m2/repository/org/apache/activemq/activemq-branding/2.5.0-SNAPSHOT/activemq-branding-2.5.0-SNAPSHOT.war
[INFO] Installing <https://builds.apache.org/job/ActiveMQ-Artemis-Master/ws/artemis-hawtio/activemq-branding/pom.xml>
to /home/jenkins/.m2/repository/org/apache/activemq/activemq-branding/2.5.0-SNAPSHOT/activemq-branding-2.5.0-SNAPSHOT.pom
[INFO] Installing <https://builds.apache.org/job/ActiveMQ-Artemis-Master/ws/artemis-hawtio/activemq-branding/target/activemq-branding-2.5.0-SNAPSHOT-sources.jar>
to /home/jenkins/.m2/repository/org/apache/activemq/activemq-branding/2.5.0-SNAPSHOT/activemq-branding-2.5.0-SNAPSHOT-sources.jar
[INFO] Installing <https://builds.apache.org/job/ActiveMQ-Artemis-Master/ws/artemis-hawtio/activemq-branding/target/activemq-branding-2.5.0-SNAPSHOT-sources.jar>
to /home/jenkins/.m2/repository/org/apache/activemq/activemq-branding/2.5.0-SNAPSHOT/activemq-branding-2.5.0-SNAPSHOT-sources.jar
[INFO]                                                                         
[INFO] ------------------------------------------------------------------------
[INFO] Building ActiveMQ Artemis HawtIO Plugin 2.5.0-SNAPSHOT
[INFO] ------------------------------------------------------------------------
[INFO] 
[INFO] --- maven-enforcer-plugin:1.4:enforce (enforce-maven) @ artemis-plugin ---
[INFO] 
[INFO] --- maven-enforcer-plugin:1.4:enforce (enforce-java) @ artemis-plugin ---
[INFO] 
[INFO] --- maven-antrun-plugin:1.7:run (generate-sources) @ artemis-plugin ---
[INFO] Executing tasks

main:
     [echo] Building plugin javascript file list
     [echo] Files: plugin/js/address.js,plugin/js/addresses.js,plugin/js/artemisHelpers.js,plugin/js/artemisPlugin.js,plugin/js/artemisService.js,plugin/js/brokerDiagram.js,plugin/js/browse.js,plugin/js/connections.js,plugin/js/consumers.js,plugin/js/jmsHeaderSchema.js,plugin/js/preferences.js,plugin/js/producers.js,plugin/js/queue.js,plugin/js/queues.js,plugin/js/send.js,plugin/js/sessions.js,plugin/js/tree.js,plugin/lib/artemis-console.js
[INFO] Executed tasks
[INFO] 
[INFO] --- maven-resources-plugin:2.6:resources (copy-resources) @ artemis-plugin ---
[INFO] Using 'UTF-8' encoding to copy filtered resources.
[INFO] Copying 1 resource
[INFO] 
[INFO] --- maven-remote-resources-plugin:1.5:process (process-resource-bundles) @ artemis-plugin
---
[INFO] 
[INFO] --- maven-resources-plugin:2.6:resources (default-resources) @ artemis-plugin ---
[INFO] Using 'UTF-8' encoding to copy filtered resources.
[INFO] Copying 1 resource
[INFO] Copying 3 resources
[INFO] 
[INFO] --- maven-compiler-plugin:3.1:compile (default-compile) @ artemis-plugin ---
[INFO] Changes detected - recompiling the module!
[INFO] Compiling 1 source file to <https://builds.apache.org/job/ActiveMQ-Artemis-Master/ws/artemis-hawtio/artemis-plugin/target/classes>
[INFO] 
[INFO] --- maven-checkstyle-plugin:2.17:check (default) @ artemis-plugin ---
[INFO] Starting audit...
Audit done.
[INFO] 
[INFO] --- apache-rat-plugin:0.12:check (default) @ artemis-plugin ---
[INFO] Enabled default license matchers.
[INFO] Will parse SCM ignores for exclusions...
[INFO] Finished adding exclusions from SCM ignore files.
[INFO] 61 implicit excludes (use -debug for more details).
[INFO] Exclude: **/footer.html
[INFO] Exclude: **/*.txt
[INFO] Exclude: **/*.md
[INFO] Exclude: etc/ide-settings/**
[INFO] Exclude: docs/**/*.json
[INFO] Exclude: docs/**/_book/
[INFO] Exclude: **/target/
[INFO] Exclude: **/META-INF/services/*
[INFO] Exclude: **/META-INF/MANIFEST.MF
[INFO] Exclude: **/*.iml
[INFO] Exclude: **/*.jceks
[INFO] Exclude: **/*.jks
[INFO] Exclude: **/org/apache/activemq/artemis/utils/json/**
[INFO] Exclude: **/org/apache/activemq/artemis/utils/Base64.java
[INFO] Exclude: **/.settings/**
[INFO] Exclude: **/.project
[INFO] Exclude: **/.classpath
[INFO] Exclude: **/.editorconfig
[INFO] Exclude: **/.checkstyle
[INFO] Exclude: **/.factorypath
[INFO] Exclude: **/org.apache.activemq.artemis.cfg
[INFO] Exclude: **/nb-configuration.xml
[INFO] Exclude: **/*.data
[INFO] Exclude: **/*.bin
[INFO] Exclude: **/src/test/resources/keystore
[INFO] Exclude: **/*.log
[INFO] Exclude: **/*.redo
[INFO] Exclude: **/node/**
[INFO] Exclude: **/node_modules/**
[INFO] Exclude: **/package.json
[INFO] Exclude: **/npm-shrinkwrap.json
[INFO] Exclude: **/overlays/**
[INFO] Exclude: **/CMakeFiles/
[INFO] Exclude: **/Makefile
[INFO] Exclude: **/cmake_install.cmake
[INFO] Exclude: artemis-native/src/main/c/org_apache_activemq_artemis_jlibaio_LibaioContext.h
[INFO] Exclude: **/dependency-reduced-pom.xml
[INFO] 37 resources included (use -debug for more details)
[INFO] Rat check: Summary over all files. Unapproved: 0, unknown: 0, generated: 0, approved:
37 licenses.
[INFO] 
[INFO] --- maven-bundle-plugin:3.0.1:manifest (bundle-manifest) @ artemis-plugin ---
[WARNING] Manifest org.apache.activemq:artemis-plugin:war:2.5.0-SNAPSHOT : No sub JAR or directory
WEB-INF/classes
[INFO] 
[INFO] --- maven-resources-plugin:2.6:testResources (default-testResources) @ artemis-plugin
---
[INFO] Using 'UTF-8' encoding to copy filtered resources.
[INFO] skip non existing resourceDirectory <https://builds.apache.org/job/ActiveMQ-Artemis-Master/ws/artemis-hawtio/artemis-plugin/src/test/resources>
[INFO] Copying 3 resources
[INFO] 
[INFO] --- maven-compiler-plugin:3.1:testCompile (default-testCompile) @ artemis-plugin ---
[INFO] No sources to compile
[INFO] 
[INFO] --- maven-surefire-plugin:2.18.1:test (default-test) @ artemis-plugin ---
[INFO] 
[INFO] --- maven-war-plugin:2.6:war (default-war) @ artemis-plugin ---
[INFO] Packaging webapp
[INFO] Assembling webapp [artemis-plugin] in [<https://builds.apache.org/job/ActiveMQ-Artemis-Master/ws/artemis-hawtio/artemis-plugin/target/artemis-plugin-2.5.0-SNAPSHOT]>
[info] Copying manifest...
[INFO] Processing war project
[INFO] Copying webapp webResources [<https://builds.apache.org/job/ActiveMQ-Artemis-Master/ws/artemis-hawtio/artemis-plugin/src/main/resources]>
to [<https://builds.apache.org/job/ActiveMQ-Artemis-Master/ws/artemis-hawtio/artemis-plugin/target/artemis-plugin-2.5.0-SNAPSHOT]>
[INFO] Copying webapp resources [<https://builds.apache.org/job/ActiveMQ-Artemis-Master/ws/artemis-hawtio/artemis-plugin/src/main/webapp]>
[INFO] Webapp assembled in [23 msecs]
[INFO] Building war: <https://builds.apache.org/job/ActiveMQ-Artemis-Master/ws/artemis-hawtio/artemis-plugin/target/artemis-plugin-2.5.0-SNAPSHOT.war>
[INFO] 
[INFO] --- maven-site-plugin:3.3:attach-descriptor (attach-descriptor) @ artemis-plugin ---
[INFO] 
[INFO] >>> maven-source-plugin:2.2.1:jar (attach-sources) > generate-sources @
artemis-plugin >>>
[INFO] 
[INFO] --- maven-enforcer-plugin:1.4:enforce (enforce-maven) @ artemis-plugin ---
[INFO] 
[INFO] --- maven-enforcer-plugin:1.4:enforce (enforce-java) @ artemis-plugin ---
[INFO] 
[INFO] --- maven-antrun-plugin:1.7:run (generate-sources) @ artemis-plugin ---
[INFO] Executing tasks

main:
     [echo] Building plugin javascript file list
     [echo] Files: plugin/js/address.js,plugin/js/addresses.js,plugin/js/artemisHelpers.js,plugin/js/artemisPlugin.js,plugin/js/artemisService.js,plugin/js/brokerDiagram.js,plugin/js/browse.js,plugin/js/connections.js,plugin/js/consumers.js,plugin/js/jmsHeaderSchema.js,plugin/js/preferences.js,plugin/js/producers.js,plugin/js/queue.js,plugin/js/queues.js,plugin/js/send.js,plugin/js/sessions.js,plugin/js/tree.js,plugin/lib/artemis-console.js
[INFO] Executed tasks
[INFO] 
[INFO] --- maven-resources-plugin:2.6:resources (copy-resources) @ artemis-plugin ---
[INFO] Using 'UTF-8' encoding to copy filtered resources.
[INFO] Copying 1 resource
[INFO] Copying 3 resources
[INFO] 
[INFO] <<< maven-source-plugin:2.2.1:jar (attach-sources) < generate-sources @
artemis-plugin <<<
[INFO] 
[INFO] --- maven-source-plugin:2.2.1:jar (attach-sources) @ artemis-plugin ---
[INFO] Building jar: <https://builds.apache.org/job/ActiveMQ-Artemis-Master/ws/artemis-hawtio/artemis-plugin/target/artemis-plugin-2.5.0-SNAPSHOT-sources.jar>
[INFO] 
[INFO] >>> maven-source-plugin:2.2.1:jar (default) > generate-sources @ artemis-plugin
>>>
[INFO] 
[INFO] --- maven-enforcer-plugin:1.4:enforce (enforce-maven) @ artemis-plugin ---
[INFO] 
[INFO] --- maven-enforcer-plugin:1.4:enforce (enforce-java) @ artemis-plugin ---
[INFO] 
[INFO] --- maven-antrun-plugin:1.7:run (generate-sources) @ artemis-plugin ---
[INFO] Executing tasks

main:
     [echo] Building plugin javascript file list
     [echo] Files: plugin/js/address.js,plugin/js/addresses.js,plugin/js/artemisHelpers.js,plugin/js/artemisPlugin.js,plugin/js/artemisService.js,plugin/js/brokerDiagram.js,plugin/js/browse.js,plugin/js/connections.js,plugin/js/consumers.js,plugin/js/jmsHeaderSchema.js,plugin/js/preferences.js,plugin/js/producers.js,plugin/js/queue.js,plugin/js/queues.js,plugin/js/send.js,plugin/js/sessions.js,plugin/js/tree.js,plugin/lib/artemis-console.js
[INFO] Executed tasks
[INFO] 
[INFO] --- maven-resources-plugin:2.6:resources (copy-resources) @ artemis-plugin ---
[INFO] Using 'UTF-8' encoding to copy filtered resources.
[INFO] Copying 1 resource
[INFO] Copying 3 resources
[INFO] 
[INFO] <<< maven-source-plugin:2.2.1:jar (default) < generate-sources @ artemis-plugin
<<<
[INFO] 
[INFO] --- maven-source-plugin:2.2.1:jar (default) @ artemis-plugin ---
[INFO] 
[INFO] --- dependency-check-maven:1.4.3:check (default) @ artemis-plugin ---
[INFO] Skipping dependency-check
[INFO] 
[INFO] --- maven-install-plugin:2.4:install (default-install) @ artemis-plugin ---
[INFO] Installing <https://builds.apache.org/job/ActiveMQ-Artemis-Master/ws/artemis-hawtio/artemis-plugin/target/artemis-plugin-2.5.0-SNAPSHOT.war>
to /home/jenkins/.m2/repository/org/apache/activemq/artemis-plugin/2.5.0-SNAPSHOT/artemis-plugin-2.5.0-SNAPSHOT.war
[INFO] Installing <https://builds.apache.org/job/ActiveMQ-Artemis-Master/ws/artemis-hawtio/artemis-plugin/pom.xml>
to /home/jenkins/.m2/repository/org/apache/activemq/artemis-plugin/2.5.0-SNAPSHOT/artemis-plugin-2.5.0-SNAPSHOT.pom
[INFO] Installing <https://builds.apache.org/job/ActiveMQ-Artemis-Master/ws/artemis-hawtio/artemis-plugin/target/artemis-plugin-2.5.0-SNAPSHOT-sources.jar>
to /home/jenkins/.m2/repository/org/apache/activemq/artemis-plugin/2.5.0-SNAPSHOT/artemis-plugin-2.5.0-SNAPSHOT-sources.jar
[INFO] Installing <https://builds.apache.org/job/ActiveMQ-Artemis-Master/ws/artemis-hawtio/artemis-plugin/target/artemis-plugin-2.5.0-SNAPSHOT-sources.jar>
to /home/jenkins/.m2/repository/org/apache/activemq/artemis-plugin/2.5.0-SNAPSHOT/artemis-plugin-2.5.0-SNAPSHOT-sources.jar
[INFO]                                                                         
[INFO] ------------------------------------------------------------------------
[INFO] Building ActiveMQ Artemis Console 2.5.0-SNAPSHOT
[INFO] ------------------------------------------------------------------------
Downloading: https://repo.maven.apache.org/maven2/com/google/code/maven-replacer-plugin/replacer/1.5.3/replacer-1.5.3.pom
[WARNING] Failed to create parent directories for tracking file /home/jenkins/.m2/repository/com/google/code/maven-replacer-plugin/replacer/1.5.3/replacer-1.5.3.pom.lastUpdated
[INFO] ------------------------------------------------------------------------
[INFO] Reactor Summary:
[INFO] 
[INFO] ActiveMQ Artemis Parent ............................ SUCCESS [  4.490 s]
[INFO] ActiveMQ Artemis Commons ........................... SUCCESS [ 19.909 s]
[INFO] ActiveMQ Artemis Core Client ....................... SUCCESS [ 12.281 s]
[INFO] ActiveMQ Artemis Selector Implementation ........... SUCCESS [  4.210 s]
[INFO] ActiveMQ Artemis JMS Client ........................ SUCCESS [  4.420 s]
[INFO] ActiveMQ Artemis Native POM ........................ SUCCESS [  5.441 s]
[INFO] ActiveMQ Artemis Journal ........................... SUCCESS [  3.807 s]
[INFO] ActiveMQ Artemis JDBC Store ........................ SUCCESS [ 20.850 s]
[INFO] ActiveMQ Artemis Server ............................ SUCCESS [01:38 min]
[INFO] ActiveMQ Artemis Protocols ......................... SUCCESS [  0.193 s]
[INFO] ActiveMQ Artemis AMQP Protocol ..................... SUCCESS [  5.387 s]
[INFO] ActiveMQ Artemis STOMP Protocol .................... SUCCESS [  1.980 s]
[INFO] ActiveMQ Artemis OpenWire Protocol ................. SUCCESS [  2.523 s]
[INFO] ActiveMQ Artemis HQClient Protocol ................. SUCCESS [  0.622 s]
[INFO] ActiveMQ Artemis HornetQ Protocol .................. SUCCESS [  1.094 s]
[INFO] ActiveMQ Artemis MQTT Protocol ..................... SUCCESS [  1.759 s]
[INFO] ActiveMQ Artemis DTO ............................... SUCCESS [  2.205 s]
[INFO] ActiveMQ Artemis Service Extensions ................ SUCCESS [  1.797 s]
[INFO] ActiveMQ Artemis JMS Server ........................ SUCCESS [  2.021 s]
[INFO] ActiveMQ Artemis CDI Integration ................... SUCCESS [  5.501 s]
[INFO] ActiveMQ Artemis Boot .............................. SUCCESS [  0.295 s]
[INFO] ActiveMQ Artemis Tools ............................. SUCCESS [  0.912 s]
[INFO] ActiveMQ Artemis CLI ............................... SUCCESS [ 34.396 s]
[INFO] ActiveMQ Artemis Web ............................... SUCCESS [  5.240 s]
[INFO] ActiveMQ Artemis Web ............................... SUCCESS [01:16 min]
[INFO] ActiveMQ Artemis Core Client All ................... SUCCESS [ 13.443 s]
[INFO] ActiveMQ Artemis JUnit Rules ....................... SUCCESS [ 17.274 s]
[INFO] ActiveMQ Artemis JMS Client All .................... SUCCESS [ 12.184 s]
[INFO] ActiveMQ Artemis RAR POM ........................... SUCCESS [  2.327 s]
[INFO] ActiveMQ Artemis REST Interface Implementation ..... SUCCESS [01:28 min]
[INFO] ActiveMQ Artemis Maven Plugin ...................... SUCCESS [  2.890 s]
[INFO] ActiveMQ Artemis Server OSGi ....................... SUCCESS [ 10.926 s]
[INFO] ActiveMQ Artemis Cons .............................. SUCCESS [  0.139 s]
[INFO] ActiveMQ Artemis HawtIO Branding ................... SUCCESS [  5.110 s]
[INFO] ActiveMQ Artemis HawtIO Plugin ..................... SUCCESS [  0.758 s]
[INFO] ActiveMQ Artemis Console ........................... FAILURE [  0.006 s]
[INFO] ActiveMQ Artemis Spring Integration ................ SKIPPED
[INFO] Apache ActiveMQ Artemis Distribution ............... SKIPPED
[INFO] ActiveMQ Artemis Tests POM ......................... SKIPPED
[INFO] ActiveMQ Artemis Test Support ...................... SKIPPED
[INFO] ActiveMQ Artemis Unit Tests ........................ SKIPPED
[INFO] ActiveMQ Artemis Joram Tests ....................... SKIPPED
[INFO] ActiveMQ Artemis timing Tests ...................... SKIPPED
[INFO] ActiveMQ Artemis JMS Tests ......................... SKIPPED
[INFO] ActiveMQ Artemis Features .......................... SKIPPED
[INFO] ActiveMQ Artemis Integration Tests ................. SKIPPED
[INFO] ActiveMQ Artemis Compatibility Tests ............... SKIPPED
[INFO] ActiveMQ Artemis soak Tests ........................ SKIPPED
[INFO] ActiveMQ Artemis stress Tests ...................... SKIPPED
[INFO] ActiveMQ Artemis performance Tests ................. SKIPPED
[INFO] Smoke Tests ........................................ SKIPPED
[INFO] ActiveMQ Artemis Extra Tests ....................... SKIPPED
[INFO] ------------------------------------------------------------------------
[INFO] BUILD FAILURE
[INFO] ------------------------------------------------------------------------
[INFO] Total time: 07:51 min
[INFO] Finished at: 2018-01-11T15:53:27+00:00
[INFO] Final Memory: 365M/6301M
[INFO] ------------------------------------------------------------------------
[ERROR] Plugin com.google.code.maven-replacer-plugin:replacer:1.5.3 or one of its dependencies
could not be resolved: Failed to read artifact descriptor for com.google.code.maven-replacer-plugin:replacer:jar:1.5.3:
Could not transfer artifact com.google.code.maven-replacer-plugin:replacer:pom:1.5.3 from/to
central (https://repo.maven.apache.org/maven2): /home/jenkins/.m2/repository/com/google/code/maven-replacer-plugin/replacer/1.5.3/replacer-1.5.3.pom.part.lock
(No such file or directory) -> [Help 1]
[ERROR] 
[ERROR] To see the full stack trace of the errors, re-run Maven with the -e switch.
[ERROR] Re-run Maven using the -X switch to enable full debug logging.
[ERROR] 
[ERROR] For more information about the errors and possible solutions, please read the following
articles:
[ERROR] [Help 1] http://cwiki.apache.org/confluence/display/MAVEN/PluginResolutionException
Build step 'Invoke top-level Maven targets' marked build as failure
Performing Post build task...
Could not match :Too many files with unapproved license  : False
Logical operation result is FALSE
Skipping script  : cat ratReport.txt
END OF POST BUILD TASK 	: 0
Recording test results

Mime
View raw message