activemq-commits mailing list archives

Site index · List index
Message view « Date » · « Thread »
Top « Date » · « Thread »
From Apache Jenkins Server <jenk...@builds.apache.org>
Subject Build failed in Jenkins: ActiveMQ-Artemis-Master #1518
Date Thu, 21 Dec 2017 09:06:19 GMT
See <https://builds.apache.org/job/ActiveMQ-Artemis-Master/1518/display/redirect?page=changes>

Changes:

[clebertsuconic] NO-JIRA Fixing SystemPropertyOverrideTest

------------------------------------------
[...truncated 1.63 MB...]
[INFO] Exclude: artemis-native/src/main/c/org_apache_activemq_artemis_jlibaio_LibaioContext.h
[INFO] Exclude: **/dependency-reduced-pom.xml
[INFO] 1352 resources included (use -debug for more details)
[INFO] Rat check: Summary over all files. Unapproved: 0, unknown: 0, generated: 0, approved:
1338 licenses.
[INFO] 
[INFO] --- maven-site-plugin:3.3:attach-descriptor (attach-descriptor) @ artemis-tests-pom
---
[INFO] 
[INFO] >>> maven-source-plugin:2.2.1:jar (attach-sources) > generate-sources @
artemis-tests-pom >>>
[INFO] 
[INFO] --- maven-enforcer-plugin:1.4:enforce (enforce-maven) @ artemis-tests-pom ---
[INFO] 
[INFO] --- maven-enforcer-plugin:1.4:enforce (enforce-java) @ artemis-tests-pom ---
[INFO] 
[INFO] <<< maven-source-plugin:2.2.1:jar (attach-sources) < generate-sources @
artemis-tests-pom <<<
[INFO] 
[INFO] --- maven-source-plugin:2.2.1:jar (attach-sources) @ artemis-tests-pom ---
[INFO] 
[INFO] >>> maven-source-plugin:2.2.1:jar (default) > generate-sources @ artemis-tests-pom
>>>
[INFO] 
[INFO] --- maven-enforcer-plugin:1.4:enforce (enforce-maven) @ artemis-tests-pom ---
[INFO] 
[INFO] --- maven-enforcer-plugin:1.4:enforce (enforce-java) @ artemis-tests-pom ---
[INFO] 
[INFO] <<< maven-source-plugin:2.2.1:jar (default) < generate-sources @ artemis-tests-pom
<<<
[INFO] 
[INFO] --- maven-source-plugin:2.2.1:jar (default) @ artemis-tests-pom ---
[INFO] 
[INFO] --- dependency-check-maven:1.4.3:check (default) @ artemis-tests-pom ---
[INFO] Skipping dependency-check
[INFO] 
[INFO] --- maven-install-plugin:2.4:install (default-install) @ artemis-tests-pom ---
[INFO] Installing <https://builds.apache.org/job/ActiveMQ-Artemis-Master/ws/tests/pom.xml>
to /home/jenkins/.m2/repository/org/apache/activemq/tests/artemis-tests-pom/2.5.0-SNAPSHOT/artemis-tests-pom-2.5.0-SNAPSHOT.pom
[INFO]                                                                         
[INFO] ------------------------------------------------------------------------
[INFO] Building ActiveMQ Artemis Test Support 2.5.0-SNAPSHOT
[INFO] ------------------------------------------------------------------------
[INFO] 
[INFO] --- maven-enforcer-plugin:1.4:enforce (enforce-maven) @ artemis-test-support ---
[INFO] 
[INFO] --- maven-enforcer-plugin:1.4:enforce (enforce-java) @ artemis-test-support ---
[INFO] 
[INFO] --- maven-remote-resources-plugin:1.5:process (process-resource-bundles) @ artemis-test-support
---
[INFO] 
[INFO] --- maven-resources-plugin:2.6:resources (default-resources) @ artemis-test-support
---
[INFO] Using 'UTF-8' encoding to copy filtered resources.
[INFO] skip non existing resourceDirectory <https://builds.apache.org/job/ActiveMQ-Artemis-Master/ws/tests/artemis-test-support/src/main/resources>
[INFO] Copying 3 resources
[INFO] 
[INFO] --- maven-compiler-plugin:3.1:compile (default-compile) @ artemis-test-support ---
[INFO] Changes detected - recompiling the module!
[INFO] Compiling 51 source files to <https://builds.apache.org/job/ActiveMQ-Artemis-Master/ws/tests/artemis-test-support/target/classes>
[INFO] 
[INFO] --- maven-checkstyle-plugin:2.17:check (default) @ artemis-test-support ---
[INFO] Starting audit...
Audit done.
[INFO] 
[INFO] --- apache-rat-plugin:0.12:check (default) @ artemis-test-support ---
[INFO] Enabled default license matchers.
[INFO] Will parse SCM ignores for exclusions...
[INFO] Finished adding exclusions from SCM ignore files.
[INFO] 61 implicit excludes (use -debug for more details).
[INFO] Exclude: **/footer.html
[INFO] Exclude: **/*.txt
[INFO] Exclude: **/*.md
[INFO] Exclude: etc/ide-settings/**
[INFO] Exclude: docs/**/*.json
[INFO] Exclude: docs/**/_book/
[INFO] Exclude: **/target/
[INFO] Exclude: **/META-INF/services/*
[INFO] Exclude: **/META-INF/MANIFEST.MF
[INFO] Exclude: **/*.iml
[INFO] Exclude: **/*.jceks
[INFO] Exclude: **/*.jks
[INFO] Exclude: **/org/apache/activemq/artemis/utils/json/**
[INFO] Exclude: **/org/apache/activemq/artemis/utils/Base64.java
[INFO] Exclude: **/.settings/**
[INFO] Exclude: **/.project
[INFO] Exclude: **/.classpath
[INFO] Exclude: **/.editorconfig
[INFO] Exclude: **/.checkstyle
[INFO] Exclude: **/.factorypath
[INFO] Exclude: **/org.apache.activemq.artemis.cfg
[INFO] Exclude: **/nb-configuration.xml
[INFO] Exclude: **/*.data
[INFO] Exclude: **/*.bin
[INFO] Exclude: **/src/test/resources/keystore
[INFO] Exclude: **/*.log
[INFO] Exclude: **/*.redo
[INFO] Exclude: **/node/**
[INFO] Exclude: **/node_modules/**
[INFO] Exclude: **/package.json
[INFO] Exclude: **/npm-shrinkwrap.json
[INFO] Exclude: **/overlays/**
[INFO] Exclude: **/CMakeFiles/
[INFO] Exclude: **/Makefile
[INFO] Exclude: **/cmake_install.cmake
[INFO] Exclude: artemis-native/src/main/c/org_apache_activemq_artemis_jlibaio_LibaioContext.h
[INFO] Exclude: **/dependency-reduced-pom.xml
[INFO] 52 resources included (use -debug for more details)
[INFO] Rat check: Summary over all files. Unapproved: 0, unknown: 0, generated: 0, approved:
52 licenses.
[INFO] 
[INFO] --- maven-resources-plugin:2.6:testResources (default-testResources) @ artemis-test-support
---
[INFO] Using 'UTF-8' encoding to copy filtered resources.
[INFO] skip non existing resourceDirectory <https://builds.apache.org/job/ActiveMQ-Artemis-Master/ws/tests/artemis-test-support/src/test/resources>
[INFO] Copying 3 resources
[INFO] 
[INFO] --- maven-compiler-plugin:3.1:testCompile (default-testCompile) @ artemis-test-support
---
[INFO] No sources to compile
[INFO] 
[INFO] --- maven-surefire-plugin:2.18.1:test (default-test) @ artemis-test-support ---
[INFO] 
[INFO] --- maven-jar-plugin:2.4:jar (default-jar) @ artemis-test-support ---
[INFO] Building jar: <https://builds.apache.org/job/ActiveMQ-Artemis-Master/ws/tests/artemis-test-support/target/artemis-test-support-2.5.0-SNAPSHOT.jar>
[INFO] 
[INFO] --- maven-site-plugin:3.3:attach-descriptor (attach-descriptor) @ artemis-test-support
---
[INFO] 
[INFO] >>> maven-source-plugin:2.2.1:jar (attach-sources) > generate-sources @
artemis-test-support >>>
[INFO] 
[INFO] --- maven-enforcer-plugin:1.4:enforce (enforce-maven) @ artemis-test-support ---
[INFO] 
[INFO] --- maven-enforcer-plugin:1.4:enforce (enforce-java) @ artemis-test-support ---
[INFO] 
[INFO] <<< maven-source-plugin:2.2.1:jar (attach-sources) < generate-sources @
artemis-test-support <<<
[INFO] 
[INFO] --- maven-source-plugin:2.2.1:jar (attach-sources) @ artemis-test-support ---
[INFO] Building jar: <https://builds.apache.org/job/ActiveMQ-Artemis-Master/ws/tests/artemis-test-support/target/artemis-test-support-2.5.0-SNAPSHOT-sources.jar>
[INFO] 
[INFO] >>> maven-source-plugin:2.2.1:jar (default) > generate-sources @ artemis-test-support
>>>
[INFO] 
[INFO] --- maven-enforcer-plugin:1.4:enforce (enforce-maven) @ artemis-test-support ---
[INFO] 
[INFO] --- maven-enforcer-plugin:1.4:enforce (enforce-java) @ artemis-test-support ---
[INFO] 
[INFO] <<< maven-source-plugin:2.2.1:jar (default) < generate-sources @ artemis-test-support
<<<
[INFO] 
[INFO] --- maven-source-plugin:2.2.1:jar (default) @ artemis-test-support ---
[INFO] 
[INFO] --- dependency-check-maven:1.4.3:check (default) @ artemis-test-support ---
[INFO] Skipping dependency-check
[INFO] 
[INFO] --- maven-install-plugin:2.4:install (default-install) @ artemis-test-support ---
[INFO] Installing <https://builds.apache.org/job/ActiveMQ-Artemis-Master/ws/tests/artemis-test-support/target/artemis-test-support-2.5.0-SNAPSHOT.jar>
to /home/jenkins/.m2/repository/org/apache/activemq/tests/artemis-test-support/2.5.0-SNAPSHOT/artemis-test-support-2.5.0-SNAPSHOT.jar
[INFO] Installing <https://builds.apache.org/job/ActiveMQ-Artemis-Master/ws/tests/artemis-test-support/pom.xml>
to /home/jenkins/.m2/repository/org/apache/activemq/tests/artemis-test-support/2.5.0-SNAPSHOT/artemis-test-support-2.5.0-SNAPSHOT.pom
[INFO] Installing <https://builds.apache.org/job/ActiveMQ-Artemis-Master/ws/tests/artemis-test-support/target/artemis-test-support-2.5.0-SNAPSHOT-sources.jar>
to /home/jenkins/.m2/repository/org/apache/activemq/tests/artemis-test-support/2.5.0-SNAPSHOT/artemis-test-support-2.5.0-SNAPSHOT-sources.jar
[INFO] Installing <https://builds.apache.org/job/ActiveMQ-Artemis-Master/ws/tests/artemis-test-support/target/artemis-test-support-2.5.0-SNAPSHOT-sources.jar>
to /home/jenkins/.m2/repository/org/apache/activemq/tests/artemis-test-support/2.5.0-SNAPSHOT/artemis-test-support-2.5.0-SNAPSHOT-sources.jar
[INFO]                                                                         
[INFO] ------------------------------------------------------------------------
[INFO] Building ActiveMQ Artemis Unit Tests 2.5.0-SNAPSHOT
[INFO] ------------------------------------------------------------------------
[INFO] 
[INFO] --- maven-enforcer-plugin:1.4:enforce (enforce-maven) @ unit-tests ---
[INFO] 
[INFO] --- maven-enforcer-plugin:1.4:enforce (enforce-java) @ unit-tests ---
[INFO] 
[INFO] --- maven-remote-resources-plugin:1.5:process (process-resource-bundles) @ unit-tests
---
[INFO] 
[INFO] --- maven-resources-plugin:2.6:resources (default-resources) @ unit-tests ---
[INFO] Using 'UTF-8' encoding to copy filtered resources.
[INFO] skip non existing resourceDirectory <https://builds.apache.org/job/ActiveMQ-Artemis-Master/ws/tests/unit-tests/src/main/resources>
[INFO] Copying 3 resources
[INFO] 
[INFO] --- maven-compiler-plugin:3.1:compile (default-compile) @ unit-tests ---
[INFO] No sources to compile
[INFO] 
[INFO] --- maven-checkstyle-plugin:2.17:check (default) @ unit-tests ---
[INFO] Starting audit...
[ERROR] <https://builds.apache.org/job/ActiveMQ-Artemis-Master/ws/tests/unit-tests/src/test/java/org/apache/activemq/artemis/tests/unit/core/server/group/impl/SystemPropertyOverrideTest.java>:22:8:
Unused import - org.junit.Ignore. [UnusedImports]
Audit done.
[INFO] There is 1 error reported by Checkstyle 7.7 with <https://builds.apache.org/job/ActiveMQ-Artemis-Master/ws/tests/unit-tests/../../etc/checkstyle.xml>
ruleset.
[ERROR] src/test/java/org/apache/activemq/artemis/tests/unit/core/server/group/impl/SystemPropertyOverrideTest.java:[22,8]
(imports) UnusedImports: Unused import - org.junit.Ignore.
[INFO] ------------------------------------------------------------------------
[INFO] Reactor Summary:
[INFO] 
[INFO] ActiveMQ Artemis Parent ............................ SUCCESS [  4.412 s]
[INFO] ActiveMQ Artemis Commons ........................... SUCCESS [ 21.086 s]
[INFO] ActiveMQ Artemis Core Client ....................... SUCCESS [ 11.738 s]
[INFO] ActiveMQ Artemis Selector Implementation ........... SUCCESS [  4.092 s]
[INFO] ActiveMQ Artemis JMS Client ........................ SUCCESS [  4.719 s]
[INFO] ActiveMQ Artemis Native POM ........................ SUCCESS [  5.900 s]
[INFO] ActiveMQ Artemis Journal ........................... SUCCESS [  3.755 s]
[INFO] ActiveMQ Artemis JDBC Store ........................ SUCCESS [ 20.183 s]
[INFO] ActiveMQ Artemis Server ............................ SUCCESS [01:36 min]
[INFO] ActiveMQ Artemis Protocols ......................... SUCCESS [  0.126 s]
[INFO] ActiveMQ Artemis AMQP Protocol ..................... SUCCESS [  5.411 s]
[INFO] ActiveMQ Artemis STOMP Protocol .................... SUCCESS [  2.232 s]
[INFO] ActiveMQ Artemis OpenWire Protocol ................. SUCCESS [  2.670 s]
[INFO] ActiveMQ Artemis HQClient Protocol ................. SUCCESS [  0.859 s]
[INFO] ActiveMQ Artemis HornetQ Protocol .................. SUCCESS [  1.203 s]
[INFO] ActiveMQ Artemis MQTT Protocol ..................... SUCCESS [  1.828 s]
[INFO] ActiveMQ Artemis DTO ............................... SUCCESS [  1.925 s]
[INFO] ActiveMQ Artemis Service Extensions ................ SUCCESS [  1.891 s]
[INFO] ActiveMQ Artemis JMS Server ........................ SUCCESS [  1.892 s]
[INFO] ActiveMQ Artemis CDI Integration ................... SUCCESS [  5.337 s]
[INFO] ActiveMQ Artemis Boot .............................. SUCCESS [  0.433 s]
[INFO] ActiveMQ Artemis Tools ............................. SUCCESS [  0.860 s]
[INFO] ActiveMQ Artemis CLI ............................... SUCCESS [ 33.208 s]
[INFO] ActiveMQ Artemis Web ............................... SUCCESS [  5.007 s]
[INFO] ActiveMQ Artemis Web ............................... SUCCESS [01:14 min]
[INFO] ActiveMQ Artemis Core Client All ................... SUCCESS [ 13.456 s]
[INFO] ActiveMQ Artemis JUnit Rules ....................... SUCCESS [ 19.505 s]
[INFO] ActiveMQ Artemis JMS Client All .................... SUCCESS [ 12.961 s]
[INFO] ActiveMQ Artemis RAR POM ........................... SUCCESS [  2.260 s]
[INFO] ActiveMQ Artemis REST Interface Implementation ..... SUCCESS [01:29 min]
[INFO] ActiveMQ Artemis Maven Plugin ...................... SUCCESS [  2.796 s]
[INFO] ActiveMQ Artemis Server OSGi ....................... SUCCESS [ 10.974 s]
[INFO] ActiveMQ Artemis Cons .............................. SUCCESS [  0.131 s]
[INFO] ActiveMQ Artemis HawtIO Branding ................... SUCCESS [  5.140 s]
[INFO] ActiveMQ Artemis HawtIO Plugin ..................... SUCCESS [  0.846 s]
[INFO] ActiveMQ Artemis Console ........................... SUCCESS [  4.508 s]
[INFO] ActiveMQ Artemis Spring Integration ................ SUCCESS [  0.787 s]
[INFO] Apache ActiveMQ Artemis Distribution ............... SUCCESS [ 26.438 s]
[INFO] ActiveMQ Artemis Tests POM ......................... SUCCESS [  0.434 s]
[INFO] ActiveMQ Artemis Test Support ...................... SUCCESS [  1.723 s]
[INFO] ActiveMQ Artemis Unit Tests ........................ FAILURE [  2.004 s]
[INFO] ActiveMQ Artemis Joram Tests ....................... SKIPPED
[INFO] ActiveMQ Artemis timing Tests ...................... SKIPPED
[INFO] ActiveMQ Artemis JMS Tests ......................... SKIPPED
[INFO] ActiveMQ Artemis Features .......................... SKIPPED
[INFO] ActiveMQ Artemis Integration Tests ................. SKIPPED
[INFO] ActiveMQ Artemis Compatibility Tests ............... SKIPPED
[INFO] ActiveMQ Artemis soak Tests ........................ SKIPPED
[INFO] ActiveMQ Artemis stress Tests ...................... SKIPPED
[INFO] ActiveMQ Artemis performance Tests ................. SKIPPED
[INFO] Smoke Tests ........................................ SKIPPED
[INFO] ActiveMQ Artemis Extra Tests ....................... SKIPPED
[INFO] ------------------------------------------------------------------------
[INFO] BUILD FAILURE
[INFO] ------------------------------------------------------------------------
[INFO] Total time: 08:28 min
[INFO] Finished at: 2017-12-21T09:06:06+00:00
[INFO] Final Memory: 327M/5376M
[INFO] ------------------------------------------------------------------------
[ERROR] Failed to execute goal org.apache.maven.plugins:maven-checkstyle-plugin:2.17:check
(default) on project unit-tests: You have 1 Checkstyle violation. -> [Help 1]
[ERROR] 
[ERROR] To see the full stack trace of the errors, re-run Maven with the -e switch.
[ERROR] Re-run Maven using the -X switch to enable full debug logging.
[ERROR] 
[ERROR] For more information about the errors and possible solutions, please read the following
articles:
[ERROR] [Help 1] http://cwiki.apache.org/confluence/display/MAVEN/MojoFailureException
[ERROR] 
[ERROR] After correcting the problems, you can resume the build with the command
[ERROR]   mvn <goals> -rf :unit-tests
Build step 'Invoke top-level Maven targets' marked build as failure
Performing Post build task...
Could not match :Too many files with unapproved license  : False
Logical operation result is FALSE
Skipping script  : cat ratReport.txt
END OF POST BUILD TASK 	: 0
Recording test results

Mime
View raw message