activemq-commits mailing list archives

Site index · List index
Message view « Date » · « Thread »
Top « Date » · « Thread »
From Apache Jenkins Server <jenk...@builds.apache.org>
Subject Build failed in Jenkins: ActiveMQ-Java8-All-UnitTests #759
Date Wed, 01 Nov 2017 22:34:55 GMT
See <https://builds.apache.org/job/ActiveMQ-Java8-All-UnitTests/759/display/redirect?page=changes>

Changes:

[gtully] [AMQ-6847] limit the retry loop to one iteration overa all pending

------------------------------------------
[...truncated 285.64 KB...]
Tests run: 7, Failures: 0, Errors: 0, Skipped: 0, Time elapsed: 0.237 sec - in org.apache.activemq.command.MessageTest
Running org.apache.activemq.config.BrokerPropertiesTest
Tests run: 2, Failures: 0, Errors: 0, Skipped: 0, Time elapsed: 0.673 sec - in org.apache.activemq.config.BrokerPropertiesTest
Running org.apache.activemq.config.BrokerXmlConfigFromJNDITest
Tests run: 1, Failures: 0, Errors: 0, Skipped: 0, Time elapsed: 1.526 sec - in org.apache.activemq.config.BrokerXmlConfigFromJNDITest
Running org.apache.activemq.config.BrokerXmlConfigTest
Tests run: 1, Failures: 0, Errors: 0, Skipped: 0, Time elapsed: 1.237 sec - in org.apache.activemq.config.BrokerXmlConfigTest
Running org.apache.activemq.config.ConfigTest
Tests run: 7, Failures: 0, Errors: 0, Skipped: 0, Time elapsed: 4.404 sec - in org.apache.activemq.config.ConfigTest
Running org.apache.activemq.config.JDBCConfigTest
Tests run: 1, Failures: 0, Errors: 0, Skipped: 0, Time elapsed: 3.126 sec - in org.apache.activemq.config.JDBCConfigTest
Running org.apache.activemq.console.command.AMQ3410Test
Tests run: 5, Failures: 0, Errors: 0, Skipped: 0, Time elapsed: 4.289 sec - in org.apache.activemq.console.command.AMQ3410Test
Running org.apache.activemq.console.command.AMQ3411Test
Tests run: 5, Failures: 0, Errors: 0, Skipped: 0, Time elapsed: 5.828 sec - in org.apache.activemq.console.command.AMQ3411Test
Running org.apache.activemq.console.command.PurgeCommandTest
Tests run: 6, Failures: 0, Errors: 0, Skipped: 0, Time elapsed: 4.229 sec - in org.apache.activemq.console.command.PurgeCommandTest
Running org.apache.activemq.filter.DestinationFilterTest
Tests run: 5, Failures: 0, Errors: 0, Skipped: 0, Time elapsed: 0.057 sec - in org.apache.activemq.filter.DestinationFilterTest
Running org.apache.activemq.filter.DestinationMapMemoryTest
Tests run: 2, Failures: 0, Errors: 0, Skipped: 0, Time elapsed: 0.055 sec - in org.apache.activemq.filter.DestinationMapMemoryTest
Running org.apache.activemq.filter.DestinationMapTempDestinationTest
Tests run: 1, Failures: 0, Errors: 0, Skipped: 0, Time elapsed: 0.259 sec - in org.apache.activemq.filter.DestinationMapTempDestinationTest
Running org.apache.activemq.filter.DestinationMapTest
Tests run: 17, Failures: 0, Errors: 0, Skipped: 0, Time elapsed: 0.065 sec - in org.apache.activemq.filter.DestinationMapTest
Running org.apache.activemq.filter.DestinationPathTest
Tests run: 1, Failures: 0, Errors: 0, Skipped: 0, Time elapsed: 0.127 sec - in org.apache.activemq.filter.DestinationPathTest
Running org.apache.activemq.filter.DummyPolicyTest
Tests run: 1, Failures: 0, Errors: 0, Skipped: 0, Time elapsed: 0.402 sec - in org.apache.activemq.filter.DummyPolicyTest
Running org.apache.activemq.jmx.JmxAuditLogTest
Tests run: 1, Failures: 0, Errors: 0, Skipped: 0, Time elapsed: 1.212 sec - in org.apache.activemq.jmx.JmxAuditLogTest
Running org.apache.activemq.jmx.JmxCreateNCTest
Tests run: 1, Failures: 0, Errors: 0, Skipped: 0, Time elapsed: 0.873 sec - in org.apache.activemq.jmx.JmxCreateNCTest
Running org.apache.activemq.jmx.OpenTypeSupportTest
Tests run: 2, Failures: 0, Errors: 0, Skipped: 0, Time elapsed: 1.032 sec - in org.apache.activemq.jmx.OpenTypeSupportTest
Running org.apache.activemq.jmx.TotalMessageCountTest
Tests run: 1, Failures: 0, Errors: 0, Skipped: 0, Time elapsed: 1.303 sec - in org.apache.activemq.jmx.TotalMessageCountTest
Running org.apache.activemq.jndi.ActiveMQInitialContextFactoryTest
Tests run: 3, Failures: 0, Errors: 0, Skipped: 0, Time elapsed: 0.233 sec - in org.apache.activemq.jndi.ActiveMQInitialContextFactoryTest
Running org.apache.activemq.jndi.ActiveMQSslInitialContextFactoryTest
Tests run: 4, Failures: 0, Errors: 0, Skipped: 0, Time elapsed: 0.303 sec - in org.apache.activemq.jndi.ActiveMQSslInitialContextFactoryTest
Running org.apache.activemq.jndi.ActiveMQWASInitialContextFactoryTest
Tests run: 1, Failures: 0, Errors: 0, Skipped: 0, Time elapsed: 0.24 sec - in org.apache.activemq.jndi.ActiveMQWASInitialContextFactoryTest
Running org.apache.activemq.jndi.CustomConnectionFactoryNameTest
Tests run: 4, Failures: 0, Errors: 0, Skipped: 0, Time elapsed: 0.244 sec - in org.apache.activemq.jndi.CustomConnectionFactoryNameTest
Running org.apache.activemq.jndi.DestinationNameWithSlashTest
Tests run: 1, Failures: 0, Errors: 0, Skipped: 0, Time elapsed: 0.286 sec - in org.apache.activemq.jndi.DestinationNameWithSlashTest
Running org.apache.activemq.jndi.InitialContextTest
Tests run: 4, Failures: 0, Errors: 0, Skipped: 0, Time elapsed: 0.252 sec - in org.apache.activemq.jndi.InitialContextTest
Running org.apache.activemq.jndi.ObjectFactoryTest
Tests run: 2, Failures: 0, Errors: 0, Skipped: 0, Time elapsed: 0.241 sec - in org.apache.activemq.jndi.ObjectFactoryTest
Running org.apache.activemq.jndi.XAConnectionFactoryTest
Tests run: 4, Failures: 0, Errors: 0, Skipped: 0, Time elapsed: 0.277 sec - in org.apache.activemq.jndi.XAConnectionFactoryTest
Running org.apache.activemq.jndi.XASslConnectionFactoryTest
Tests run: 4, Failures: 0, Errors: 0, Skipped: 0, Time elapsed: 0.304 sec - in org.apache.activemq.jndi.XASslConnectionFactoryTest
Running org.apache.activemq.joramtests.JoramJmsTest
Tests run: 196, Failures: 0, Errors: 0, Skipped: 0, Time elapsed: 8.054 sec - in org.apache.activemq.joramtests.JoramJmsTest
Running org.apache.activemq.leveldb.LevelDBStoreBrokerTest
Tests run: 127, Failures: 0, Errors: 0, Skipped: 0, Time elapsed: 20.456 sec - in org.apache.activemq.leveldb.LevelDBStoreBrokerTest
Running org.apache.activemq.management.BoundaryStatisticTest
Tests run: 1, Failures: 0, Errors: 0, Skipped: 0, Time elapsed: 0.217 sec - in org.apache.activemq.management.BoundaryStatisticTest
Running org.apache.activemq.management.BoundedRangeStatisticTest
Tests run: 1, Failures: 0, Errors: 0, Skipped: 0, Time elapsed: 0.666 sec - in org.apache.activemq.management.BoundedRangeStatisticTest
Running org.apache.activemq.management.CountStatisticTest
Tests run: 1, Failures: 0, Errors: 0, Skipped: 0, Time elapsed: 0.63 sec - in org.apache.activemq.management.CountStatisticTest
Running org.apache.activemq.management.RangeStatisticTest
Tests run: 1, Failures: 0, Errors: 0, Skipped: 0, Time elapsed: 0.622 sec - in org.apache.activemq.management.RangeStatisticTest
Running org.apache.activemq.management.TimeStatisticTest
Tests run: 1, Failures: 0, Errors: 0, Skipped: 0, Time elapsed: 0.64 sec - in org.apache.activemq.management.TimeStatisticTest
Running org.apache.activemq.memory.MemoryPropertyTest
Tests run: 1, Failures: 0, Errors: 0, Skipped: 0, Time elapsed: 1.23 sec - in org.apache.activemq.memory.MemoryPropertyTest
Running org.apache.activemq.memory.buffer.OrderBasedMemoryBufferTest
Tests run: 1, Failures: 0, Errors: 0, Skipped: 0, Time elapsed: 0.163 sec - in org.apache.activemq.memory.buffer.OrderBasedMemoryBufferTest
Running org.apache.activemq.memory.buffer.SizeBasedMessageBufferTest
Tests run: 1, Failures: 0, Errors: 0, Skipped: 0, Time elapsed: 0.154 sec - in org.apache.activemq.memory.buffer.SizeBasedMessageBufferTest
Running org.apache.activemq.network.CheckDuplicateMessagesOnDuplexTest
Tests run: 1, Failures: 0, Errors: 0, Skipped: 0, Time elapsed: 8.333 sec - in org.apache.activemq.network.CheckDuplicateMessagesOnDuplexTest
Running org.apache.activemq.network.CompressionOverNetworkTest

Results :

Failed tests: 
  AMQ4930Test.testWithStatsDisabled:72->doTestBrowsePending:120 No growth: 190665 >=
198996.0
  AMQ4930Test.testBrowsePendingNonPersistent:63->doTestBrowsePending:120 No growth: 136430
>= 155519.2

Tests run: 2701, Failures: 2, Errors: 0, Skipped: 35

[JENKINS] Recording test results
Tests run: 6, Failures: 0, Errors: 0, Skipped: 0, Time elapsed: 9.283 sec - in org.apache.activemq.network.CompressionOverNetworkTest
[INFO] ------------------------------------------------------------------------
[INFO] Reactor Summary:
[INFO] 
[INFO] ActiveMQ ........................................... SUCCESS [  4.694 s]
[INFO] ActiveMQ :: Client ................................. SUCCESS [01:36 min]
[INFO] ActiveMQ :: Openwire Legacy Support ................ SUCCESS [  5.200 s]
[INFO] ActiveMQ :: JAAS ................................... SUCCESS [ 32.899 s]
[INFO] ActiveMQ :: Broker ................................. SUCCESS [ 55.098 s]
[INFO] ActiveMQ :: KahaDB Store ........................... SUCCESS [02:39 min]
[INFO] ActiveMQ :: STOMP Protocol ......................... SUCCESS [13:16 min]
[INFO] ActiveMQ :: MQTT Protocol .......................... SUCCESS [19:57 min]
[INFO] ActiveMQ :: JDBC Store ............................. SUCCESS [  4.297 s]
[INFO] ActiveMQ :: LevelDB Store .......................... SUCCESS [04:53 min]
[INFO] ActiveMQ :: Generic JMS Pool ....................... SUCCESS [ 51.467 s]
[INFO] ActiveMQ :: Pool ................................... SUCCESS [  7.774 s]
[INFO] ActiveMQ :: RA ..................................... SUCCESS [01:36 min]
[INFO] ActiveMQ :: Spring ................................. SUCCESS [ 59.625 s]
[INFO] ActiveMQ :: Console ................................ SUCCESS [  8.236 s]
[INFO] ActiveMQ :: Partition Management ................... SUCCESS [ 21.927 s]
[INFO] ActiveMQ :: Runtime Configuration .................. SUCCESS [08:32 min]
[INFO] ActiveMQ :: Tooling ................................ SUCCESS [  1.349 s]
[INFO] ActiveMQ :: JUnit Rule ............................. SUCCESS [  5.328 s]
[INFO] ActiveMQ :: Unit Tests ............................. FAILURE [  02:52 h]
[INFO] ------------------------------------------------------------------------
[INFO] BUILD FAILURE
[INFO] ------------------------------------------------------------------------
[INFO] Total time: 03:50 h
[INFO] Finished at: 2017-11-01T22:34:31+00:00
[INFO] Final Memory: 111M/1013M
[INFO] ------------------------------------------------------------------------
Waiting for Jenkins to finish collecting data
[ERROR] Failed to execute goal org.apache.maven.plugins:maven-surefire-plugin:2.16:test (default-test)
on project activemq-unit-tests: ExecutionException; nested exception is java.util.concurrent.ExecutionException:
java.lang.RuntimeException: There was an error in the forked process
[ERROR] java.lang.OutOfMemoryError: Java heap space
[ERROR] -> [Help 1]
org.apache.maven.lifecycle.LifecycleExecutionException: Failed to execute goal org.apache.maven.plugins:maven-surefire-plugin:2.16:test
(default-test) on project activemq-unit-tests: ExecutionException; nested exception is java.util.concurrent.ExecutionException:
java.lang.RuntimeException: There was an error in the forked process
java.lang.OutOfMemoryError: Java heap space

	at org.apache.maven.lifecycle.internal.MojoExecutor.execute(MojoExecutor.java:212)
	at org.apache.maven.lifecycle.internal.MojoExecutor.execute(MojoExecutor.java:153)
	at org.apache.maven.lifecycle.internal.MojoExecutor.execute(MojoExecutor.java:145)
	at org.apache.maven.lifecycle.internal.LifecycleModuleBuilder.buildProject(LifecycleModuleBuilder.java:116)
	at org.apache.maven.lifecycle.internal.LifecycleModuleBuilder.buildProject(LifecycleModuleBuilder.java:80)
	at org.apache.maven.lifecycle.internal.builder.singlethreaded.SingleThreadedBuilder.build(SingleThreadedBuilder.java:51)
	at org.apache.maven.lifecycle.internal.LifecycleStarter.execute(LifecycleStarter.java:128)
	at org.apache.maven.DefaultMaven.doExecute(DefaultMaven.java:307)
	at org.apache.maven.DefaultMaven.doExecute(DefaultMaven.java:193)
	at org.apache.maven.DefaultMaven.execute(DefaultMaven.java:106)
	at org.jvnet.hudson.maven3.launcher.Maven33Launcher.main(Maven33Launcher.java:129)
	at sun.reflect.NativeMethodAccessorImpl.invoke0(Native Method)
	at sun.reflect.NativeMethodAccessorImpl.invoke(NativeMethodAccessorImpl.java:62)
	at sun.reflect.DelegatingMethodAccessorImpl.invoke(DelegatingMethodAccessorImpl.java:43)
	at java.lang.reflect.Method.invoke(Method.java:498)
	at org.codehaus.plexus.classworlds.launcher.Launcher.launchStandard(Launcher.java:330)
	at org.codehaus.plexus.classworlds.launcher.Launcher.launch(Launcher.java:238)
	at jenkins.maven3.agent.Maven33Main.launch(Maven33Main.java:176)
	at sun.reflect.NativeMethodAccessorImpl.invoke0(Native Method)
	at sun.reflect.NativeMethodAccessorImpl.invoke(NativeMethodAccessorImpl.java:62)
	at sun.reflect.DelegatingMethodAccessorImpl.invoke(DelegatingMethodAccessorImpl.java:43)
	at java.lang.reflect.Method.invoke(Method.java:498)
	at hudson.maven.Maven3Builder.call(Maven3Builder.java:139)
	at hudson.maven.Maven3Builder.call(Maven3Builder.java:70)
	at hudson.remoting.UserRequest.perform(UserRequest.java:181)
	at hudson.remoting.UserRequest.perform(UserRequest.java:52)
	at hudson.remoting.Request$2.run(Request.java:336)
	at hudson.remoting.InterceptingExecutorService$1.call(InterceptingExecutorService.java:68)
	at java.util.concurrent.FutureTask.run(FutureTask.java:266)
	at java.util.concurrent.ThreadPoolExecutor.runWorker(ThreadPoolExecutor.java:1149)
	at java.util.concurrent.ThreadPoolExecutor$Worker.run(ThreadPoolExecutor.java:624)
	at java.lang.Thread.run(Thread.java:748)
Caused by: org.apache.maven.plugin.MojoFailureException: ExecutionException; nested exception
is java.util.concurrent.ExecutionException: java.lang.RuntimeException: There was an error
in the forked process
java.lang.OutOfMemoryError: Java heap space

	at org.apache.maven.plugin.surefire.SurefirePlugin.assertNoException(SurefirePlugin.java:198)
	at org.apache.maven.plugin.surefire.SurefirePlugin.handleSummary(SurefirePlugin.java:188)
	at org.apache.maven.plugin.surefire.AbstractSurefireMojo.executeAfterPreconditionsChecked(AbstractSurefireMojo.java:852)
	at org.apache.maven.plugin.surefire.AbstractSurefireMojo.execute(AbstractSurefireMojo.java:720)
	at org.apache.maven.plugin.DefaultBuildPluginManager.executeMojo(DefaultBuildPluginManager.java:134)
	at org.apache.maven.lifecycle.internal.MojoExecutor.execute(MojoExecutor.java:207)
	... 31 more
Caused by: org.apache.maven.surefire.booter.SurefireBooterForkException: ExecutionException;
nested exception is java.util.concurrent.ExecutionException: java.lang.RuntimeException: There
was an error in the forked process
java.lang.OutOfMemoryError: Java heap space

	at org.apache.maven.plugin.surefire.booterclient.ForkStarter.runSuitesForkPerTestSet(ForkStarter.java:316)
	at org.apache.maven.plugin.surefire.booterclient.ForkStarter.run(ForkStarter.java:169)
	at org.apache.maven.plugin.surefire.AbstractSurefireMojo.executeProvider(AbstractSurefireMojo.java:958)
	at org.apache.maven.plugin.surefire.AbstractSurefireMojo.executeAfterPreconditionsChecked(AbstractSurefireMojo.java:822)
	... 34 more
Caused by: java.util.concurrent.ExecutionException: java.lang.RuntimeException: There was
an error in the forked process
java.lang.OutOfMemoryError: Java heap space

	at java.util.concurrent.FutureTask.report(FutureTask.java:122)
	at java.util.concurrent.FutureTask.get(FutureTask.java:192)
	at org.apache.maven.plugin.surefire.booterclient.ForkStarter.runSuitesForkPerTestSet(ForkStarter.java:300)
	... 37 more
Caused by: java.lang.RuntimeException: There was an error in the forked process
java.lang.OutOfMemoryError: Java heap space

	at org.apache.maven.plugin.surefire.booterclient.ForkStarter.fork(ForkStarter.java:479)
	at org.apache.maven.plugin.surefire.booterclient.ForkStarter.fork(ForkStarter.java:352)
	at org.apache.maven.plugin.surefire.booterclient.ForkStarter.access$300(ForkStarter.java:85)
	at org.apache.maven.plugin.surefire.booterclient.ForkStarter$2.call(ForkStarter.java:288)
	at org.apache.maven.plugin.surefire.booterclient.ForkStarter$2.call(ForkStarter.java:283)
	... 4 more
[ERROR] 
[ERROR] Re-run Maven using the -X switch to enable full debug logging.
[ERROR] 
[ERROR] For more information about the errors and possible solutions, please read the following
articles:
[ERROR] [Help 1] http://cwiki.apache.org/confluence/display/MAVEN/MojoFailureException
[ERROR] 
[ERROR] After correcting the problems, you can resume the build with the command
[ERROR]   mvn <goals> -rf :activemq-unit-tests
[JENKINS] Archiving <https://builds.apache.org/job/ActiveMQ-Java8-All-UnitTests/ws/activemq-kahadb-store/pom.xml>
to org.apache.activemq/activemq-kahadb-store/5.16.0-SNAPSHOT/activemq-kahadb-store-5.16.0-SNAPSHOT.pom
[JENKINS] Archiving <https://builds.apache.org/job/ActiveMQ-Java8-All-UnitTests/ws/activemq-kahadb-store/target/activemq-kahadb-store-5.16.0-SNAPSHOT.jar>
to org.apache.activemq/activemq-kahadb-store/5.16.0-SNAPSHOT/activemq-kahadb-store-5.16.0-SNAPSHOT.jar
[JENKINS] Archiving <https://builds.apache.org/job/ActiveMQ-Java8-All-UnitTests/ws/activemq-unit-tests/pom.xml>
to org.apache.activemq/activemq-unit-tests/5.16.0-SNAPSHOT/activemq-unit-tests-5.16.0-SNAPSHOT.pom
[Fast Archiver] Compressed 72.14 KB of artifacts by 88.7% relative to #757
[JENKINS] Archiving <https://builds.apache.org/job/ActiveMQ-Java8-All-UnitTests/ws/activemq-openwire-legacy/pom.xml>
to org.apache.activemq/activemq-openwire-legacy/5.16.0-SNAPSHOT/activemq-openwire-legacy-5.16.0-SNAPSHOT.pom
[JENKINS] Archiving <https://builds.apache.org/job/ActiveMQ-Java8-All-UnitTests/ws/activemq-openwire-legacy/target/activemq-openwire-legacy-5.16.0-SNAPSHOT.jar>
to org.apache.activemq/activemq-openwire-legacy/5.16.0-SNAPSHOT/activemq-openwire-legacy-5.16.0-SNAPSHOT.jar
[JENKINS] Archiving <https://builds.apache.org/job/ActiveMQ-Java8-All-UnitTests/ws/activemq-client/pom.xml>
to org.apache.activemq/activemq-client/5.16.0-SNAPSHOT/activemq-client-5.16.0-SNAPSHOT.pom
[JENKINS] Archiving <https://builds.apache.org/job/ActiveMQ-Java8-All-UnitTests/ws/activemq-client/target/activemq-client-5.16.0-SNAPSHOT.jar>
to org.apache.activemq/activemq-client/5.16.0-SNAPSHOT/activemq-client-5.16.0-SNAPSHOT.jar
[JENKINS] Archiving <https://builds.apache.org/job/ActiveMQ-Java8-All-UnitTests/ws/activemq-tooling/activemq-junit/pom.xml>
to org.apache.activemq.tooling/activemq-junit/5.16.0-SNAPSHOT/activemq-junit-5.16.0-SNAPSHOT.pom
[JENKINS] Archiving <https://builds.apache.org/job/ActiveMQ-Java8-All-UnitTests/ws/activemq-tooling/activemq-junit/target/activemq-junit-5.16.0-SNAPSHOT.jar>
to org.apache.activemq.tooling/activemq-junit/5.16.0-SNAPSHOT/activemq-junit-5.16.0-SNAPSHOT.jar
[JENKINS] Archiving <https://builds.apache.org/job/ActiveMQ-Java8-All-UnitTests/ws/activemq-tooling/pom.xml>
to org.apache.activemq.tooling/activemq-tooling/5.16.0-SNAPSHOT/activemq-tooling-5.16.0-SNAPSHOT.pom
[JENKINS] Archiving <https://builds.apache.org/job/ActiveMQ-Java8-All-UnitTests/ws/activemq-jms-pool/pom.xml>
to org.apache.activemq/activemq-jms-pool/5.16.0-SNAPSHOT/activemq-jms-pool-5.16.0-SNAPSHOT.pom
[JENKINS] Archiving <https://builds.apache.org/job/ActiveMQ-Java8-All-UnitTests/ws/activemq-jms-pool/target/activemq-jms-pool-5.16.0-SNAPSHOT.jar>
to org.apache.activemq/activemq-jms-pool/5.16.0-SNAPSHOT/activemq-jms-pool-5.16.0-SNAPSHOT.jar
[JENKINS] Archiving <https://builds.apache.org/job/ActiveMQ-Java8-All-UnitTests/ws/activemq-pool/pom.xml>
to org.apache.activemq/activemq-pool/5.16.0-SNAPSHOT/activemq-pool-5.16.0-SNAPSHOT.pom
[JENKINS] Archiving <https://builds.apache.org/job/ActiveMQ-Java8-All-UnitTests/ws/activemq-pool/target/activemq-pool-5.16.0-SNAPSHOT.jar>
to org.apache.activemq/activemq-pool/5.16.0-SNAPSHOT/activemq-pool-5.16.0-SNAPSHOT.jar
[JENKINS] Archiving <https://builds.apache.org/job/ActiveMQ-Java8-All-UnitTests/ws/activemq-jdbc-store/pom.xml>
to org.apache.activemq/activemq-jdbc-store/5.16.0-SNAPSHOT/activemq-jdbc-store-5.16.0-SNAPSHOT.pom
[JENKINS] Archiving <https://builds.apache.org/job/ActiveMQ-Java8-All-UnitTests/ws/activemq-jdbc-store/target/activemq-jdbc-store-5.16.0-SNAPSHOT.jar>
to org.apache.activemq/activemq-jdbc-store/5.16.0-SNAPSHOT/activemq-jdbc-store-5.16.0-SNAPSHOT.jar
[JENKINS] Archiving <https://builds.apache.org/job/ActiveMQ-Java8-All-UnitTests/ws/activemq-runtime-config/pom.xml>
to org.apache.activemq/activemq-runtime-config/5.16.0-SNAPSHOT/activemq-runtime-config-5.16.0-SNAPSHOT.pom
[JENKINS] Archiving <https://builds.apache.org/job/ActiveMQ-Java8-All-UnitTests/ws/activemq-runtime-config/target/activemq-runtime-config-5.16.0-SNAPSHOT.jar>
to org.apache.activemq/activemq-runtime-config/5.16.0-SNAPSHOT/activemq-runtime-config-5.16.0-SNAPSHOT.jar
[JENKINS] Archiving <https://builds.apache.org/job/ActiveMQ-Java8-All-UnitTests/ws/pom.xml>
to org.apache.activemq/activemq-parent/5.16.0-SNAPSHOT/activemq-parent-5.16.0-SNAPSHOT.pom
[Fast Archiver] Compressed 60.60 KB of artifacts by 52.8% relative to #758
[JENKINS] Archiving <https://builds.apache.org/job/ActiveMQ-Java8-All-UnitTests/ws/activemq-stomp/pom.xml>
to org.apache.activemq/activemq-stomp/5.16.0-SNAPSHOT/activemq-stomp-5.16.0-SNAPSHOT.pom
[JENKINS] Archiving <https://builds.apache.org/job/ActiveMQ-Java8-All-UnitTests/ws/activemq-stomp/target/activemq-stomp-5.16.0-SNAPSHOT.jar>
to org.apache.activemq/activemq-stomp/5.16.0-SNAPSHOT/activemq-stomp-5.16.0-SNAPSHOT.jar
[JENKINS] Archiving <https://builds.apache.org/job/ActiveMQ-Java8-All-UnitTests/ws/activemq-broker/pom.xml>
to org.apache.activemq/activemq-broker/5.16.0-SNAPSHOT/activemq-broker-5.16.0-SNAPSHOT.pom
[JENKINS] Archiving <https://builds.apache.org/job/ActiveMQ-Java8-All-UnitTests/ws/activemq-broker/target/activemq-broker-5.16.0-SNAPSHOT.jar>
to org.apache.activemq/activemq-broker/5.16.0-SNAPSHOT/activemq-broker-5.16.0-SNAPSHOT.jar
[JENKINS] Archiving <https://builds.apache.org/job/ActiveMQ-Java8-All-UnitTests/ws/activemq-broker/target/activemq-broker-5.16.0-SNAPSHOT-tests.jar>
to org.apache.activemq/activemq-broker/5.16.0-SNAPSHOT/activemq-broker-5.16.0-SNAPSHOT-tests.jar
[JENKINS] Archiving <https://builds.apache.org/job/ActiveMQ-Java8-All-UnitTests/ws/activemq-mqtt/pom.xml>
to org.apache.activemq/activemq-mqtt/5.16.0-SNAPSHOT/activemq-mqtt-5.16.0-SNAPSHOT.pom
[JENKINS] Archiving <https://builds.apache.org/job/ActiveMQ-Java8-All-UnitTests/ws/activemq-mqtt/target/activemq-mqtt-5.16.0-SNAPSHOT.jar>
to org.apache.activemq/activemq-mqtt/5.16.0-SNAPSHOT/activemq-mqtt-5.16.0-SNAPSHOT.jar
[JENKINS] Archiving <https://builds.apache.org/job/ActiveMQ-Java8-All-UnitTests/ws/activemq-jaas/pom.xml>
to org.apache.activemq/activemq-jaas/5.16.0-SNAPSHOT/activemq-jaas-5.16.0-SNAPSHOT.pom
[JENKINS] Archiving <https://builds.apache.org/job/ActiveMQ-Java8-All-UnitTests/ws/activemq-jaas/target/activemq-jaas-5.16.0-SNAPSHOT.jar>
to org.apache.activemq/activemq-jaas/5.16.0-SNAPSHOT/activemq-jaas-5.16.0-SNAPSHOT.jar
[JENKINS] Archiving <https://builds.apache.org/job/ActiveMQ-Java8-All-UnitTests/ws/activemq-ra/pom.xml>
to org.apache.activemq/activemq-ra/5.16.0-SNAPSHOT/activemq-ra-5.16.0-SNAPSHOT.pom
[JENKINS] Archiving <https://builds.apache.org/job/ActiveMQ-Java8-All-UnitTests/ws/activemq-ra/target/activemq-ra-5.16.0-SNAPSHOT.jar>
to org.apache.activemq/activemq-ra/5.16.0-SNAPSHOT/activemq-ra-5.16.0-SNAPSHOT.jar
[JENKINS] Archiving <https://builds.apache.org/job/ActiveMQ-Java8-All-UnitTests/ws/activemq-ra/target/xbean/activemq-ra.xsd>
to org.apache.activemq/activemq-ra/5.16.0-SNAPSHOT/activemq-ra-5.16.0-SNAPSHOT.xsd
[JENKINS] Archiving <https://builds.apache.org/job/ActiveMQ-Java8-All-UnitTests/ws/activemq-ra/target/xbean/activemq-ra.xsd.html>
to org.apache.activemq/activemq-ra/5.16.0-SNAPSHOT/activemq-ra-5.16.0-SNAPSHOT-schema.html
[JENKINS] Archiving <https://builds.apache.org/job/ActiveMQ-Java8-All-UnitTests/ws/activemq-ra/target/xbean/activemq-ra.xsd.html>
to org.apache.activemq/activemq-ra/5.16.0-SNAPSHOT/activemq-ra-5.16.0-SNAPSHOT.xsd.html
[JENKINS] Archiving <https://builds.apache.org/job/ActiveMQ-Java8-All-UnitTests/ws/activemq-partition/pom.xml>
to org.apache.activemq/activemq-partition/5.16.0-SNAPSHOT/activemq-partition-5.16.0-SNAPSHOT.pom
[JENKINS] Archiving <https://builds.apache.org/job/ActiveMQ-Java8-All-UnitTests/ws/activemq-partition/target/activemq-partition-5.16.0-SNAPSHOT.jar>
to org.apache.activemq/activemq-partition/5.16.0-SNAPSHOT/activemq-partition-5.16.0-SNAPSHOT.jar
[JENKINS] Archiving <https://builds.apache.org/job/ActiveMQ-Java8-All-UnitTests/ws/activemq-console/pom.xml>
to org.apache.activemq/activemq-console/5.16.0-SNAPSHOT/activemq-console-5.16.0-SNAPSHOT.pom
[JENKINS] Archiving <https://builds.apache.org/job/ActiveMQ-Java8-All-UnitTests/ws/activemq-console/target/activemq-console-5.16.0-SNAPSHOT.jar>
to org.apache.activemq/activemq-console/5.16.0-SNAPSHOT/activemq-console-5.16.0-SNAPSHOT.jar
[JENKINS] Archiving <https://builds.apache.org/job/ActiveMQ-Java8-All-UnitTests/ws/activemq-spring/pom.xml>
to org.apache.activemq/activemq-spring/5.16.0-SNAPSHOT/activemq-spring-5.16.0-SNAPSHOT.pom
[JENKINS] Archiving <https://builds.apache.org/job/ActiveMQ-Java8-All-UnitTests/ws/activemq-spring/target/activemq-spring-5.16.0-SNAPSHOT.jar>
to org.apache.activemq/activemq-spring/5.16.0-SNAPSHOT/activemq-spring-5.16.0-SNAPSHOT.jar
[JENKINS] Archiving <https://builds.apache.org/job/ActiveMQ-Java8-All-UnitTests/ws/activemq-spring/target/classes/activemq.xsd>
to org.apache.activemq/activemq-spring/5.16.0-SNAPSHOT/activemq-spring-5.16.0-SNAPSHOT.xsd
[JENKINS] Archiving <https://builds.apache.org/job/ActiveMQ-Java8-All-UnitTests/ws/activemq-spring/target/classes/activemq.xsd.html>
to org.apache.activemq/activemq-spring/5.16.0-SNAPSHOT/activemq-spring-5.16.0-SNAPSHOT-schema.html
[Fast Archiver] Compressed 898.17 KB of artifacts by 74.8% relative to #758
[JENKINS] Archiving <https://builds.apache.org/job/ActiveMQ-Java8-All-UnitTests/ws/activemq-leveldb-store/pom.xml>
to org.apache.activemq/activemq-leveldb-store/5.16.0-SNAPSHOT/activemq-leveldb-store-5.16.0-SNAPSHOT.pom
[JENKINS] Archiving <https://builds.apache.org/job/ActiveMQ-Java8-All-UnitTests/ws/activemq-leveldb-store/target/activemq-leveldb-store-5.16.0-SNAPSHOT.jar>
to org.apache.activemq/activemq-leveldb-store/5.16.0-SNAPSHOT/activemq-leveldb-store-5.16.0-SNAPSHOT.jar
[locks-and-latches] Releasing all the locks
[locks-and-latches] All the locks released
channel stopped

Mime
View raw message