activemq-commits mailing list archives

Site index · List index
Message view « Date » · « Thread »
Top « Date » · « Thread »
From Apache Jenkins Server <jenk...@builds.apache.org>
Subject Build failed in Jenkins: ActiveMQ-Java8-All-UnitTests #770
Date Wed, 22 Nov 2017 01:54:49 GMT
See <https://builds.apache.org/job/ActiveMQ-Java8-All-UnitTests/770/display/redirect?page=changes>

Changes:

[gtully] [AMQ-6854] - periodic log warn on store limits reached in the same way

------------------------------------------
[...truncated 275.73 KB...]
Running org.apache.activemq.bugs.AMQ6387Test
Tests run: 4, Failures: 0, Errors: 0, Skipped: 0, Time elapsed: 1.298 sec - in org.apache.activemq.bugs.AMQ6387Test
Running org.apache.activemq.bugs.AMQ6432Test
Tests run: 1, Failures: 0, Errors: 0, Skipped: 0, Time elapsed: 15.743 sec - in org.apache.activemq.bugs.AMQ6432Test
Running org.apache.activemq.bugs.AMQ6459Test
Tests run: 1, Failures: 0, Errors: 0, Skipped: 0, Time elapsed: 6.133 sec - in org.apache.activemq.bugs.AMQ6459Test
Running org.apache.activemq.bugs.AMQ6463Test
Tests run: 1, Failures: 0, Errors: 0, Skipped: 0, Time elapsed: 5.135 sec - in org.apache.activemq.bugs.AMQ6463Test
Running org.apache.activemq.bugs.AMQ6522Test
Tests run: 1, Failures: 0, Errors: 0, Skipped: 0, Time elapsed: 1.754 sec - in org.apache.activemq.bugs.AMQ6522Test
Running org.apache.activemq.bugs.AMQ6579Test
Tests run: 1, Failures: 0, Errors: 0, Skipped: 0, Time elapsed: 1.569 sec - in org.apache.activemq.bugs.AMQ6579Test
Running org.apache.activemq.bugs.AMQ6599Test
Tests run: 6, Failures: 0, Errors: 0, Skipped: 0, Time elapsed: 2.149 sec - in org.apache.activemq.bugs.AMQ6599Test
Running org.apache.activemq.bugs.ActiveMQSlowConsumerManualTest
Tests run: 4, Failures: 0, Errors: 0, Skipped: 0, Time elapsed: 7.331 sec - in org.apache.activemq.bugs.ActiveMQSlowConsumerManualTest
Running org.apache.activemq.bugs.ConnectionPerMessageTest
Tests run: 1, Failures: 0, Errors: 0, Skipped: 0, Time elapsed: 4.748 sec - in org.apache.activemq.bugs.ConnectionPerMessageTest
Running org.apache.activemq.bugs.CraigsBugTest
Tests run: 1, Failures: 0, Errors: 0, Skipped: 0, Time elapsed: 3.939 sec - in org.apache.activemq.bugs.CraigsBugTest
Running org.apache.activemq.bugs.CursorMemoryHighWaterMarkTest
Tests run: 1, Failures: 0, Errors: 0, Skipped: 0, Time elapsed: 3.286 sec - in org.apache.activemq.bugs.CursorMemoryHighWaterMarkTest
Running org.apache.activemq.bugs.DoubleExpireTest
Tests run: 1, Failures: 0, Errors: 0, Skipped: 0, Time elapsed: 60.994 sec - in org.apache.activemq.bugs.DoubleExpireTest
Running org.apache.activemq.bugs.DuplicateFromStoreTest
Tests run: 1, Failures: 1, Errors: 0, Skipped: 0, Time elapsed: 71.763 sec <<< FAILURE!
- in org.apache.activemq.bugs.DuplicateFromStoreTest
testDuplicateMessage(org.apache.activemq.bugs.DuplicateFromStoreTest)  Time elapsed: 71.596
sec  <<< FAILURE!
java.lang.AssertionError: no messages pending, i.e. dlq empty expected:<0> but was:<8181>
	at org.junit.Assert.fail(Assert.java:88)
	at org.junit.Assert.failNotEquals(Assert.java:834)
	at org.junit.Assert.assertEquals(Assert.java:645)
	at org.apache.activemq.bugs.DuplicateFromStoreTest.testDuplicateMessage(DuplicateFromStoreTest.java:146)

Running org.apache.activemq.bugs.DurableConsumerTest
Tests run: 6, Failures: 0, Errors: 0, Skipped: 0, Time elapsed: 25.103 sec - in org.apache.activemq.bugs.DurableConsumerTest
Running org.apache.activemq.bugs.JMSDurableTopicNoLocalTest
Tests run: 1, Failures: 0, Errors: 0, Skipped: 0, Time elapsed: 5.999 sec - in org.apache.activemq.bugs.JMSDurableTopicNoLocalTest
Running org.apache.activemq.bugs.JMSQueueBrowserPriorityTest
Tests run: 1, Failures: 0, Errors: 0, Skipped: 0, Time elapsed: 11.732 sec - in org.apache.activemq.bugs.JMSQueueBrowserPriorityTest
Running org.apache.activemq.bugs.JmsDurableTopicSlowReceiveTest
Tests run: 2, Failures: 0, Errors: 0, Skipped: 0, Time elapsed: 102.678 sec - in org.apache.activemq.bugs.JmsDurableTopicSlowReceiveTest
Running org.apache.activemq.bugs.JmsTimeoutTest
Tests run: 2, Failures: 0, Errors: 0, Skipped: 0, Time elapsed: 16.28 sec - in org.apache.activemq.bugs.JmsTimeoutTest
Running org.apache.activemq.bugs.MemoryUsageBlockResumeTest
Tests run: 1, Failures: 0, Errors: 0, Skipped: 0, Time elapsed: 2.216 sec - in org.apache.activemq.bugs.MemoryUsageBlockResumeTest
Running org.apache.activemq.bugs.MemoryUsageBrokerTest
Tests run: 1, Failures: 0, Errors: 0, Skipped: 0, Time elapsed: 10.687 sec - in org.apache.activemq.bugs.MemoryUsageBrokerTest
Running org.apache.activemq.bugs.MemoryUsageCleanupTest
Tests run: 1, Failures: 0, Errors: 0, Skipped: 0, Time elapsed: 210.978 sec - in org.apache.activemq.bugs.MemoryUsageCleanupTest
Running org.apache.activemq.bugs.MessageExpirationReaperTest
Tests run: 2, Failures: 0, Errors: 0, Skipped: 0, Time elapsed: 7.299 sec - in org.apache.activemq.bugs.MessageExpirationReaperTest
Running org.apache.activemq.bugs.MessageExpiryClientSideTest
Tests run: 4, Failures: 0, Errors: 0, Skipped: 0, Time elapsed: 1.82 sec - in org.apache.activemq.bugs.MessageExpiryClientSideTest
Running org.apache.activemq.bugs.MessageExpiryTimeDifferenceTest
Tests run: 1, Failures: 0, Errors: 0, Skipped: 0, Time elapsed: 2.027 sec - in org.apache.activemq.bugs.MessageExpiryTimeDifferenceTest
Running org.apache.activemq.bugs.MissingDataFileTest
Tests run: 1, Failures: 0, Errors: 0, Skipped: 0, Time elapsed: 27.596 sec - in org.apache.activemq.bugs.MissingDataFileTest
Running org.apache.activemq.bugs.OptimizeAcknowledgeWithExpiredMsgsTest
Tests run: 3, Failures: 0, Errors: 0, Skipped: 0, Time elapsed: 3.418 sec - in org.apache.activemq.bugs.OptimizeAcknowledgeWithExpiredMsgsTest
Running org.apache.activemq.bugs.PfcTimeoutTest
Tests run: 2, Failures: 0, Errors: 0, Skipped: 0, Time elapsed: 11.307 sec - in org.apache.activemq.bugs.PfcTimeoutTest
Running org.apache.activemq.bugs.QueueWorkerPrefetchTest
Tests run: 1, Failures: 0, Errors: 0, Skipped: 0, Time elapsed: 1.066 sec - in org.apache.activemq.bugs.QueueWorkerPrefetchTest
Running org.apache.activemq.bugs.RedeliveryPluginHeaderTest
Tests run: 1, Failures: 0, Errors: 0, Skipped: 0, Time elapsed: 6.567 sec - in org.apache.activemq.bugs.RedeliveryPluginHeaderTest
Running org.apache.activemq.bugs.SlowConsumerTest
Tests run: 1, Failures: 0, Errors: 0, Skipped: 0, Time elapsed: 7.625 sec - in org.apache.activemq.bugs.SlowConsumerTest
Running org.apache.activemq.bugs.SparseAckReplayAfterStoreCleanupLevelDBStoreTest
Tests run: 4, Failures: 0, Errors: 0, Skipped: 0, Time elapsed: 4.203 sec - in org.apache.activemq.bugs.SparseAckReplayAfterStoreCleanupLevelDBStoreTest
Running org.apache.activemq.bugs.TempQueueDeleteOnCloseTest
Tests run: 1, Failures: 0, Errors: 0, Skipped: 0, Time elapsed: 1.15 sec - in org.apache.activemq.bugs.TempQueueDeleteOnCloseTest
Running org.apache.activemq.bugs.TempStorageBlockedBrokerTest
Tests run: 2, Failures: 0, Errors: 0, Skipped: 0, Time elapsed: 134.606 sec - in org.apache.activemq.bugs.TempStorageBlockedBrokerTest
Running org.apache.activemq.bugs.TempStorageConfigBrokerTest
Tests run: 2, Failures: 0, Errors: 0, Skipped: 2, Time elapsed: 0.082 sec - in org.apache.activemq.bugs.TempStorageConfigBrokerTest
Running org.apache.activemq.bugs.TempStoreDataCleanupTest
Tests run: 1, Failures: 0, Errors: 0, Skipped: 0, Time elapsed: 215.046 sec - in org.apache.activemq.bugs.TempStoreDataCleanupTest
Running org.apache.activemq.bugs.TransactedStoreUsageSuspendResumeTest

Results :

Failed tests: 
  AMQ4930Test.testWithStatsDisabled:72->doTestBrowsePending:120 No growth: 190680 >=
199008.8
  DuplicateFromStoreTest.testDuplicateMessage:146 no messages pending, i.e. dlq empty expected:<0>
but was:<8181>

Tests run: 2124, Failures: 2, Errors: 0, Skipped: 35

[JENKINS] Recording test results
Tests run: 1, Failures: 0, Errors: 0, Skipped: 0, Time elapsed: 96.428 sec - in org.apache.activemq.bugs.TransactedStoreUsageSuspendResumeTest
[INFO] ------------------------------------------------------------------------
[INFO] Reactor Summary:
[INFO] 
[INFO] ActiveMQ ........................................... SUCCESS [  5.522 s]
[INFO] ActiveMQ :: Client ................................. SUCCESS [01:49 min]
[INFO] ActiveMQ :: Openwire Legacy Support ................ SUCCESS [  5.763 s]
[INFO] ActiveMQ :: JAAS ................................... SUCCESS [ 32.840 s]
[INFO] ActiveMQ :: Broker ................................. SUCCESS [ 54.622 s]
[INFO] ActiveMQ :: KahaDB Store ........................... SUCCESS [02:11 min]
[INFO] ActiveMQ :: STOMP Protocol ......................... SUCCESS [18:19 min]
[INFO] ActiveMQ :: MQTT Protocol .......................... SUCCESS [20:13 min]
[INFO] ActiveMQ :: JDBC Store ............................. SUCCESS [  4.879 s]
[INFO] ActiveMQ :: LevelDB Store .......................... SUCCESS [05:05 min]
[INFO] ActiveMQ :: Generic JMS Pool ....................... SUCCESS [ 44.350 s]
[INFO] ActiveMQ :: Pool ................................... SUCCESS [  9.005 s]
[INFO] ActiveMQ :: RA ..................................... SUCCESS [01:39 min]
[INFO] ActiveMQ :: Spring ................................. SUCCESS [01:05 min]
[INFO] ActiveMQ :: Console ................................ SUCCESS [  8.856 s]
[INFO] ActiveMQ :: Partition Management ................... SUCCESS [ 20.283 s]
[INFO] ActiveMQ :: Runtime Configuration .................. SUCCESS [08:40 min]
[INFO] ActiveMQ :: Tooling ................................ SUCCESS [  1.452 s]
[INFO] ActiveMQ :: JUnit Rule ............................. SUCCESS [  7.203 s]
[INFO] ActiveMQ :: Unit Tests ............................. FAILURE [  02:33 h]
[INFO] ------------------------------------------------------------------------
[INFO] BUILD FAILURE
[INFO] ------------------------------------------------------------------------
[INFO] Total time: 03:37 h
[INFO] Finished at: 2017-11-22T01:54:22+00:00
[INFO] Final Memory: 111M/1152M
[INFO] ------------------------------------------------------------------------
Waiting for Jenkins to finish collecting data
[ERROR] Failed to execute goal org.apache.maven.plugins:maven-surefire-plugin:2.16:test (default-test)
on project activemq-unit-tests: ExecutionException; nested exception is java.util.concurrent.ExecutionException:
java.lang.RuntimeException: There was an error in the forked process
[ERROR] java.lang.OutOfMemoryError: Java heap space
[ERROR] -> [Help 1]
org.apache.maven.lifecycle.LifecycleExecutionException: Failed to execute goal org.apache.maven.plugins:maven-surefire-plugin:2.16:test
(default-test) on project activemq-unit-tests: ExecutionException; nested exception is java.util.concurrent.ExecutionException:
java.lang.RuntimeException: There was an error in the forked process
java.lang.OutOfMemoryError: Java heap space

	at org.apache.maven.lifecycle.internal.MojoExecutor.execute(MojoExecutor.java:212)
	at org.apache.maven.lifecycle.internal.MojoExecutor.execute(MojoExecutor.java:153)
	at org.apache.maven.lifecycle.internal.MojoExecutor.execute(MojoExecutor.java:145)
	at org.apache.maven.lifecycle.internal.LifecycleModuleBuilder.buildProject(LifecycleModuleBuilder.java:116)
	at org.apache.maven.lifecycle.internal.LifecycleModuleBuilder.buildProject(LifecycleModuleBuilder.java:80)
	at org.apache.maven.lifecycle.internal.builder.singlethreaded.SingleThreadedBuilder.build(SingleThreadedBuilder.java:51)
	at org.apache.maven.lifecycle.internal.LifecycleStarter.execute(LifecycleStarter.java:128)
	at org.apache.maven.DefaultMaven.doExecute(DefaultMaven.java:307)
	at org.apache.maven.DefaultMaven.doExecute(DefaultMaven.java:193)
	at org.apache.maven.DefaultMaven.execute(DefaultMaven.java:106)
	at org.jvnet.hudson.maven3.launcher.Maven33Launcher.main(Maven33Launcher.java:129)
	at sun.reflect.NativeMethodAccessorImpl.invoke0(Native Method)
	at sun.reflect.NativeMethodAccessorImpl.invoke(NativeMethodAccessorImpl.java:62)
	at sun.reflect.DelegatingMethodAccessorImpl.invoke(DelegatingMethodAccessorImpl.java:43)
	at java.lang.reflect.Method.invoke(Method.java:498)
	at org.codehaus.plexus.classworlds.launcher.Launcher.launchStandard(Launcher.java:330)
	at org.codehaus.plexus.classworlds.launcher.Launcher.launch(Launcher.java:238)
	at jenkins.maven3.agent.Maven33Main.launch(Maven33Main.java:176)
	at sun.reflect.NativeMethodAccessorImpl.invoke0(Native Method)
	at sun.reflect.NativeMethodAccessorImpl.invoke(NativeMethodAccessorImpl.java:62)
	at sun.reflect.DelegatingMethodAccessorImpl.invoke(DelegatingMethodAccessorImpl.java:43)
	at java.lang.reflect.Method.invoke(Method.java:498)
	at hudson.maven.Maven3Builder.call(Maven3Builder.java:139)
	at hudson.maven.Maven3Builder.call(Maven3Builder.java:70)
	at hudson.remoting.UserRequest.perform(UserRequest.java:181)
	at hudson.remoting.UserRequest.perform(UserRequest.java:52)
	at hudson.remoting.Request$2.run(Request.java:336)
	at hudson.remoting.InterceptingExecutorService$1.call(InterceptingExecutorService.java:68)
	at java.util.concurrent.FutureTask.run(FutureTask.java:266)
	at java.util.concurrent.ThreadPoolExecutor.runWorker(ThreadPoolExecutor.java:1149)
	at java.util.concurrent.ThreadPoolExecutor$Worker.run(ThreadPoolExecutor.java:624)
	at java.lang.Thread.run(Thread.java:748)
Caused by: org.apache.maven.plugin.MojoFailureException: ExecutionException; nested exception
is java.util.concurrent.ExecutionException: java.lang.RuntimeException: There was an error
in the forked process
java.lang.OutOfMemoryError: Java heap space

	at org.apache.maven.plugin.surefire.SurefirePlugin.assertNoException(SurefirePlugin.java:198)
	at org.apache.maven.plugin.surefire.SurefirePlugin.handleSummary(SurefirePlugin.java:188)
	at org.apache.maven.plugin.surefire.AbstractSurefireMojo.executeAfterPreconditionsChecked(AbstractSurefireMojo.java:852)
	at org.apache.maven.plugin.surefire.AbstractSurefireMojo.execute(AbstractSurefireMojo.java:720)
	at org.apache.maven.plugin.DefaultBuildPluginManager.executeMojo(DefaultBuildPluginManager.java:134)
	at org.apache.maven.lifecycle.internal.MojoExecutor.execute(MojoExecutor.java:207)
	... 31 more
Caused by: org.apache.maven.surefire.booter.SurefireBooterForkException: ExecutionException;
nested exception is java.util.concurrent.ExecutionException: java.lang.RuntimeException: There
was an error in the forked process
java.lang.OutOfMemoryError: Java heap space

	at org.apache.maven.plugin.surefire.booterclient.ForkStarter.runSuitesForkPerTestSet(ForkStarter.java:316)
	at org.apache.maven.plugin.surefire.booterclient.ForkStarter.run(ForkStarter.java:169)
	at org.apache.maven.plugin.surefire.AbstractSurefireMojo.executeProvider(AbstractSurefireMojo.java:958)
	at org.apache.maven.plugin.surefire.AbstractSurefireMojo.executeAfterPreconditionsChecked(AbstractSurefireMojo.java:822)
	... 34 more
Caused by: java.util.concurrent.ExecutionException: java.lang.RuntimeException: There was
an error in the forked process
java.lang.OutOfMemoryError: Java heap space

	at java.util.concurrent.FutureTask.report(FutureTask.java:122)
	at java.util.concurrent.FutureTask.get(FutureTask.java:192)
	at org.apache.maven.plugin.surefire.booterclient.ForkStarter.runSuitesForkPerTestSet(ForkStarter.java:300)
	... 37 more
Caused by: java.lang.RuntimeException: There was an error in the forked process
java.lang.OutOfMemoryError: Java heap space

	at org.apache.maven.plugin.surefire.booterclient.ForkStarter.fork(ForkStarter.java:479)
	at org.apache.maven.plugin.surefire.booterclient.ForkStarter.fork(ForkStarter.java:352)
	at org.apache.maven.plugin.surefire.booterclient.ForkStarter.access$300(ForkStarter.java:85)
	at org.apache.maven.plugin.surefire.booterclient.ForkStarter$2.call(ForkStarter.java:288)
	at org.apache.maven.plugin.surefire.booterclient.ForkStarter$2.call(ForkStarter.java:283)
	... 4 more
[ERROR] 
[ERROR] Re-run Maven using the -X switch to enable full debug logging.
[ERROR] 
[ERROR] For more information about the errors and possible solutions, please read the following
articles:
[ERROR] [Help 1] http://cwiki.apache.org/confluence/display/MAVEN/MojoFailureException
[ERROR] 
[ERROR] After correcting the problems, you can resume the build with the command
[ERROR]   mvn <goals> -rf :activemq-unit-tests
[JENKINS] Archiving <https://builds.apache.org/job/ActiveMQ-Java8-All-UnitTests/ws/activemq-kahadb-store/pom.xml>
to org.apache.activemq/activemq-kahadb-store/5.16.0-SNAPSHOT/activemq-kahadb-store-5.16.0-SNAPSHOT.pom
[JENKINS] Archiving <https://builds.apache.org/job/ActiveMQ-Java8-All-UnitTests/ws/activemq-kahadb-store/target/activemq-kahadb-store-5.16.0-SNAPSHOT.jar>
to org.apache.activemq/activemq-kahadb-store/5.16.0-SNAPSHOT/activemq-kahadb-store-5.16.0-SNAPSHOT.jar
[JENKINS] Archiving <https://builds.apache.org/job/ActiveMQ-Java8-All-UnitTests/ws/activemq-unit-tests/pom.xml>
to org.apache.activemq/activemq-unit-tests/5.16.0-SNAPSHOT/activemq-unit-tests-5.16.0-SNAPSHOT.pom
[Fast Archiver] Compressed 72.14 KB of artifacts by 44.4% relative to #769
[JENKINS] Archiving <https://builds.apache.org/job/ActiveMQ-Java8-All-UnitTests/ws/activemq-openwire-legacy/pom.xml>
to org.apache.activemq/activemq-openwire-legacy/5.16.0-SNAPSHOT/activemq-openwire-legacy-5.16.0-SNAPSHOT.pom
[JENKINS] Archiving <https://builds.apache.org/job/ActiveMQ-Java8-All-UnitTests/ws/activemq-openwire-legacy/target/activemq-openwire-legacy-5.16.0-SNAPSHOT.jar>
to org.apache.activemq/activemq-openwire-legacy/5.16.0-SNAPSHOT/activemq-openwire-legacy-5.16.0-SNAPSHOT.jar
[JENKINS] Archiving <https://builds.apache.org/job/ActiveMQ-Java8-All-UnitTests/ws/activemq-client/pom.xml>
to org.apache.activemq/activemq-client/5.16.0-SNAPSHOT/activemq-client-5.16.0-SNAPSHOT.pom
[JENKINS] Archiving <https://builds.apache.org/job/ActiveMQ-Java8-All-UnitTests/ws/activemq-client/target/activemq-client-5.16.0-SNAPSHOT.jar>
to org.apache.activemq/activemq-client/5.16.0-SNAPSHOT/activemq-client-5.16.0-SNAPSHOT.jar
[JENKINS] Archiving <https://builds.apache.org/job/ActiveMQ-Java8-All-UnitTests/ws/activemq-tooling/activemq-junit/pom.xml>
to org.apache.activemq.tooling/activemq-junit/5.16.0-SNAPSHOT/activemq-junit-5.16.0-SNAPSHOT.pom
[JENKINS] Archiving <https://builds.apache.org/job/ActiveMQ-Java8-All-UnitTests/ws/activemq-tooling/activemq-junit/target/activemq-junit-5.16.0-SNAPSHOT.jar>
to org.apache.activemq.tooling/activemq-junit/5.16.0-SNAPSHOT/activemq-junit-5.16.0-SNAPSHOT.jar
[JENKINS] Archiving <https://builds.apache.org/job/ActiveMQ-Java8-All-UnitTests/ws/activemq-tooling/pom.xml>
to org.apache.activemq.tooling/activemq-tooling/5.16.0-SNAPSHOT/activemq-tooling-5.16.0-SNAPSHOT.pom
[JENKINS] Archiving <https://builds.apache.org/job/ActiveMQ-Java8-All-UnitTests/ws/activemq-jms-pool/pom.xml>
to org.apache.activemq/activemq-jms-pool/5.16.0-SNAPSHOT/activemq-jms-pool-5.16.0-SNAPSHOT.pom
[JENKINS] Archiving <https://builds.apache.org/job/ActiveMQ-Java8-All-UnitTests/ws/activemq-jms-pool/target/activemq-jms-pool-5.16.0-SNAPSHOT.jar>
to org.apache.activemq/activemq-jms-pool/5.16.0-SNAPSHOT/activemq-jms-pool-5.16.0-SNAPSHOT.jar
[JENKINS] Archiving <https://builds.apache.org/job/ActiveMQ-Java8-All-UnitTests/ws/activemq-pool/pom.xml>
to org.apache.activemq/activemq-pool/5.16.0-SNAPSHOT/activemq-pool-5.16.0-SNAPSHOT.pom
[JENKINS] Archiving <https://builds.apache.org/job/ActiveMQ-Java8-All-UnitTests/ws/activemq-pool/target/activemq-pool-5.16.0-SNAPSHOT.jar>
to org.apache.activemq/activemq-pool/5.16.0-SNAPSHOT/activemq-pool-5.16.0-SNAPSHOT.jar
[JENKINS] Archiving <https://builds.apache.org/job/ActiveMQ-Java8-All-UnitTests/ws/activemq-jdbc-store/pom.xml>
to org.apache.activemq/activemq-jdbc-store/5.16.0-SNAPSHOT/activemq-jdbc-store-5.16.0-SNAPSHOT.pom
[JENKINS] Archiving <https://builds.apache.org/job/ActiveMQ-Java8-All-UnitTests/ws/activemq-jdbc-store/target/activemq-jdbc-store-5.16.0-SNAPSHOT.jar>
to org.apache.activemq/activemq-jdbc-store/5.16.0-SNAPSHOT/activemq-jdbc-store-5.16.0-SNAPSHOT.jar
[JENKINS] Archiving <https://builds.apache.org/job/ActiveMQ-Java8-All-UnitTests/ws/activemq-runtime-config/pom.xml>
to org.apache.activemq/activemq-runtime-config/5.16.0-SNAPSHOT/activemq-runtime-config-5.16.0-SNAPSHOT.pom
[JENKINS] Archiving <https://builds.apache.org/job/ActiveMQ-Java8-All-UnitTests/ws/activemq-runtime-config/target/activemq-runtime-config-5.16.0-SNAPSHOT.jar>
to org.apache.activemq/activemq-runtime-config/5.16.0-SNAPSHOT/activemq-runtime-config-5.16.0-SNAPSHOT.jar
[JENKINS] Archiving <https://builds.apache.org/job/ActiveMQ-Java8-All-UnitTests/ws/pom.xml>
to org.apache.activemq/activemq-parent/5.16.0-SNAPSHOT/activemq-parent-5.16.0-SNAPSHOT.pom
[Fast Archiver] Compressed 60.60 KB of artifacts by 52.8% relative to #769
[JENKINS] Archiving <https://builds.apache.org/job/ActiveMQ-Java8-All-UnitTests/ws/activemq-stomp/pom.xml>
to org.apache.activemq/activemq-stomp/5.16.0-SNAPSHOT/activemq-stomp-5.16.0-SNAPSHOT.pom
[JENKINS] Archiving <https://builds.apache.org/job/ActiveMQ-Java8-All-UnitTests/ws/activemq-stomp/target/activemq-stomp-5.16.0-SNAPSHOT.jar>
to org.apache.activemq/activemq-stomp/5.16.0-SNAPSHOT/activemq-stomp-5.16.0-SNAPSHOT.jar
[JENKINS] Archiving <https://builds.apache.org/job/ActiveMQ-Java8-All-UnitTests/ws/activemq-broker/pom.xml>
to org.apache.activemq/activemq-broker/5.16.0-SNAPSHOT/activemq-broker-5.16.0-SNAPSHOT.pom
[JENKINS] Archiving <https://builds.apache.org/job/ActiveMQ-Java8-All-UnitTests/ws/activemq-broker/target/activemq-broker-5.16.0-SNAPSHOT.jar>
to org.apache.activemq/activemq-broker/5.16.0-SNAPSHOT/activemq-broker-5.16.0-SNAPSHOT.jar
[JENKINS] Archiving <https://builds.apache.org/job/ActiveMQ-Java8-All-UnitTests/ws/activemq-broker/target/activemq-broker-5.16.0-SNAPSHOT-tests.jar>
to org.apache.activemq/activemq-broker/5.16.0-SNAPSHOT/activemq-broker-5.16.0-SNAPSHOT-tests.jar
[JENKINS] Archiving <https://builds.apache.org/job/ActiveMQ-Java8-All-UnitTests/ws/activemq-mqtt/pom.xml>
to org.apache.activemq/activemq-mqtt/5.16.0-SNAPSHOT/activemq-mqtt-5.16.0-SNAPSHOT.pom
[JENKINS] Archiving <https://builds.apache.org/job/ActiveMQ-Java8-All-UnitTests/ws/activemq-mqtt/target/activemq-mqtt-5.16.0-SNAPSHOT.jar>
to org.apache.activemq/activemq-mqtt/5.16.0-SNAPSHOT/activemq-mqtt-5.16.0-SNAPSHOT.jar
[JENKINS] Archiving <https://builds.apache.org/job/ActiveMQ-Java8-All-UnitTests/ws/activemq-jaas/pom.xml>
to org.apache.activemq/activemq-jaas/5.16.0-SNAPSHOT/activemq-jaas-5.16.0-SNAPSHOT.pom
[JENKINS] Archiving <https://builds.apache.org/job/ActiveMQ-Java8-All-UnitTests/ws/activemq-jaas/target/activemq-jaas-5.16.0-SNAPSHOT.jar>
to org.apache.activemq/activemq-jaas/5.16.0-SNAPSHOT/activemq-jaas-5.16.0-SNAPSHOT.jar
[JENKINS] Archiving <https://builds.apache.org/job/ActiveMQ-Java8-All-UnitTests/ws/activemq-ra/pom.xml>
to org.apache.activemq/activemq-ra/5.16.0-SNAPSHOT/activemq-ra-5.16.0-SNAPSHOT.pom
[JENKINS] Archiving <https://builds.apache.org/job/ActiveMQ-Java8-All-UnitTests/ws/activemq-ra/target/activemq-ra-5.16.0-SNAPSHOT.jar>
to org.apache.activemq/activemq-ra/5.16.0-SNAPSHOT/activemq-ra-5.16.0-SNAPSHOT.jar
[JENKINS] Archiving <https://builds.apache.org/job/ActiveMQ-Java8-All-UnitTests/ws/activemq-ra/target/xbean/activemq-ra.xsd>
to org.apache.activemq/activemq-ra/5.16.0-SNAPSHOT/activemq-ra-5.16.0-SNAPSHOT.xsd
[JENKINS] Archiving <https://builds.apache.org/job/ActiveMQ-Java8-All-UnitTests/ws/activemq-ra/target/xbean/activemq-ra.xsd.html>
to org.apache.activemq/activemq-ra/5.16.0-SNAPSHOT/activemq-ra-5.16.0-SNAPSHOT-schema.html
[JENKINS] Archiving <https://builds.apache.org/job/ActiveMQ-Java8-All-UnitTests/ws/activemq-ra/target/xbean/activemq-ra.xsd.html>
to org.apache.activemq/activemq-ra/5.16.0-SNAPSHOT/activemq-ra-5.16.0-SNAPSHOT.xsd.html
[JENKINS] Archiving <https://builds.apache.org/job/ActiveMQ-Java8-All-UnitTests/ws/activemq-partition/pom.xml>
to org.apache.activemq/activemq-partition/5.16.0-SNAPSHOT/activemq-partition-5.16.0-SNAPSHOT.pom
[JENKINS] Archiving <https://builds.apache.org/job/ActiveMQ-Java8-All-UnitTests/ws/activemq-partition/target/activemq-partition-5.16.0-SNAPSHOT.jar>
to org.apache.activemq/activemq-partition/5.16.0-SNAPSHOT/activemq-partition-5.16.0-SNAPSHOT.jar
[JENKINS] Archiving <https://builds.apache.org/job/ActiveMQ-Java8-All-UnitTests/ws/activemq-console/pom.xml>
to org.apache.activemq/activemq-console/5.16.0-SNAPSHOT/activemq-console-5.16.0-SNAPSHOT.pom
[JENKINS] Archiving <https://builds.apache.org/job/ActiveMQ-Java8-All-UnitTests/ws/activemq-console/target/activemq-console-5.16.0-SNAPSHOT.jar>
to org.apache.activemq/activemq-console/5.16.0-SNAPSHOT/activemq-console-5.16.0-SNAPSHOT.jar
[JENKINS] Archiving <https://builds.apache.org/job/ActiveMQ-Java8-All-UnitTests/ws/activemq-spring/pom.xml>
to org.apache.activemq/activemq-spring/5.16.0-SNAPSHOT/activemq-spring-5.16.0-SNAPSHOT.pom
[JENKINS] Archiving <https://builds.apache.org/job/ActiveMQ-Java8-All-UnitTests/ws/activemq-spring/target/activemq-spring-5.16.0-SNAPSHOT.jar>
to org.apache.activemq/activemq-spring/5.16.0-SNAPSHOT/activemq-spring-5.16.0-SNAPSHOT.jar
[JENKINS] Archiving <https://builds.apache.org/job/ActiveMQ-Java8-All-UnitTests/ws/activemq-spring/target/classes/activemq.xsd>
to org.apache.activemq/activemq-spring/5.16.0-SNAPSHOT/activemq-spring-5.16.0-SNAPSHOT.xsd
[JENKINS] Archiving <https://builds.apache.org/job/ActiveMQ-Java8-All-UnitTests/ws/activemq-spring/target/classes/activemq.xsd.html>
to org.apache.activemq/activemq-spring/5.16.0-SNAPSHOT/activemq-spring-5.16.0-SNAPSHOT-schema.html
[Fast Archiver] Compressed 899.22 KB of artifacts by 78.3% relative to #769
[JENKINS] Archiving <https://builds.apache.org/job/ActiveMQ-Java8-All-UnitTests/ws/activemq-leveldb-store/pom.xml>
to org.apache.activemq/activemq-leveldb-store/5.16.0-SNAPSHOT/activemq-leveldb-store-5.16.0-SNAPSHOT.pom
[JENKINS] Archiving <https://builds.apache.org/job/ActiveMQ-Java8-All-UnitTests/ws/activemq-leveldb-store/target/activemq-leveldb-store-5.16.0-SNAPSHOT.jar>
to org.apache.activemq/activemq-leveldb-store/5.16.0-SNAPSHOT/activemq-leveldb-store-5.16.0-SNAPSHOT.jar
[locks-and-latches] Releasing all the locks
[locks-and-latches] All the locks released
channel stopped

Mime
View raw message