activemq-commits mailing list archives

Site index · List index
Message view « Date » · « Thread »
Top « Date » · « Thread »
From Apache Jenkins Server <jenk...@builds.apache.org>
Subject Build failed in Jenkins: ActiveMQ-Trunk-Deploy #1922
Date Fri, 06 Oct 2017 10:52:58 GMT
See <https://builds.apache.org/job/ActiveMQ-Trunk-Deploy/1922/display/redirect?page=changes>

Changes:

[claus.ibsen] Upgrade Spring

------------------------------------------
[...truncated 23.78 KB...]
[INFO] ------------------------------------------------------------------------
[INFO] Skipping ActiveMQ :: OSGi bundle
[INFO] This project has been banned from the build due to previous failures.
[INFO] ------------------------------------------------------------------------
[INFO]                                                                         
[INFO] ------------------------------------------------------------------------
[INFO] Skipping ActiveMQ :: Blueprint
[INFO] This project has been banned from the build due to previous failures.
[INFO] ------------------------------------------------------------------------
[INFO]                                                                         
[INFO] ------------------------------------------------------------------------
[INFO] Skipping ActiveMQ :: Web Demo
[INFO] This project has been banned from the build due to previous failures.
[INFO] ------------------------------------------------------------------------
[INFO]                                                                         
[INFO] ------------------------------------------------------------------------
[INFO] Skipping ActiveMQ :: Web Console
[INFO] This project has been banned from the build due to previous failures.
[INFO] ------------------------------------------------------------------------
[INFO]                                                                         
[INFO] ------------------------------------------------------------------------
[INFO] Skipping ActiveMQ :: Karaf Integration Tests
[INFO] This project has been banned from the build due to previous failures.
[INFO] ------------------------------------------------------------------------
[INFO]                                                                         
[INFO] ------------------------------------------------------------------------
[INFO] Skipping ActiveMQ :: Integration Test :: Spring 3.1
[INFO] This project has been banned from the build due to previous failures.
[INFO] ------------------------------------------------------------------------
[INFO]                                                                         
[INFO] ------------------------------------------------------------------------
[INFO] Skipping ActiveMQ :: Assembly
[INFO] This project has been banned from the build due to previous failures.
[INFO] ------------------------------------------------------------------------
[INFO] ------------------------------------------------------------------------
[INFO] Reactor Summary:
[INFO] 
[INFO] ActiveMQ ........................................... FAILURE [ 12.931 s]
[INFO] ActiveMQ :: Openwire Generator ..................... SKIPPED
[INFO] ActiveMQ :: Client ................................. SKIPPED
[INFO] ActiveMQ :: Openwire Legacy Support ................ SKIPPED
[INFO] ActiveMQ :: JAAS ................................... SKIPPED
[INFO] ActiveMQ :: Broker ................................. SKIPPED
[INFO] ActiveMQ :: KahaDB Store ........................... SKIPPED
[INFO] ActiveMQ :: STOMP Protocol ......................... SKIPPED
[INFO] ActiveMQ :: MQTT Protocol .......................... SKIPPED
[INFO] ActiveMQ :: JDBC Store ............................. SKIPPED
[INFO] ActiveMQ :: LevelDB Store .......................... SKIPPED
[INFO] ActiveMQ :: Generic JMS Pool ....................... SKIPPED
[INFO] ActiveMQ :: Pool ................................... SKIPPED
[INFO] ActiveMQ :: RA ..................................... SKIPPED
[INFO] ActiveMQ :: Spring ................................. SKIPPED
[INFO] ActiveMQ :: Console ................................ SKIPPED
[INFO] ActiveMQ :: Partition Management ................... SKIPPED
[INFO] ActiveMQ :: Runtime Configuration .................. SKIPPED
[INFO] ActiveMQ :: Tooling ................................ SKIPPED
[INFO] ActiveMQ :: JUnit Rule ............................. SKIPPED
[INFO] ActiveMQ :: Unit Tests ............................. SKIPPED
[INFO] ActiveMQ :: HTTP Protocol Support .................. SKIPPED
[INFO] ActiveMQ :: AMQP ................................... SKIPPED
[INFO] ActiveMQ :: Camel .................................. SKIPPED
[INFO] ActiveMQ :: All JAR bundle ......................... SKIPPED
[INFO] ActiveMQ :: Log4j Appender ......................... SKIPPED
[INFO] ActiveMQ :: Apache Karaf ........................... SKIPPED
[INFO] ActiveMQ :: ConnectionFactory ...................... SKIPPED
[INFO] ActiveMQ :: RAR .................................... SKIPPED
[INFO] ActiveMQ :: Run Jar ................................ SKIPPED
[INFO] ActiveMQ :: Shiro .................................. SKIPPED
[INFO] ActiveMQ :: Memory Usage Test Plugin ............... SKIPPED
[INFO] ActiveMQ :: Performance Test Plugin ................ SKIPPED
[INFO] ActiveMQ :: StartUp/Stop Plugin .................... SKIPPED
[INFO] ActiveMQ :: Web .................................... SKIPPED
[INFO] ActiveMQ :: OSGi bundle ............................ SKIPPED
[INFO] ActiveMQ :: Blueprint .............................. SKIPPED
[INFO] ActiveMQ :: Web Demo ............................... SKIPPED
[INFO] ActiveMQ :: Web Console ............................ SKIPPED
[INFO] ActiveMQ :: Karaf Integration Tests ................ SKIPPED
[INFO] ActiveMQ :: Integration Test :: Spring 3.1 ......... SKIPPED
[INFO] ActiveMQ :: Assembly ............................... SKIPPED
[INFO] ------------------------------------------------------------------------
[INFO] BUILD FAILURE
[INFO] ------------------------------------------------------------------------
[INFO] Total time: 46.611 s
[INFO] Finished at: 2017-10-06T10:52:23+00:00
[INFO] Final Memory: 49M/1024M
[INFO] ------------------------------------------------------------------------
[ERROR] Failed to execute goal org.apache.maven.plugins:maven-deploy-plugin:2.8.2:deploy (default-deploy)
on project activemq-parent: Failed to retrieve remote metadata org.apache.activemq:activemq-parent:5.16.0-SNAPSHOT/maven-metadata.xml:
Could not transfer metadata org.apache.activemq:activemq-parent:5.16.0-SNAPSHOT/maven-metadata.xml
from/to apache.snapshots.https (https://repository.apache.org/content/repositories/snapshots):
java.lang.RuntimeException: Could not generate DH keypair: Prime size must be multiple of
64, and can only range from 512 to 2048 (inclusive) -> [Help 1]
org.apache.maven.lifecycle.LifecycleExecutionException: Failed to execute goal org.apache.maven.plugins:maven-deploy-plugin:2.8.2:deploy
(default-deploy) on project activemq-parent: Failed to retrieve remote metadata org.apache.activemq:activemq-parent:5.16.0-SNAPSHOT/maven-metadata.xml:
Could not transfer metadata org.apache.activemq:activemq-parent:5.16.0-SNAPSHOT/maven-metadata.xml
from/to apache.snapshots.https (https://repository.apache.org/content/repositories/snapshots):
java.lang.RuntimeException: Could not generate DH keypair
	at org.apache.maven.lifecycle.internal.MojoExecutor.execute(MojoExecutor.java:216)
	at org.apache.maven.lifecycle.internal.MojoExecutor.execute(MojoExecutor.java:153)
	at org.apache.maven.lifecycle.internal.MojoExecutor.execute(MojoExecutor.java:145)
	at org.apache.maven.lifecycle.internal.LifecycleModuleBuilder.buildProject(LifecycleModuleBuilder.java:116)
	at org.apache.maven.lifecycle.internal.LifecycleModuleBuilder.buildProject(LifecycleModuleBuilder.java:80)
	at org.apache.maven.lifecycle.internal.builder.singlethreaded.SingleThreadedBuilder.build(SingleThreadedBuilder.java:51)
	at org.apache.maven.lifecycle.internal.LifecycleStarter.execute(LifecycleStarter.java:128)
	at org.apache.maven.DefaultMaven.doExecute(DefaultMaven.java:307)
	at org.apache.maven.DefaultMaven.doExecute(DefaultMaven.java:193)
	at org.apache.maven.DefaultMaven.execute(DefaultMaven.java:106)
	at org.jvnet.hudson.maven3.launcher.Maven33Launcher.main(Maven33Launcher.java:129)
	at sun.reflect.NativeMethodAccessorImpl.invoke0(java.base@9-internal/Native Method)
	at sun.reflect.NativeMethodAccessorImpl.invoke(java.base@9-internal/NativeMethodAccessorImpl.java:62)
	at sun.reflect.DelegatingMethodAccessorImpl.invoke(java.base@9-internal/DelegatingMethodAccessorImpl.java:43)
	at java.lang.reflect.Method.invoke(java.base@9-internal/Method.java:531)
	at org.codehaus.plexus.classworlds.launcher.Launcher.launchStandard(Launcher.java:330)
	at org.codehaus.plexus.classworlds.launcher.Launcher.launch(Launcher.java:238)
	at jenkins.maven3.agent.Maven33Main.launch(Maven33Main.java:176)
	at sun.reflect.NativeMethodAccessorImpl.invoke0(java.base@9-internal/Native Method)
	at sun.reflect.NativeMethodAccessorImpl.invoke(java.base@9-internal/NativeMethodAccessorImpl.java:62)
	at sun.reflect.DelegatingMethodAccessorImpl.invoke(java.base@9-internal/DelegatingMethodAccessorImpl.java:43)
	at java.lang.reflect.Method.invoke(java.base@9-internal/Method.java:531)
	at hudson.maven.Maven3Builder.call(Maven3Builder.java:139)
	at hudson.maven.Maven3Builder.call(Maven3Builder.java:70)
	at hudson.remoting.UserRequest.perform(UserRequest.java:181)
	at hudson.remoting.UserRequest.perform(UserRequest.java:52)
	at hudson.remoting.Request$2.run(Request.java:336)
	at hudson.remoting.InterceptingExecutorService$1.call(InterceptingExecutorService.java:68)
	at java.util.concurrent.FutureTask.run(java.base@9-internal/FutureTask.java:266)
	at java.util.concurrent.ThreadPoolExecutor.runWorker(java.base@9-internal/ThreadPoolExecutor.java:1158)
	at java.util.concurrent.ThreadPoolExecutor$Worker.run(java.base@9-internal/ThreadPoolExecutor.java:632)
	at java.lang.Thread.run(java.base@9-internal/Thread.java:804)
Caused by: org.apache.maven.plugin.MojoExecutionException: Failed to retrieve remote metadata
org.apache.activemq:activemq-parent:5.16.0-SNAPSHOT/maven-metadata.xml: Could not transfer
metadata org.apache.activemq:activemq-parent:5.16.0-SNAPSHOT/maven-metadata.xml from/to apache.snapshots.https
(https://repository.apache.org/content/repositories/snapshots): java.lang.RuntimeException:
Could not generate DH keypair
	at org.apache.maven.plugin.deploy.DeployMojo.deployProject(DeployMojo.java:284)
	at org.apache.maven.plugin.deploy.DeployMojo.execute(DeployMojo.java:169)
	at org.apache.maven.plugin.DefaultBuildPluginManager.executeMojo(DefaultBuildPluginManager.java:134)
	at org.apache.maven.lifecycle.internal.MojoExecutor.execute(MojoExecutor.java:208)
	... 31 more
Caused by: org.apache.maven.artifact.deployer.ArtifactDeploymentException: Failed to retrieve
remote metadata org.apache.activemq:activemq-parent:5.16.0-SNAPSHOT/maven-metadata.xml: Could
not transfer metadata org.apache.activemq:activemq-parent:5.16.0-SNAPSHOT/maven-metadata.xml
from/to apache.snapshots.https (https://repository.apache.org/content/repositories/snapshots):
java.lang.RuntimeException: Could not generate DH keypair
	at org.apache.maven.artifact.deployer.DefaultArtifactDeployer.deploy(DefaultArtifactDeployer.java:143)
	at org.apache.maven.plugin.deploy.AbstractDeployMojo.deploy(AbstractDeployMojo.java:171)
	at org.apache.maven.plugin.deploy.DeployMojo.deployProject(DeployMojo.java:242)
	... 34 more
Caused by: org.eclipse.aether.deployment.DeploymentException: Failed to retrieve remote metadata
org.apache.activemq:activemq-parent:5.16.0-SNAPSHOT/maven-metadata.xml: Could not transfer
metadata org.apache.activemq:activemq-parent:5.16.0-SNAPSHOT/maven-metadata.xml from/to apache.snapshots.https
(https://repository.apache.org/content/repositories/snapshots): java.lang.RuntimeException:
Could not generate DH keypair
	at org.eclipse.aether.internal.impl.DefaultDeployer.upload(DefaultDeployer.java:447)
	at org.eclipse.aether.internal.impl.DefaultDeployer.deploy(DefaultDeployer.java:290)
	at org.eclipse.aether.internal.impl.DefaultDeployer.deploy(DefaultDeployer.java:245)
	at org.eclipse.aether.internal.impl.DefaultRepositorySystem.deploy(DefaultRepositorySystem.java:413)
	at org.apache.maven.artifact.deployer.DefaultArtifactDeployer.deploy(DefaultArtifactDeployer.java:139)
	... 36 more
Caused by: org.eclipse.aether.transfer.MetadataTransferException: Could not transfer metadata
org.apache.activemq:activemq-parent:5.16.0-SNAPSHOT/maven-metadata.xml from/to apache.snapshots.https
(https://repository.apache.org/content/repositories/snapshots): java.lang.RuntimeException:
Could not generate DH keypair
	at org.eclipse.aether.connector.basic.MetadataTransportListener.transferFailed(MetadataTransportListener.java:43)
	at org.eclipse.aether.connector.basic.BasicRepositoryConnector$TaskRunner.run(BasicRepositoryConnector.java:355)
	at org.eclipse.aether.util.concurrency.RunnableErrorForwarder$1.run(RunnableErrorForwarder.java:67)
	at org.eclipse.aether.connector.basic.BasicRepositoryConnector$DirectExecutor.execute(BasicRepositoryConnector.java:581)
	at org.eclipse.aether.connector.basic.BasicRepositoryConnector.get(BasicRepositoryConnector.java:222)
	at org.eclipse.aether.internal.impl.DefaultDeployer.upload(DefaultDeployer.java:417)
	... 40 more
Caused by: org.apache.maven.wagon.TransferFailedException: java.lang.RuntimeException: Could
not generate DH keypair
	at org.apache.maven.wagon.providers.http.AbstractHttpClientWagon.fillInputData(AbstractHttpClientWagon.java:1066)
	at org.apache.maven.wagon.providers.http.AbstractHttpClientWagon.fillInputData(AbstractHttpClientWagon.java:960)
	at org.apache.maven.wagon.StreamWagon.getInputStream(StreamWagon.java:116)
	at org.apache.maven.wagon.StreamWagon.getIfNewer(StreamWagon.java:88)
	at org.apache.maven.wagon.StreamWagon.get(StreamWagon.java:61)
	at org.eclipse.aether.transport.wagon.WagonTransporter$GetTaskRunner.run(WagonTransporter.java:560)
	at org.eclipse.aether.transport.wagon.WagonTransporter.execute(WagonTransporter.java:427)
	at org.eclipse.aether.transport.wagon.WagonTransporter.get(WagonTransporter.java:404)
	at org.eclipse.aether.connector.basic.BasicRepositoryConnector$GetTaskRunner.runTask(BasicRepositoryConnector.java:447)
	at org.eclipse.aether.connector.basic.BasicRepositoryConnector$TaskRunner.run(BasicRepositoryConnector.java:350)
	... 44 more
Caused by: javax.net.ssl.SSLException: java.lang.RuntimeException: Could not generate DH keypair
	at sun.security.ssl.Alerts.getSSLException(java.base@9-internal/Alerts.java:214)
	at sun.security.ssl.SSLSocketImpl.fatal(java.base@9-internal/SSLSocketImpl.java:1949)
	at sun.security.ssl.SSLSocketImpl.fatal(java.base@9-internal/SSLSocketImpl.java:1901)
	at sun.security.ssl.SSLSocketImpl.handleException(java.base@9-internal/SSLSocketImpl.java:1884)
	at sun.security.ssl.SSLSocketImpl.startHandshake(java.base@9-internal/SSLSocketImpl.java:1416)
	at sun.security.ssl.SSLSocketImpl.startHandshake(java.base@9-internal/SSLSocketImpl.java:1393)
	at org.apache.maven.wagon.providers.http.httpclient.conn.ssl.SSLConnectionSocketFactory.createLayeredSocket(SSLConnectionSocketFactory.java:275)
	at org.apache.maven.wagon.providers.http.httpclient.conn.ssl.SSLConnectionSocketFactory.connectSocket(SSLConnectionSocketFactory.java:254)
	at org.apache.maven.wagon.providers.http.httpclient.impl.conn.HttpClientConnectionOperator.connect(HttpClientConnectionOperator.java:123)
	at org.apache.maven.wagon.providers.http.httpclient.impl.conn.PoolingHttpClientConnectionManager.connect(PoolingHttpClientConnectionManager.java:318)
	at org.apache.maven.wagon.providers.http.httpclient.impl.execchain.MainClientExec.establishRoute(MainClientExec.java:363)
	at org.apache.maven.wagon.providers.http.httpclient.impl.execchain.MainClientExec.execute(MainClientExec.java:219)
	at org.apache.maven.wagon.providers.http.httpclient.impl.execchain.ProtocolExec.execute(ProtocolExec.java:195)
	at org.apache.maven.wagon.providers.http.httpclient.impl.execchain.RetryExec.execute(RetryExec.java:86)
	at org.apache.maven.wagon.providers.http.httpclient.impl.execchain.RedirectExec.execute(RedirectExec.java:108)
	at org.apache.maven.wagon.providers.http.httpclient.impl.client.InternalHttpClient.doExecute(InternalHttpClient.java:184)
	at org.apache.maven.wagon.providers.http.httpclient.impl.client.CloseableHttpClient.execute(CloseableHttpClient.java:82)
	at org.apache.maven.wagon.providers.http.AbstractHttpClientWagon.execute(AbstractHttpClientWagon.java:832)
	at org.apache.maven.wagon.providers.http.AbstractHttpClientWagon.fillInputData(AbstractHttpClientWagon.java:983)
	... 53 more
Caused by: java.lang.RuntimeException: Could not generate DH keypair
	at sun.security.ssl.DHCrypt.<init>(java.base@9-internal/DHCrypt.java:142)
	at sun.security.ssl.DHCrypt.<init>(java.base@9-internal/DHCrypt.java:114)
	at sun.security.ssl.ClientHandshaker.serverKeyExchange(java.base@9-internal/ClientHandshaker.java:830)
	at sun.security.ssl.ClientHandshaker.processMessage(java.base@9-internal/ClientHandshaker.java:335)
	at sun.security.ssl.Handshaker.processLoop(java.base@9-internal/Handshaker.java:1003)
	at sun.security.ssl.Handshaker.processRecord(java.base@9-internal/Handshaker.java:937)
	at sun.security.ssl.SSLSocketImpl.processInputRecord(java.base@9-internal/SSLSocketImpl.java:1119)
	at sun.security.ssl.SSLSocketImpl.readRecord(java.base@9-internal/SSLSocketImpl.java:1056)
	at sun.security.ssl.SSLSocketImpl.readRecord(java.base@9-internal/SSLSocketImpl.java:955)
	at sun.security.ssl.SSLSocketImpl.performInitialHandshake(java.base@9-internal/SSLSocketImpl.java:1382)
	at sun.security.ssl.SSLSocketImpl.startHandshake(java.base@9-internal/SSLSocketImpl.java:1409)
	... 67 more
Caused by: java.security.InvalidAlgorithmParameterException: Prime size must be multiple of
64, and can only range from 512 to 2048 (inclusive)
	at com.sun.crypto.provider.DHKeyPairGenerator.initialize(java.base@9-internal/DHKeyPairGenerator.java:120)
	at java.security.KeyPairGenerator$Delegate.initialize(java.base@9-internal/KeyPairGenerator.java:681)
	at sun.security.ssl.DHCrypt.<init>(java.base@9-internal/DHCrypt.java:128)
	... 77 more
[ERROR] 
[ERROR] Re-run Maven using the -X switch to enable full debug logging.
[ERROR] 
[ERROR] For more information about the errors and possible solutions, please read the following
articles:
[ERROR] [Help 1] http://cwiki.apache.org/confluence/display/MAVEN/MojoExecutionException
[JENKINS] Archiving <https://builds.apache.org/job/ActiveMQ-Trunk-Deploy/ws/activemq-kahadb-store/pom.xml>
to org.apache.activemq/activemq-kahadb-store/5.16.0-SNAPSHOT/activemq-kahadb-store-5.16.0-SNAPSHOT.pom
[JENKINS] Archiving <https://builds.apache.org/job/ActiveMQ-Trunk-Deploy/ws/activemq-osgi/pom.xml>
to org.apache.activemq/activemq-osgi/5.16.0-SNAPSHOT/activemq-osgi-5.16.0-SNAPSHOT.pom
[JENKINS] Archiving <https://builds.apache.org/job/ActiveMQ-Trunk-Deploy/ws/activemq-unit-tests/pom.xml>
to org.apache.activemq/activemq-unit-tests/5.16.0-SNAPSHOT/activemq-unit-tests-5.16.0-SNAPSHOT.pom
[Fast Archiver] Compressed 72.14 KB of artifacts by 88.7% relative to #1920
[JENKINS] Archiving <https://builds.apache.org/job/ActiveMQ-Trunk-Deploy/ws/activemq-openwire-legacy/pom.xml>
to org.apache.activemq/activemq-openwire-legacy/5.16.0-SNAPSHOT/activemq-openwire-legacy-5.16.0-SNAPSHOT.pom
[JENKINS] Archiving <https://builds.apache.org/job/ActiveMQ-Trunk-Deploy/ws/activemq-karaf-itest/pom.xml>
to org.apache.activemq/activemq-karaf-itest/5.16.0-SNAPSHOT/activemq-karaf-itest-5.16.0-SNAPSHOT.pom
[JENKINS] Archiving <https://builds.apache.org/job/ActiveMQ-Trunk-Deploy/ws/activemq-rar/pom.xml>
to org.apache.activemq/activemq-rar/5.16.0-SNAPSHOT/activemq-rar-5.16.0-SNAPSHOT.pom
[JENKINS] Archiving <https://builds.apache.org/job/ActiveMQ-Trunk-Deploy/ws/activemq-http/pom.xml>
to org.apache.activemq/activemq-http/5.16.0-SNAPSHOT/activemq-http-5.16.0-SNAPSHOT.pom
[JENKINS] Archiving <https://builds.apache.org/job/ActiveMQ-Trunk-Deploy/ws/activemq-amqp/pom.xml>
to org.apache.activemq/activemq-amqp/5.16.0-SNAPSHOT/activemq-amqp-5.16.0-SNAPSHOT.pom
[JENKINS] Archiving <https://builds.apache.org/job/ActiveMQ-Trunk-Deploy/ws/activemq-client/pom.xml>
to org.apache.activemq/activemq-client/5.16.0-SNAPSHOT/activemq-client-5.16.0-SNAPSHOT.pom
[JENKINS] Archiving <https://builds.apache.org/job/ActiveMQ-Trunk-Deploy/ws/activemq-blueprint/pom.xml>
to org.apache.activemq/activemq-blueprint/5.16.0-SNAPSHOT/activemq-blueprint-5.16.0-SNAPSHOT.pom
[JENKINS] Archiving <https://builds.apache.org/job/ActiveMQ-Trunk-Deploy/ws/activemq-tooling/activemq-junit/pom.xml>
to org.apache.activemq.tooling/activemq-junit/5.16.0-SNAPSHOT/activemq-junit-5.16.0-SNAPSHOT.pom
[JENKINS] Archiving <https://builds.apache.org/job/ActiveMQ-Trunk-Deploy/ws/activemq-tooling/pom.xml>
to org.apache.activemq.tooling/activemq-tooling/5.16.0-SNAPSHOT/activemq-tooling-5.16.0-SNAPSHOT.pom
[JENKINS] Archiving <https://builds.apache.org/job/ActiveMQ-Trunk-Deploy/ws/activemq-jms-pool/pom.xml>
to org.apache.activemq/activemq-jms-pool/5.16.0-SNAPSHOT/activemq-jms-pool-5.16.0-SNAPSHOT.pom
[JENKINS] Archiving <https://builds.apache.org/job/ActiveMQ-Trunk-Deploy/ws/activemq-pool/pom.xml>
to org.apache.activemq/activemq-pool/5.16.0-SNAPSHOT/activemq-pool-5.16.0-SNAPSHOT.pom
[JENKINS] Archiving <https://builds.apache.org/job/ActiveMQ-Trunk-Deploy/ws/activemq-jdbc-store/pom.xml>
to org.apache.activemq/activemq-jdbc-store/5.16.0-SNAPSHOT/activemq-jdbc-store-5.16.0-SNAPSHOT.pom
[JENKINS] Archiving <https://builds.apache.org/job/ActiveMQ-Trunk-Deploy/ws/activemq-camel/pom.xml>
to org.apache.activemq/activemq-camel/5.16.0-SNAPSHOT/activemq-camel-5.16.0-SNAPSHOT.pom
[JENKINS] Archiving <https://builds.apache.org/job/ActiveMQ-Trunk-Deploy/ws/activemq-runtime-config/pom.xml>
to org.apache.activemq/activemq-runtime-config/5.16.0-SNAPSHOT/activemq-runtime-config-5.16.0-SNAPSHOT.pom
[JENKINS] Archiving <https://builds.apache.org/job/ActiveMQ-Trunk-Deploy/ws/pom.xml>
to org.apache.activemq/activemq-parent/5.16.0-SNAPSHOT/activemq-parent-5.16.0-SNAPSHOT.pom
[JENKINS] Archiving <https://builds.apache.org/job/ActiveMQ-Trunk-Deploy/ws/activemq-stomp/pom.xml>
to org.apache.activemq/activemq-stomp/5.16.0-SNAPSHOT/activemq-stomp-5.16.0-SNAPSHOT.pom
[JENKINS] Archiving <https://builds.apache.org/job/ActiveMQ-Trunk-Deploy/ws/activemq-openwire-generator/pom.xml>
to org.apache.activemq/activemq-openwire-generator/5.16.0-SNAPSHOT/activemq-openwire-generator-5.16.0-SNAPSHOT.pom
[JENKINS] Archiving <https://builds.apache.org/job/ActiveMQ-Trunk-Deploy/ws/activemq-broker/pom.xml>
to org.apache.activemq/activemq-broker/5.16.0-SNAPSHOT/activemq-broker-5.16.0-SNAPSHOT.pom
[JENKINS] Archiving <https://builds.apache.org/job/ActiveMQ-Trunk-Deploy/ws/activemq-web-demo/pom.xml>
to org.apache.activemq/activemq-web-demo/5.16.0-SNAPSHOT/activemq-web-demo-5.16.0-SNAPSHOT.pom
[JENKINS] Archiving <https://builds.apache.org/job/ActiveMQ-Trunk-Deploy/ws/activemq-mqtt/pom.xml>
to org.apache.activemq/activemq-mqtt/5.16.0-SNAPSHOT/activemq-mqtt-5.16.0-SNAPSHOT.pom
[JENKINS] Archiving <https://builds.apache.org/job/ActiveMQ-Trunk-Deploy/ws/activemq-shiro/pom.xml>
to org.apache.activemq/activemq-shiro/5.16.0-SNAPSHOT/activemq-shiro-5.16.0-SNAPSHOT.pom
[JENKINS] Archiving <https://builds.apache.org/job/ActiveMQ-Trunk-Deploy/ws/activemq-tooling/activemq-perf-maven-plugin/pom.xml>
to org.apache.activemq.tooling/activemq-perf-maven-plugin/5.16.0-SNAPSHOT/activemq-perf-maven-plugin-5.16.0-SNAPSHOT.pom
[JENKINS] Archiving <https://builds.apache.org/job/ActiveMQ-Trunk-Deploy/ws/activemq-run/pom.xml>
to org.apache.activemq/activemq-run/5.16.0-SNAPSHOT/activemq-run-5.16.0-SNAPSHOT.pom
[JENKINS] Archiving <https://builds.apache.org/job/ActiveMQ-Trunk-Deploy/ws/activemq-tooling/activemq-maven-plugin/pom.xml>
to org.apache.activemq.tooling/activemq-maven-plugin/5.16.0-SNAPSHOT/activemq-maven-plugin-5.16.0-SNAPSHOT.pom
[JENKINS] Archiving <https://builds.apache.org/job/ActiveMQ-Trunk-Deploy/ws/activemq-karaf/pom.xml>
to org.apache.activemq/activemq-karaf/5.16.0-SNAPSHOT/activemq-karaf-5.16.0-SNAPSHOT.pom
[JENKINS] Archiving <https://builds.apache.org/job/ActiveMQ-Trunk-Deploy/ws/activemq-web-console/pom.xml>
to org.apache.activemq/activemq-web-console/5.16.0-SNAPSHOT/activemq-web-console-5.16.0-SNAPSHOT.pom
[JENKINS] Archiving <https://builds.apache.org/job/ActiveMQ-Trunk-Deploy/ws/activemq-jaas/pom.xml>
to org.apache.activemq/activemq-jaas/5.16.0-SNAPSHOT/activemq-jaas-5.16.0-SNAPSHOT.pom
[JENKINS] Archiving <https://builds.apache.org/job/ActiveMQ-Trunk-Deploy/ws/activemq-itests-spring31/pom.xml>
to org.apache.activemq/activemq-itests-spring31/5.16.0-SNAPSHOT/activemq-itests-spring31-5.16.0-SNAPSHOT.pom
[JENKINS] Archiving <https://builds.apache.org/job/ActiveMQ-Trunk-Deploy/ws/activemq-tooling/activemq-memtest-maven-plugin/pom.xml>
to org.apache.activemq.tooling/activemq-memtest-maven-plugin/5.16.0-SNAPSHOT/activemq-memtest-maven-plugin-5.16.0-SNAPSHOT.pom
[JENKINS] Archiving <https://builds.apache.org/job/ActiveMQ-Trunk-Deploy/ws/activemq-ra/pom.xml>
to org.apache.activemq/activemq-ra/5.16.0-SNAPSHOT/activemq-ra-5.16.0-SNAPSHOT.pom
[JENKINS] Archiving <https://builds.apache.org/job/ActiveMQ-Trunk-Deploy/ws/activemq-partition/pom.xml>
to org.apache.activemq/activemq-partition/5.16.0-SNAPSHOT/activemq-partition-5.16.0-SNAPSHOT.pom
[JENKINS] Archiving <https://builds.apache.org/job/ActiveMQ-Trunk-Deploy/ws/activemq-all/pom.xml>
to org.apache.activemq/activemq-all/5.16.0-SNAPSHOT/activemq-all-5.16.0-SNAPSHOT.pom
[JENKINS] Archiving <https://builds.apache.org/job/ActiveMQ-Trunk-Deploy/ws/assembly/pom.xml>
to org.apache.activemq/apache-activemq/5.16.0-SNAPSHOT/apache-activemq-5.16.0-SNAPSHOT.pom
[JENKINS] Archiving <https://builds.apache.org/job/ActiveMQ-Trunk-Deploy/ws/activemq-console/pom.xml>
to org.apache.activemq/activemq-console/5.16.0-SNAPSHOT/activemq-console-5.16.0-SNAPSHOT.pom
[JENKINS] Archiving <https://builds.apache.org/job/ActiveMQ-Trunk-Deploy/ws/activemq-spring/pom.xml>
to org.apache.activemq/activemq-spring/5.16.0-SNAPSHOT/activemq-spring-5.16.0-SNAPSHOT.pom
[JENKINS] Archiving <https://builds.apache.org/job/ActiveMQ-Trunk-Deploy/ws/activemq-cf/pom.xml>
to org.apache.activemq/activemq-cf/5.16.0-SNAPSHOT/activemq-cf-5.16.0-SNAPSHOT.pom
[JENKINS] Archiving <https://builds.apache.org/job/ActiveMQ-Trunk-Deploy/ws/activemq-leveldb-store/pom.xml>
to org.apache.activemq/activemq-leveldb-store/5.16.0-SNAPSHOT/activemq-leveldb-store-5.16.0-SNAPSHOT.pom
[JENKINS] Archiving <https://builds.apache.org/job/ActiveMQ-Trunk-Deploy/ws/activemq-web/pom.xml>
to org.apache.activemq/activemq-web/5.16.0-SNAPSHOT/activemq-web-5.16.0-SNAPSHOT.pom
[JENKINS] Archiving <https://builds.apache.org/job/ActiveMQ-Trunk-Deploy/ws/activemq-log4j-appender/pom.xml>
to org.apache.activemq/activemq-log4j-appender/5.16.0-SNAPSHOT/activemq-log4j-appender-5.16.0-SNAPSHOT.pom
Sending e-mails to: commits@activemq.apache.org
channel stopped
No JDK named ?JDK 1.8.0_102? found
No JDK named ?JDK 1.8.0_102? found

Mime
View raw message