activemq-commits mailing list archives

Site index · List index
Message view « Date » · « Thread »
Top « Date » · « Thread »
From Apache Jenkins Server <jenk...@builds.apache.org>
Subject Build failed in Jenkins: ActiveMQ-Artemis-Master #1340
Date Mon, 25 Sep 2017 15:14:18 GMT
See <https://builds.apache.org/job/ActiveMQ-Artemis-Master/1340/display/redirect?page=changes>

Changes:

[clebertsuconic] ARTEMIS-1433 adding AddressMemoryUsage() and

[clebertsuconic] ARTEMIS-1398 NPE on null pwd from MQTT client

------------------------------------------
[...truncated 3.64 MB...]
[INFO] Verification of feature transaction-api/1.2.0 succeeded
[INFO] Verification of feature transaction-manager-geronimo/1.3.2 succeeded
[INFO] Verification of feature transaction-manager-narayana/5.5.2.Final succeeded
[INFO] Verification of feature transaction/2.0.0 succeeded
[INFO] Verification of feature [transaction/2.0.0, aries-blueprint] succeeded
[INFO] Verification of feature connector/3.1.1 succeeded
[INFO] Verification of feature jpa/2.6.0 succeeded
[INFO] Verification of feature [jpa/2.6.0, aries-blueprint] succeeded
[INFO] Verification of feature openjpa/2.4.1 succeeded
[INFO] Verification of feature hibernate/5.2.8.Final succeeded
[INFO] Verification of feature eclipselink/2.6.4 succeeded
[INFO] Verification of feature jndi/4.1.1 succeeded
[INFO] Verification of feature jdbc/4.1.1 succeeded
[INFO] Verification of feature jms/4.1.1 succeeded
[INFO] Verification of feature application-without-isolation/1.0.0 succeeded
[INFO] Verification of feature subsystems/2.0.8 succeeded
[INFO] Verification of feature [subsystems/2.0.8, shell] succeeded
[INFO] Verification of feature artemis/2.4.0.SNAPSHOT succeeded
[INFO] Verification of feature netty-core/4.1.14.Final succeeded
[INFO] Verification of feature artemis-core/2.4.0.SNAPSHOT succeeded
[INFO] Verification of feature artemis-amqp/2.4.0.SNAPSHOT succeeded
[INFO] Verification of feature artemis-stomp/2.4.0.SNAPSHOT succeeded
[INFO] Verification of feature artemis-mqtt/2.4.0.SNAPSHOT succeeded
[INFO] Verification of feature artemis-hornetq/2.4.0.SNAPSHOT succeeded
[INFO] Verification of feature artemis-openwire/2.4.0.SNAPSHOT succeeded
[INFO] Verification of feature framework/4.1.1 succeeded
[INFO] Verification of feature framework-logback/4.1.1 succeeded
[INFO]                                                                         
[INFO] ------------------------------------------------------------------------
[INFO] Building ActiveMQ Artemis Test Support 2.4.0-SNAPSHOT
[INFO] ------------------------------------------------------------------------
[INFO] 
[INFO] --- maven-enforcer-plugin:1.4:enforce (enforce-maven) @ artemis-test-support ---
[INFO] 
[INFO] --- maven-enforcer-plugin:1.4:enforce (enforce-java) @ artemis-test-support ---
[INFO] 
[INFO] --- maven-remote-resources-plugin:1.5:process (process-resource-bundles) @ artemis-test-support
---
[INFO] 
[INFO] --- maven-resources-plugin:2.6:resources (default-resources) @ artemis-test-support
---
[INFO] Using 'UTF-8' encoding to copy filtered resources.
[INFO] skip non existing resourceDirectory <https://builds.apache.org/job/ActiveMQ-Artemis-Master/ws/tests/artemis-test-support/src/main/resources>
[INFO] Copying 3 resources
[INFO] 
[INFO] --- maven-compiler-plugin:3.1:compile (default-compile) @ artemis-test-support ---
[INFO] Changes detected - recompiling the module!
[INFO] Compiling 51 source files to <https://builds.apache.org/job/ActiveMQ-Artemis-Master/ws/tests/artemis-test-support/target/classes>
[INFO] 
[INFO] --- maven-checkstyle-plugin:2.17:check (default) @ artemis-test-support ---
[INFO] Starting audit...
Audit done.
[INFO] 
[INFO] --- apache-rat-plugin:0.12:check (default) @ artemis-test-support ---
[INFO] Enabled default license matchers.
[INFO] Will parse SCM ignores for exclusions...
[INFO] Finished adding exclusions from SCM ignore files.
[INFO] 61 implicit excludes (use -debug for more details).
[INFO] Exclude: **/*.txt
[INFO] Exclude: **/*.md
[INFO] Exclude: etc/ide-settings/**
[INFO] Exclude: docs/**/*.json
[INFO] Exclude: docs/**/_book/
[INFO] Exclude: **/target/
[INFO] Exclude: **/META-INF/services/*
[INFO] Exclude: **/META-INF/MANIFEST.MF
[INFO] Exclude: **/*.iml
[INFO] Exclude: **/*.jceks
[INFO] Exclude: **/*.jks
[INFO] Exclude: **/org/apache/activemq/artemis/utils/json/**
[INFO] Exclude: **/org/apache/activemq/artemis/utils/Base64.java
[INFO] Exclude: **/.settings/**
[INFO] Exclude: **/.project
[INFO] Exclude: **/.classpath
[INFO] Exclude: **/.editorconfig
[INFO] Exclude: **/.checkstyle
[INFO] Exclude: **/.factorypath
[INFO] Exclude: **/org.apache.activemq.artemis.cfg
[INFO] Exclude: **/nb-configuration.xml
[INFO] Exclude: **/*.data
[INFO] Exclude: **/*.bin
[INFO] Exclude: **/src/test/resources/keystore
[INFO] Exclude: **/*.log
[INFO] Exclude: **/*.redo
[INFO] Exclude: **/node/**
[INFO] Exclude: **/node_modules/**
[INFO] Exclude: **/package.json
[INFO] Exclude: **/npm-shrinkwrap.json
[INFO] Exclude: **/overlays/**
[INFO] Exclude: **/CMakeFiles/
[INFO] Exclude: **/Makefile
[INFO] Exclude: **/cmake_install.cmake
[INFO] Exclude: artemis-native/src/main/c/org_apache_activemq_artemis_jlibaio_LibaioContext.h
[INFO] Exclude: **/dependency-reduced-pom.xml
[INFO] 52 resources included (use -debug for more details)
[INFO] Rat check: Summary over all files. Unapproved: 0, unknown: 0, generated: 0, approved:
52 licenses.
[INFO] 
[INFO] --- maven-resources-plugin:2.6:testResources (default-testResources) @ artemis-test-support
---
[INFO] Using 'UTF-8' encoding to copy filtered resources.
[INFO] skip non existing resourceDirectory <https://builds.apache.org/job/ActiveMQ-Artemis-Master/ws/tests/artemis-test-support/src/test/resources>
[INFO] Copying 3 resources
[INFO] 
[INFO] --- maven-compiler-plugin:3.1:testCompile (default-testCompile) @ artemis-test-support
---
[INFO] No sources to compile
[INFO] 
[INFO] --- maven-surefire-plugin:2.18.1:test (default-test) @ artemis-test-support ---
[INFO] 
[INFO] --- maven-jar-plugin:2.4:jar (default-jar) @ artemis-test-support ---
[INFO] Building jar: <https://builds.apache.org/job/ActiveMQ-Artemis-Master/ws/tests/artemis-test-support/target/artemis-test-support-2.4.0-SNAPSHOT.jar>
[INFO] 
[INFO] --- maven-site-plugin:3.3:attach-descriptor (attach-descriptor) @ artemis-test-support
---
[INFO] 
[INFO] >>> maven-source-plugin:2.2.1:jar (attach-sources) > generate-sources @
artemis-test-support >>>
[INFO] 
[INFO] --- maven-enforcer-plugin:1.4:enforce (enforce-maven) @ artemis-test-support ---
[INFO] 
[INFO] --- maven-enforcer-plugin:1.4:enforce (enforce-java) @ artemis-test-support ---
[INFO] 
[INFO] <<< maven-source-plugin:2.2.1:jar (attach-sources) < generate-sources @
artemis-test-support <<<
[INFO] 
[INFO] --- maven-source-plugin:2.2.1:jar (attach-sources) @ artemis-test-support ---
[INFO] Building jar: <https://builds.apache.org/job/ActiveMQ-Artemis-Master/ws/tests/artemis-test-support/target/artemis-test-support-2.4.0-SNAPSHOT-sources.jar>
[INFO] 
[INFO] >>> maven-source-plugin:2.2.1:jar (default) > generate-sources @ artemis-test-support
>>>
[INFO] 
[INFO] --- maven-enforcer-plugin:1.4:enforce (enforce-maven) @ artemis-test-support ---
[INFO] 
[INFO] --- maven-enforcer-plugin:1.4:enforce (enforce-java) @ artemis-test-support ---
[INFO] 
[INFO] <<< maven-source-plugin:2.2.1:jar (default) < generate-sources @ artemis-test-support
<<<
[INFO] 
[INFO] --- maven-source-plugin:2.2.1:jar (default) @ artemis-test-support ---
[INFO] 
[INFO] --- dependency-check-maven:1.4.3:check (default) @ artemis-test-support ---
[INFO] Skipping dependency-check
[INFO] 
[INFO] --- maven-install-plugin:2.4:install (default-install) @ artemis-test-support ---
[INFO] Installing <https://builds.apache.org/job/ActiveMQ-Artemis-Master/ws/tests/artemis-test-support/target/artemis-test-support-2.4.0-SNAPSHOT.jar>
to /home/jenkins/.m2/repository/org/apache/activemq/tests/artemis-test-support/2.4.0-SNAPSHOT/artemis-test-support-2.4.0-SNAPSHOT.jar
[INFO] Installing <https://builds.apache.org/job/ActiveMQ-Artemis-Master/ws/tests/artemis-test-support/pom.xml>
to /home/jenkins/.m2/repository/org/apache/activemq/tests/artemis-test-support/2.4.0-SNAPSHOT/artemis-test-support-2.4.0-SNAPSHOT.pom
[INFO] Installing <https://builds.apache.org/job/ActiveMQ-Artemis-Master/ws/tests/artemis-test-support/target/artemis-test-support-2.4.0-SNAPSHOT-sources.jar>
to /home/jenkins/.m2/repository/org/apache/activemq/tests/artemis-test-support/2.4.0-SNAPSHOT/artemis-test-support-2.4.0-SNAPSHOT-sources.jar
[INFO] Installing <https://builds.apache.org/job/ActiveMQ-Artemis-Master/ws/tests/artemis-test-support/target/artemis-test-support-2.4.0-SNAPSHOT-sources.jar>
to /home/jenkins/.m2/repository/org/apache/activemq/tests/artemis-test-support/2.4.0-SNAPSHOT/artemis-test-support-2.4.0-SNAPSHOT-sources.jar
[INFO]                                                                         
[INFO] ------------------------------------------------------------------------
[INFO] Building ActiveMQ Artemis Integration Tests 2.4.0-SNAPSHOT
[INFO] ------------------------------------------------------------------------
[INFO] 
[INFO] --- maven-enforcer-plugin:1.4:enforce (enforce-maven) @ integration-tests ---
[INFO] 
[INFO] --- maven-enforcer-plugin:1.4:enforce (enforce-java) @ integration-tests ---
[INFO] 
[INFO] --- maven-remote-resources-plugin:1.5:process (process-resource-bundles) @ integration-tests
---
[INFO] 
[INFO] --- depends-maven-plugin:1.2:generate-depends-file (generate-depends-file) @ integration-tests
---
[INFO] Created: <https://builds.apache.org/job/ActiveMQ-Artemis-Master/ws/tests/integration-tests/target/classes/META-INF/maven/dependencies.properties>
[INFO] 
[INFO] --- maven-resources-plugin:2.6:resources (default-resources) @ integration-tests ---
[INFO] Using 'UTF-8' encoding to copy filtered resources.
[INFO] skip non existing resourceDirectory <https://builds.apache.org/job/ActiveMQ-Artemis-Master/ws/tests/integration-tests/src/main/resources>
[INFO] Copying 3 resources
[INFO] 
[INFO] --- maven-compiler-plugin:3.1:compile (default-compile) @ integration-tests ---
[INFO] No sources to compile
[INFO] 
[INFO] --- maven-checkstyle-plugin:2.17:check (default) @ integration-tests ---
[INFO] Starting audit...
[ERROR] <https://builds.apache.org/job/ActiveMQ-Artemis-Master/ws/tests/integration-tests/src/test/java/org/apache/activemq/artemis/tests/integration/mqtt/imported/MQTTSecurityTest.java>:25:8:
Unused import - org.jboss.logmanager.Level. [UnusedImports]
[ERROR] <https://builds.apache.org/job/ActiveMQ-Artemis-Master/ws/tests/integration-tests/src/test/java/org/apache/activemq/artemis/tests/integration/mqtt/imported/MQTTSecurityTest.java>:26:8:
Unused import - org.jboss.logmanager.Logger. [UnusedImports]
[ERROR] <https://builds.apache.org/job/ActiveMQ-Artemis-Master/ws/tests/integration-tests/src/test/java/org/apache/activemq/artemis/tests/integration/mqtt/imported/MQTTTestSupport.java>:31:
Using the '.*' form of import should be avoided - java.util.*. [AvoidStarImport]
Audit done.
[INFO] There are 3 errors reported by Checkstyle 7.7 with <https://builds.apache.org/job/ActiveMQ-Artemis-Master/ws/tests/integration-tests/../../etc/checkstyle.xml>
ruleset.
[ERROR] src/test/java/org/apache/activemq/artemis/tests/integration/mqtt/imported/MQTTSecurityTest.java:[25,8]
(imports) UnusedImports: Unused import - org.jboss.logmanager.Level.
[ERROR] src/test/java/org/apache/activemq/artemis/tests/integration/mqtt/imported/MQTTSecurityTest.java:[26,8]
(imports) UnusedImports: Unused import - org.jboss.logmanager.Logger.
[ERROR] src/test/java/org/apache/activemq/artemis/tests/integration/mqtt/imported/MQTTTestSupport.java:[31]
(imports) AvoidStarImport: Using the '.*' form of import should be avoided - java.util.*.
[INFO] ------------------------------------------------------------------------
[INFO] Reactor Summary:
[INFO] 
[INFO] ActiveMQ Artemis Parent ............................ SUCCESS [  3.827 s]
[INFO] ActiveMQ Artemis Commons ........................... SUCCESS [ 17.777 s]
[INFO] ActiveMQ Artemis Core Client ....................... SUCCESS [ 10.902 s]
[INFO] ActiveMQ Artemis Selector Implementation ........... SUCCESS [  3.082 s]
[INFO] ActiveMQ Artemis JMS Client ........................ SUCCESS [  3.546 s]
[INFO] ActiveMQ Artemis Native POM ........................ SUCCESS [  6.206 s]
[INFO] ActiveMQ Artemis Journal ........................... SUCCESS [  3.084 s]
[INFO] ActiveMQ Artemis JDBC Store ........................ SUCCESS [  4.830 s]
[INFO] ActiveMQ Artemis Server ............................ SUCCESS [ 53.364 s]
[INFO] ActiveMQ Artemis Protocols ......................... SUCCESS [  0.149 s]
[INFO] ActiveMQ Artemis AMQP Protocol ..................... SUCCESS [  4.260 s]
[INFO] ActiveMQ Artemis STOMP Protocol .................... SUCCESS [  1.654 s]
[INFO] ActiveMQ Artemis OpenWire Protocol ................. SUCCESS [  1.992 s]
[INFO] ActiveMQ Artemis HQClient Protocol ................. SUCCESS [  0.611 s]
[INFO] ActiveMQ Artemis HornetQ Protocol .................. SUCCESS [  0.617 s]
[INFO] ActiveMQ Artemis MQTT Protocol ..................... SUCCESS [  1.278 s]
[INFO] ActiveMQ Artemis DTO ............................... SUCCESS [  1.498 s]
[INFO] ActiveMQ Artemis Service Extensions ................ SUCCESS [  1.246 s]
[INFO] ActiveMQ Artemis JMS Server ........................ SUCCESS [  1.380 s]
[INFO] ActiveMQ Artemis CDI Integration ................... SUCCESS [  4.332 s]
[INFO] ActiveMQ Artemis Boot .............................. SUCCESS [  0.227 s]
[INFO] ActiveMQ Artemis Tools ............................. SUCCESS [  0.847 s]
[INFO] ActiveMQ Artemis CLI ............................... SUCCESS [ 27.793 s]
[INFO] ActiveMQ Artemis Web ............................... SUCCESS [  4.339 s]
[INFO] ActiveMQ Artemis Web ............................... SUCCESS [01:00 min]
[INFO] ActiveMQ Artemis Core Client All ................... SUCCESS [ 12.757 s]
[INFO] ActiveMQ Artemis JUnit Rules ....................... SUCCESS [ 12.569 s]
[INFO] ActiveMQ Artemis JMS Client All .................... SUCCESS [ 13.612 s]
[INFO] ActiveMQ Artemis RAR POM ........................... SUCCESS [  3.964 s]
[INFO] ActiveMQ Artemis REST Interface Implementation ..... SUCCESS [01:28 min]
[INFO] ActiveMQ Artemis Maven Plugin ...................... SUCCESS [  2.799 s]
[INFO] ActiveMQ Artemis Server OSGi ....................... SUCCESS [  8.198 s]
[INFO] ActiveMQ Artemis Cons .............................. SUCCESS [  0.098 s]
[INFO] ActiveMQ Artemis HawtIO Branding ................... SUCCESS [  4.039 s]
[INFO] ActiveMQ Artemis HawtIO Plugin ..................... SUCCESS [  0.576 s]
[INFO] ActiveMQ Artemis Console ........................... SUCCESS [  3.435 s]
[INFO] ActiveMQ Artemis Spring Integration ................ SUCCESS [  0.727 s]
[INFO] Apache ActiveMQ Artemis Distribution ............... SUCCESS [ 26.763 s]
[INFO] ActiveMQ Artemis Tests POM ......................... SUCCESS [  0.533 s]
[INFO] ActiveMQ Artemis Unit Tests ........................ SUCCESS [03:31 min]
[INFO] ActiveMQ Artemis Joram Tests ....................... SUCCESS [ 24.385 s]
[INFO] ActiveMQ Artemis timing Tests ...................... SUCCESS [  0.732 s]
[INFO] ActiveMQ Artemis JMS Tests ......................... SUCCESS [03:16 min]
[INFO] ActiveMQ Artemis Features .......................... SUCCESS [ 15.462 s]
[INFO] ActiveMQ Artemis Test Support ...................... SUCCESS [  1.544 s]
[INFO] ActiveMQ Artemis Integration Tests ................. FAILURE [ 15.284 s]
[INFO] ActiveMQ Artemis soak Tests ........................ SKIPPED
[INFO] ActiveMQ Artemis stress Tests ...................... SKIPPED
[INFO] ActiveMQ Artemis performance Tests ................. SKIPPED
[INFO] Smoke Tests ........................................ SKIPPED
[INFO] ActiveMQ Artemis Extra Tests ....................... SKIPPED
[INFO] ------------------------------------------------------------------------
[INFO] BUILD FAILURE
[INFO] ------------------------------------------------------------------------
[INFO] Total time: 14:25 min
[INFO] Finished at: 2017-09-25T15:14:10+00:00
[INFO] Final Memory: 334M/9082M
[INFO] ------------------------------------------------------------------------
[ERROR] Failed to execute goal org.apache.maven.plugins:maven-checkstyle-plugin:2.17:check
(default) on project integration-tests: You have 3 Checkstyle violations. -> [Help 1]
[ERROR] 
[ERROR] To see the full stack trace of the errors, re-run Maven with the -e switch.
[ERROR] Re-run Maven using the -X switch to enable full debug logging.
[ERROR] 
[ERROR] For more information about the errors and possible solutions, please read the following
articles:
[ERROR] [Help 1] http://cwiki.apache.org/confluence/display/MAVEN/MojoFailureException
[ERROR] 
[ERROR] After correcting the problems, you can resume the build with the command
[ERROR]   mvn <goals> -rf :integration-tests
Build step 'Invoke top-level Maven targets' marked build as failure
Performing Post build task...
Could not match :Too many files with unapproved license  : False
Logical operation result is FALSE
Skipping script  : cat ratReport.txt
END OF POST BUILD TASK 	: 0
Recording test results

Mime
View raw message