activemq-commits mailing list archives

Site index · List index
Message view « Date » · « Thread »
Top « Date » · « Thread »
From Apache Jenkins Server <jenk...@builds.apache.org>
Subject Build failed in Jenkins: ActiveMQ-Trunk-Deploy #1904
Date Fri, 15 Sep 2017 14:19:22 GMT
See <https://builds.apache.org/job/ActiveMQ-Trunk-Deploy/1904/display/redirect?page=changes>

Changes:

[christopher.l.shannon] AMQ-6811 - fix reduceMemoryFootprint when no message body

------------------------------------------
[...truncated 97.20 KB...]
[INFO] Installing <https://builds.apache.org/job/ActiveMQ-Trunk-Deploy/ws/activemq-blueprint/target/activemq-blueprint-5.16.0-SNAPSHOT-sources.jar>
to /home/jenkins/jenkins-slave/maven-repositories/1/org/apache/activemq/activemq-blueprint/5.16.0-SNAPSHOT/activemq-blueprint-5.16.0-SNAPSHOT-sources.jar
[INFO] 
[INFO] --- maven-bundle-plugin:2.3.7:install (default-install) @ activemq-blueprint ---
[INFO] Installing org/apache/activemq/activemq-blueprint/5.16.0-SNAPSHOT/activemq-blueprint-5.16.0-SNAPSHOT.jar
[INFO] Writing OBR metadata
[INFO] 
[INFO] --- maven-deploy-plugin:2.8.2:deploy (default-deploy) @ activemq-blueprint ---
[INFO] Downloading: https://repository.apache.org/content/repositories/snapshots/org/apache/activemq/activemq-blueprint/5.16.0-SNAPSHOT/maven-metadata.xml
[INFO] Downloaded: https://repository.apache.org/content/repositories/snapshots/org/apache/activemq/activemq-blueprint/5.16.0-SNAPSHOT/maven-metadata.xml
(1009 B at 1.8 KB/sec)
[INFO] Uploading: https://repository.apache.org/content/repositories/snapshots/org/apache/activemq/activemq-blueprint/5.16.0-SNAPSHOT/activemq-blueprint-5.16.0-20170915.141807-27.jar
[INFO] Uploaded: https://repository.apache.org/content/repositories/snapshots/org/apache/activemq/activemq-blueprint/5.16.0-SNAPSHOT/activemq-blueprint-5.16.0-20170915.141807-27.jar
(9 KB at 10.1 KB/sec)
[INFO] Uploading: https://repository.apache.org/content/repositories/snapshots/org/apache/activemq/activemq-blueprint/5.16.0-SNAPSHOT/activemq-blueprint-5.16.0-20170915.141807-27.pom
[INFO] Uploaded: https://repository.apache.org/content/repositories/snapshots/org/apache/activemq/activemq-blueprint/5.16.0-SNAPSHOT/activemq-blueprint-5.16.0-20170915.141807-27.pom
(3 KB at 3.1 KB/sec)
[INFO] Downloading: https://repository.apache.org/content/repositories/snapshots/org/apache/activemq/activemq-blueprint/maven-metadata.xml
[INFO] Downloaded: https://repository.apache.org/content/repositories/snapshots/org/apache/activemq/activemq-blueprint/maven-metadata.xml
(359 B at 0.6 KB/sec)
[INFO] Uploading: https://repository.apache.org/content/repositories/snapshots/org/apache/activemq/activemq-blueprint/5.16.0-SNAPSHOT/maven-metadata.xml
[INFO] Uploaded: https://repository.apache.org/content/repositories/snapshots/org/apache/activemq/activemq-blueprint/5.16.0-SNAPSHOT/maven-metadata.xml
(1009 B at 1.2 KB/sec)
[INFO] Uploading: https://repository.apache.org/content/repositories/snapshots/org/apache/activemq/activemq-blueprint/maven-metadata.xml
[INFO] Uploaded: https://repository.apache.org/content/repositories/snapshots/org/apache/activemq/activemq-blueprint/maven-metadata.xml
(359 B at 0.4 KB/sec)
[INFO] Uploading: https://repository.apache.org/content/repositories/snapshots/org/apache/activemq/activemq-blueprint/5.16.0-SNAPSHOT/activemq-blueprint-5.16.0-20170915.141807-27-sources.jar
[INFO] Uploaded: https://repository.apache.org/content/repositories/snapshots/org/apache/activemq/activemq-blueprint/5.16.0-SNAPSHOT/activemq-blueprint-5.16.0-20170915.141807-27-sources.jar
(7 KB at 7.2 KB/sec)
[INFO] Uploading: https://repository.apache.org/content/repositories/snapshots/org/apache/activemq/activemq-blueprint/5.16.0-SNAPSHOT/maven-metadata.xml
[INFO] Uploaded: https://repository.apache.org/content/repositories/snapshots/org/apache/activemq/activemq-blueprint/5.16.0-SNAPSHOT/maven-metadata.xml
(1009 B at 1.2 KB/sec)
[INFO] 
[INFO] --- maven-bundle-plugin:2.3.7:deploy (default-deploy) @ activemq-blueprint ---
[INFO] Remote OBR update disabled (enable with -DremoteOBR)
[INFO]                                                                         
[INFO] ------------------------------------------------------------------------
[INFO] Skipping ActiveMQ :: Web Demo
[INFO] This project has been banned from the build due to previous failures.
[INFO] ------------------------------------------------------------------------
[INFO]                                                                         
[INFO] ------------------------------------------------------------------------
[INFO] Skipping ActiveMQ :: Web Console
[INFO] This project has been banned from the build due to previous failures.
[INFO] ------------------------------------------------------------------------
[INFO]                                                                         
[INFO] ------------------------------------------------------------------------
[INFO] Skipping ActiveMQ :: Karaf Integration Tests
[INFO] This project has been banned from the build due to previous failures.
[INFO] ------------------------------------------------------------------------
[INFO]                                                                         
[INFO] ------------------------------------------------------------------------
[INFO] Skipping ActiveMQ :: Integration Test :: Spring 3.1
[INFO] This project has been banned from the build due to previous failures.
[INFO] ------------------------------------------------------------------------
[INFO]                                                                         
[INFO] ------------------------------------------------------------------------
[INFO] Skipping ActiveMQ :: Assembly
[INFO] This project has been banned from the build due to previous failures.
[INFO] ------------------------------------------------------------------------
[INFO] ------------------------------------------------------------------------
[INFO] Reactor Summary:
[INFO] 
[INFO] ActiveMQ ........................................... SUCCESS [ 10.979 s]
[INFO] ActiveMQ :: Openwire Generator ..................... SUCCESS [01:42 min]
[INFO] ActiveMQ :: Client ................................. FAILURE [  5.693 s]
[INFO] ActiveMQ :: Openwire Legacy Support ................ SKIPPED
[INFO] ActiveMQ :: JAAS ................................... SUCCESS [02:13 min]
[INFO] ActiveMQ :: Broker ................................. SKIPPED
[INFO] ActiveMQ :: KahaDB Store ........................... SKIPPED
[INFO] ActiveMQ :: STOMP Protocol ......................... SKIPPED
[INFO] ActiveMQ :: MQTT Protocol .......................... SKIPPED
[INFO] ActiveMQ :: JDBC Store ............................. SKIPPED
[INFO] ActiveMQ :: LevelDB Store .......................... SKIPPED
[INFO] ActiveMQ :: Generic JMS Pool ....................... SKIPPED
[INFO] ActiveMQ :: Pool ................................... SKIPPED
[INFO] ActiveMQ :: RA ..................................... SKIPPED
[INFO] ActiveMQ :: Spring ................................. SKIPPED
[INFO] ActiveMQ :: Console ................................ SKIPPED
[INFO] ActiveMQ :: Partition Management ................... SKIPPED
[INFO] ActiveMQ :: Runtime Configuration .................. SKIPPED
[INFO] ActiveMQ :: Tooling ................................ SUCCESS [  5.880 s]
[INFO] ActiveMQ :: JUnit Rule ............................. SKIPPED
[INFO] ActiveMQ :: Unit Tests ............................. SKIPPED
[INFO] ActiveMQ :: HTTP Protocol Support .................. SKIPPED
[INFO] ActiveMQ :: AMQP ................................... SKIPPED
[INFO] ActiveMQ :: Camel .................................. SKIPPED
[INFO] ActiveMQ :: All JAR bundle ......................... SKIPPED
[INFO] ActiveMQ :: Log4j Appender ......................... SKIPPED
[INFO] ActiveMQ :: Apache Karaf ........................... SKIPPED
[INFO] ActiveMQ :: ConnectionFactory ...................... SKIPPED
[INFO] ActiveMQ :: RAR .................................... SKIPPED
[INFO] ActiveMQ :: Run Jar ................................ SKIPPED
[INFO] ActiveMQ :: Shiro .................................. SKIPPED
[INFO] ActiveMQ :: Memory Usage Test Plugin ............... SKIPPED
[INFO] ActiveMQ :: Performance Test Plugin ................ SKIPPED
[INFO] ActiveMQ :: StartUp/Stop Plugin .................... SKIPPED
[INFO] ActiveMQ :: Web .................................... SKIPPED
[INFO] ActiveMQ :: OSGi bundle ............................ SKIPPED
[INFO] ActiveMQ :: Blueprint .............................. SUCCESS [ 10.468 s]
[INFO] ActiveMQ :: Web Demo ............................... SKIPPED
[INFO] ActiveMQ :: Web Console ............................ SKIPPED
[INFO] ActiveMQ :: Karaf Integration Tests ................ SKIPPED
[INFO] ActiveMQ :: Integration Test :: Spring 3.1 ......... SKIPPED
[INFO] ActiveMQ :: Assembly ............................... SKIPPED
[INFO] ------------------------------------------------------------------------
[INFO] BUILD FAILURE
[INFO] ------------------------------------------------------------------------
[INFO] Total time: 05:19 min
[INFO] Finished at: 2017-09-15T14:18:45+00:00
[INFO] Final Memory: 83M/1292M
[INFO] ------------------------------------------------------------------------
[ERROR] Failed to execute goal org.apache.maven.plugins:maven-compiler-plugin:3.3:compile
(default-compile) on project activemq-client: Compilation failure: Compilation failure:
[ERROR] <https://builds.apache.org/job/ActiveMQ-Trunk-Deploy/ws/activemq-client/src/main/java/org/apache/activemq/command/ActiveMQMessageIsMarshalledTest.java>:[19,24]
package org.junit does not exist
[ERROR] <https://builds.apache.org/job/ActiveMQ-Trunk-Deploy/ws/activemq-client/src/main/java/org/apache/activemq/command/ActiveMQMessageIsMarshalledTest.java>:[19,1]
static import only from classes and interfaces
[ERROR] <https://builds.apache.org/job/ActiveMQ-Trunk-Deploy/ws/activemq-client/src/main/java/org/apache/activemq/command/ActiveMQMessageIsMarshalledTest.java>:[20,24]
package org.junit does not exist
[ERROR] <https://builds.apache.org/job/ActiveMQ-Trunk-Deploy/ws/activemq-client/src/main/java/org/apache/activemq/command/ActiveMQMessageIsMarshalledTest.java>:[20,1]
static import only from classes and interfaces
[ERROR] <https://builds.apache.org/job/ActiveMQ-Trunk-Deploy/ws/activemq-client/src/main/java/org/apache/activemq/command/ActiveMQMessageIsMarshalledTest.java>:[28,17]
package org.junit does not exist
[ERROR] <https://builds.apache.org/job/ActiveMQ-Trunk-Deploy/ws/activemq-client/src/main/java/org/apache/activemq/command/ActiveMQMessageIsMarshalledTest.java>:[29,24]
package org.junit.runner does not exist
[ERROR] <https://builds.apache.org/job/ActiveMQ-Trunk-Deploy/ws/activemq-client/src/main/java/org/apache/activemq/command/ActiveMQMessageIsMarshalledTest.java>:[30,25]
package org.junit.runners does not exist
[ERROR] <https://builds.apache.org/job/ActiveMQ-Trunk-Deploy/ws/activemq-client/src/main/java/org/apache/activemq/command/ActiveMQMessageIsMarshalledTest.java>:[31,39]
package org.junit.runners.Parameterized does not exist
[ERROR] <https://builds.apache.org/job/ActiveMQ-Trunk-Deploy/ws/activemq-client/src/main/java/org/apache/activemq/command/ActiveMQMessageIsMarshalledTest.java>:[36,2]
cannot find symbol
[ERROR] symbol: class RunWith
[ERROR] <https://builds.apache.org/job/ActiveMQ-Trunk-Deploy/ws/activemq-client/src/main/java/org/apache/activemq/command/ActiveMQMessageIsMarshalledTest.java>:[43,6]
cannot find symbol
[ERROR] symbol:   class Parameters
[ERROR] location: class org.apache.activemq.command.ActiveMQMessageIsMarshalledTest
[ERROR] <https://builds.apache.org/job/ActiveMQ-Trunk-Deploy/ws/activemq-client/src/main/java/org/apache/activemq/command/ActiveMQMessageIsMarshalledTest.java>:[60,6]
cannot find symbol
[ERROR] symbol:   class Test
[ERROR] location: class org.apache.activemq.command.ActiveMQMessageIsMarshalledTest
[ERROR] <https://builds.apache.org/job/ActiveMQ-Trunk-Deploy/ws/activemq-client/src/main/java/org/apache/activemq/command/ActiveMQMessageIsMarshalledTest.java>:[66,6]
cannot find symbol
[ERROR] symbol:   class Test
[ERROR] location: class org.apache.activemq.command.ActiveMQMessageIsMarshalledTest
[ERROR] <https://builds.apache.org/job/ActiveMQ-Trunk-Deploy/ws/activemq-client/src/main/java/org/apache/activemq/command/ActiveMQMessageIsMarshalledTest.java>:[72,6]
cannot find symbol
[ERROR] symbol:   class Test
[ERROR] location: class org.apache.activemq.command.ActiveMQMessageIsMarshalledTest
[ERROR] <https://builds.apache.org/job/ActiveMQ-Trunk-Deploy/ws/activemq-client/src/main/java/org/apache/activemq/command/ActiveMQMessageIsMarshalledTest.java>:[78,6]
cannot find symbol
[ERROR] symbol:   class Test
[ERROR] location: class org.apache.activemq.command.ActiveMQMessageIsMarshalledTest
[ERROR] <https://builds.apache.org/job/ActiveMQ-Trunk-Deploy/ws/activemq-client/src/main/java/org/apache/activemq/command/ActiveMQMessageIsMarshalledTest.java>:[83,9]
cannot find symbol
[ERROR] symbol:   method assertTrue(boolean)
[ERROR] location: class org.apache.activemq.command.ActiveMQMessageIsMarshalledTest
[ERROR] <https://builds.apache.org/job/ActiveMQ-Trunk-Deploy/ws/activemq-client/src/main/java/org/apache/activemq/command/ActiveMQMessageIsMarshalledTest.java>:[177,13]
cannot find symbol
[ERROR] symbol:   method assertFalse(boolean)
[ERROR] location: class org.apache.activemq.command.ActiveMQMessageIsMarshalledTest
[ERROR] <https://builds.apache.org/job/ActiveMQ-Trunk-Deploy/ws/activemq-client/src/main/java/org/apache/activemq/command/ActiveMQMessageIsMarshalledTest.java>:[179,13]
cannot find symbol
[ERROR] symbol:   method assertFalse(boolean)
[ERROR] location: class org.apache.activemq.command.ActiveMQMessageIsMarshalledTest
[ERROR] <https://builds.apache.org/job/ActiveMQ-Trunk-Deploy/ws/activemq-client/src/main/java/org/apache/activemq/command/ActiveMQMessageIsMarshalledTest.java>:[182,13]
cannot find symbol
[ERROR] symbol:   method assertTrue(boolean)
[ERROR] location: class org.apache.activemq.command.ActiveMQMessageIsMarshalledTest
[ERROR] <https://builds.apache.org/job/ActiveMQ-Trunk-Deploy/ws/activemq-client/src/main/java/org/apache/activemq/command/ActiveMQMessageIsMarshalledTest.java>:[183,13]
cannot find symbol
[ERROR] symbol:   method assertTrue(boolean)
[ERROR] location: class org.apache.activemq.command.ActiveMQMessageIsMarshalledTest
[ERROR] <https://builds.apache.org/job/ActiveMQ-Trunk-Deploy/ws/activemq-client/src/main/java/org/apache/activemq/command/ActiveMQMessageIsMarshalledTest.java>:[184,13]
cannot find symbol
[ERROR] symbol:   method assertTrue(boolean)
[ERROR] location: class org.apache.activemq.command.ActiveMQMessageIsMarshalledTest
[ERROR] -> [Help 1]
org.apache.maven.lifecycle.LifecycleExecutionException: Failed to execute goal org.apache.maven.plugins:maven-compiler-plugin:3.3:compile
(default-compile) on project activemq-client: Compilation failure
	at org.apache.maven.lifecycle.internal.MojoExecutor.execute(MojoExecutor.java:212)
	at org.apache.maven.lifecycle.internal.MojoExecutor.execute(MojoExecutor.java:153)
	at org.apache.maven.lifecycle.internal.MojoExecutor.execute(MojoExecutor.java:145)
	at org.apache.maven.lifecycle.internal.LifecycleModuleBuilder.buildProject(LifecycleModuleBuilder.java:116)
	at org.apache.maven.lifecycle.internal.LifecycleModuleBuilder.buildProject(LifecycleModuleBuilder.java:80)
	at org.apache.maven.lifecycle.internal.builder.singlethreaded.SingleThreadedBuilder.build(SingleThreadedBuilder.java:51)
	at org.apache.maven.lifecycle.internal.LifecycleStarter.execute(LifecycleStarter.java:128)
	at org.apache.maven.DefaultMaven.doExecute(DefaultMaven.java:307)
	at org.apache.maven.DefaultMaven.doExecute(DefaultMaven.java:193)
	at org.apache.maven.DefaultMaven.execute(DefaultMaven.java:106)
	at org.jvnet.hudson.maven3.launcher.Maven33Launcher.main(Maven33Launcher.java:129)
	at sun.reflect.NativeMethodAccessorImpl.invoke0(Native Method)
	at sun.reflect.NativeMethodAccessorImpl.invoke(NativeMethodAccessorImpl.java:62)
	at sun.reflect.DelegatingMethodAccessorImpl.invoke(DelegatingMethodAccessorImpl.java:43)
	at java.lang.reflect.Method.invoke(Method.java:498)
	at org.codehaus.plexus.classworlds.launcher.Launcher.launchStandard(Launcher.java:330)
	at org.codehaus.plexus.classworlds.launcher.Launcher.launch(Launcher.java:238)
	at jenkins.maven3.agent.Maven33Main.launch(Maven33Main.java:176)
	at sun.reflect.NativeMethodAccessorImpl.invoke0(Native Method)
	at sun.reflect.NativeMethodAccessorImpl.invoke(NativeMethodAccessorImpl.java:62)
	at sun.reflect.DelegatingMethodAccessorImpl.invoke(DelegatingMethodAccessorImpl.java:43)
	at java.lang.reflect.Method.invoke(Method.java:498)
	at hudson.maven.Maven3Builder.call(Maven3Builder.java:139)
	at hudson.maven.Maven3Builder.call(Maven3Builder.java:70)
	at hudson.remoting.UserRequest.perform(UserRequest.java:153)
	at hudson.remoting.UserRequest.perform(UserRequest.java:50)
	at hudson.remoting.Request$2.run(Request.java:336)
	at hudson.remoting.InterceptingExecutorService$1.call(InterceptingExecutorService.java:68)
	at java.util.concurrent.FutureTask.run(FutureTask.java:266)
	at java.util.concurrent.ThreadPoolExecutor.runWorker(ThreadPoolExecutor.java:1142)
	at java.util.concurrent.ThreadPoolExecutor$Worker.run(ThreadPoolExecutor.java:617)
	at java.lang.Thread.run(Thread.java:745)
Caused by: org.apache.maven.plugin.compiler.CompilationFailureException: Compilation failure
	at org.apache.maven.plugin.compiler.AbstractCompilerMojo.execute(AbstractCompilerMojo.java:911)
	at org.apache.maven.plugin.compiler.CompilerMojo.execute(CompilerMojo.java:129)
	at org.apache.maven.plugin.DefaultBuildPluginManager.executeMojo(DefaultBuildPluginManager.java:134)
	at org.apache.maven.lifecycle.internal.MojoExecutor.execute(MojoExecutor.java:208)
	... 31 more
[ERROR] 
[ERROR] Re-run Maven using the -X switch to enable full debug logging.
[ERROR] 
[ERROR] For more information about the errors and possible solutions, please read the following
articles:
[ERROR] [Help 1] http://cwiki.apache.org/confluence/display/MAVEN/MojoFailureException
[ERROR] 
[ERROR] After correcting the problems, you can resume the build with the command
[ERROR]   mvn <goals> -rf :activemq-client
[JENKINS] Archiving <https://builds.apache.org/job/ActiveMQ-Trunk-Deploy/ws/activemq-kahadb-store/pom.xml>
to org.apache.activemq/activemq-kahadb-store/5.16.0-SNAPSHOT/activemq-kahadb-store-5.16.0-SNAPSHOT.pom
[JENKINS] Archiving <https://builds.apache.org/job/ActiveMQ-Trunk-Deploy/ws/activemq-osgi/pom.xml>
to org.apache.activemq/activemq-osgi/5.16.0-SNAPSHOT/activemq-osgi-5.16.0-SNAPSHOT.pom
[JENKINS] Archiving <https://builds.apache.org/job/ActiveMQ-Trunk-Deploy/ws/activemq-unit-tests/pom.xml>
to org.apache.activemq/activemq-unit-tests/5.16.0-SNAPSHOT/activemq-unit-tests-5.16.0-SNAPSHOT.pom
[Fast Archiver] Compressed 72.14 KB of artifacts by 44.4% relative to #1903
[JENKINS] Archiving <https://builds.apache.org/job/ActiveMQ-Trunk-Deploy/ws/activemq-openwire-legacy/pom.xml>
to org.apache.activemq/activemq-openwire-legacy/5.16.0-SNAPSHOT/activemq-openwire-legacy-5.16.0-SNAPSHOT.pom
[JENKINS] Archiving <https://builds.apache.org/job/ActiveMQ-Trunk-Deploy/ws/activemq-karaf-itest/pom.xml>
to org.apache.activemq/activemq-karaf-itest/5.16.0-SNAPSHOT/activemq-karaf-itest-5.16.0-SNAPSHOT.pom
[JENKINS] Archiving <https://builds.apache.org/job/ActiveMQ-Trunk-Deploy/ws/activemq-rar/pom.xml>
to org.apache.activemq/activemq-rar/5.16.0-SNAPSHOT/activemq-rar-5.16.0-SNAPSHOT.pom
[JENKINS] Archiving <https://builds.apache.org/job/ActiveMQ-Trunk-Deploy/ws/activemq-http/pom.xml>
to org.apache.activemq/activemq-http/5.16.0-SNAPSHOT/activemq-http-5.16.0-SNAPSHOT.pom
[JENKINS] Archiving <https://builds.apache.org/job/ActiveMQ-Trunk-Deploy/ws/activemq-amqp/pom.xml>
to org.apache.activemq/activemq-amqp/5.16.0-SNAPSHOT/activemq-amqp-5.16.0-SNAPSHOT.pom
[JENKINS] Archiving <https://builds.apache.org/job/ActiveMQ-Trunk-Deploy/ws/activemq-client/pom.xml>
to org.apache.activemq/activemq-client/5.16.0-SNAPSHOT/activemq-client-5.16.0-SNAPSHOT.pom
[JENKINS] Archiving <https://builds.apache.org/job/ActiveMQ-Trunk-Deploy/ws/activemq-blueprint/pom.xml>
to org.apache.activemq/activemq-blueprint/5.16.0-SNAPSHOT/activemq-blueprint-5.16.0-SNAPSHOT.pom
[JENKINS] Archiving <https://builds.apache.org/job/ActiveMQ-Trunk-Deploy/ws/activemq-blueprint/target/activemq-blueprint-5.16.0-SNAPSHOT.jar>
to org.apache.activemq/activemq-blueprint/5.16.0-20170915.141807-27/activemq-blueprint-5.16.0-20170915.141807-27.jar
[JENKINS] Archiving <https://builds.apache.org/job/ActiveMQ-Trunk-Deploy/ws/activemq-blueprint/target/activemq-blueprint-5.16.0-SNAPSHOT-sources.jar>
to org.apache.activemq/activemq-blueprint/5.16.0-20170915.141807-27/activemq-blueprint-5.16.0-20170915.141807-27-sources.jar
[JENKINS] Archiving <https://builds.apache.org/job/ActiveMQ-Trunk-Deploy/ws/activemq-tooling/activemq-junit/pom.xml>
to org.apache.activemq.tooling/activemq-junit/5.16.0-SNAPSHOT/activemq-junit-5.16.0-SNAPSHOT.pom
[JENKINS] Archiving <https://builds.apache.org/job/ActiveMQ-Trunk-Deploy/ws/activemq-tooling/pom.xml>
to org.apache.activemq.tooling/activemq-tooling/5.16.0-SNAPSHOT/activemq-tooling-5.16.0-SNAPSHOT.pom
[JENKINS] Archiving <https://builds.apache.org/job/ActiveMQ-Trunk-Deploy/ws/activemq-jms-pool/pom.xml>
to org.apache.activemq/activemq-jms-pool/5.16.0-SNAPSHOT/activemq-jms-pool-5.16.0-SNAPSHOT.pom
[JENKINS] Archiving <https://builds.apache.org/job/ActiveMQ-Trunk-Deploy/ws/activemq-pool/pom.xml>
to org.apache.activemq/activemq-pool/5.16.0-SNAPSHOT/activemq-pool-5.16.0-SNAPSHOT.pom
[JENKINS] Archiving <https://builds.apache.org/job/ActiveMQ-Trunk-Deploy/ws/activemq-jdbc-store/pom.xml>
to org.apache.activemq/activemq-jdbc-store/5.16.0-SNAPSHOT/activemq-jdbc-store-5.16.0-SNAPSHOT.pom
[JENKINS] Archiving <https://builds.apache.org/job/ActiveMQ-Trunk-Deploy/ws/activemq-camel/pom.xml>
to org.apache.activemq/activemq-camel/5.16.0-SNAPSHOT/activemq-camel-5.16.0-SNAPSHOT.pom
[JENKINS] Archiving <https://builds.apache.org/job/ActiveMQ-Trunk-Deploy/ws/activemq-runtime-config/pom.xml>
to org.apache.activemq/activemq-runtime-config/5.16.0-SNAPSHOT/activemq-runtime-config-5.16.0-SNAPSHOT.pom
[JENKINS] Archiving <https://builds.apache.org/job/ActiveMQ-Trunk-Deploy/ws/pom.xml>
to org.apache.activemq/activemq-parent/5.16.0-SNAPSHOT/activemq-parent-5.16.0-SNAPSHOT.pom
[Fast Archiver] Compressed 60.55 KB of artifacts by 52.8% relative to #1903
[JENKINS] Archiving <https://builds.apache.org/job/ActiveMQ-Trunk-Deploy/ws/activemq-stomp/pom.xml>
to org.apache.activemq/activemq-stomp/5.16.0-SNAPSHOT/activemq-stomp-5.16.0-SNAPSHOT.pom
[JENKINS] Archiving <https://builds.apache.org/job/ActiveMQ-Trunk-Deploy/ws/activemq-openwire-generator/pom.xml>
to org.apache.activemq/activemq-openwire-generator/5.16.0-SNAPSHOT/activemq-openwire-generator-5.16.0-SNAPSHOT.pom
[JENKINS] Archiving <https://builds.apache.org/job/ActiveMQ-Trunk-Deploy/ws/activemq-openwire-generator/target/activemq-openwire-generator-5.16.0-SNAPSHOT.jar>
to org.apache.activemq/activemq-openwire-generator/5.16.0-20170915.141518-27/activemq-openwire-generator-5.16.0-20170915.141518-27.jar
[JENKINS] Archiving <https://builds.apache.org/job/ActiveMQ-Trunk-Deploy/ws/activemq-openwire-generator/target/activemq-openwire-generator-5.16.0-SNAPSHOT-sources.jar>
to org.apache.activemq/activemq-openwire-generator/5.16.0-20170915.141518-27/activemq-openwire-generator-5.16.0-20170915.141518-27-sources.jar
[JENKINS] Archiving <https://builds.apache.org/job/ActiveMQ-Trunk-Deploy/ws/activemq-openwire-generator/target/activemq-openwire-generator-5.16.0-SNAPSHOT-javadoc.jar>
to org.apache.activemq/activemq-openwire-generator/5.16.0-20170915.141518-27/activemq-openwire-generator-5.16.0-20170915.141518-27-javadoc.jar
[JENKINS] Archiving <https://builds.apache.org/job/ActiveMQ-Trunk-Deploy/ws/activemq-broker/pom.xml>
to org.apache.activemq/activemq-broker/5.16.0-SNAPSHOT/activemq-broker-5.16.0-SNAPSHOT.pom
[JENKINS] Archiving <https://builds.apache.org/job/ActiveMQ-Trunk-Deploy/ws/activemq-web-demo/pom.xml>
to org.apache.activemq/activemq-web-demo/5.16.0-SNAPSHOT/activemq-web-demo-5.16.0-SNAPSHOT.pom
[JENKINS] Archiving <https://builds.apache.org/job/ActiveMQ-Trunk-Deploy/ws/activemq-mqtt/pom.xml>
to org.apache.activemq/activemq-mqtt/5.16.0-SNAPSHOT/activemq-mqtt-5.16.0-SNAPSHOT.pom
[JENKINS] Archiving <https://builds.apache.org/job/ActiveMQ-Trunk-Deploy/ws/activemq-shiro/pom.xml>
to org.apache.activemq/activemq-shiro/5.16.0-SNAPSHOT/activemq-shiro-5.16.0-SNAPSHOT.pom
[JENKINS] Archiving <https://builds.apache.org/job/ActiveMQ-Trunk-Deploy/ws/activemq-tooling/activemq-perf-maven-plugin/pom.xml>
to org.apache.activemq.tooling/activemq-perf-maven-plugin/5.16.0-SNAPSHOT/activemq-perf-maven-plugin-5.16.0-SNAPSHOT.pom
[JENKINS] Archiving <https://builds.apache.org/job/ActiveMQ-Trunk-Deploy/ws/activemq-run/pom.xml>
to org.apache.activemq/activemq-run/5.16.0-SNAPSHOT/activemq-run-5.16.0-SNAPSHOT.pom
[JENKINS] Archiving <https://builds.apache.org/job/ActiveMQ-Trunk-Deploy/ws/activemq-tooling/activemq-maven-plugin/pom.xml>
to org.apache.activemq.tooling/activemq-maven-plugin/5.16.0-SNAPSHOT/activemq-maven-plugin-5.16.0-SNAPSHOT.pom
[JENKINS] Archiving <https://builds.apache.org/job/ActiveMQ-Trunk-Deploy/ws/activemq-karaf/pom.xml>
to org.apache.activemq/activemq-karaf/5.16.0-SNAPSHOT/activemq-karaf-5.16.0-SNAPSHOT.pom
[JENKINS] Archiving <https://builds.apache.org/job/ActiveMQ-Trunk-Deploy/ws/activemq-web-console/pom.xml>
to org.apache.activemq/activemq-web-console/5.16.0-SNAPSHOT/activemq-web-console-5.16.0-SNAPSHOT.pom
[JENKINS] Archiving <https://builds.apache.org/job/ActiveMQ-Trunk-Deploy/ws/activemq-jaas/pom.xml>
to org.apache.activemq/activemq-jaas/5.16.0-SNAPSHOT/activemq-jaas-5.16.0-SNAPSHOT.pom
[JENKINS] Archiving <https://builds.apache.org/job/ActiveMQ-Trunk-Deploy/ws/activemq-jaas/target/activemq-jaas-5.16.0-SNAPSHOT.jar>
to org.apache.activemq/activemq-jaas/5.16.0-20170915.141745-27/activemq-jaas-5.16.0-20170915.141745-27.jar
[JENKINS] Archiving <https://builds.apache.org/job/ActiveMQ-Trunk-Deploy/ws/activemq-jaas/target/activemq-jaas-5.16.0-SNAPSHOT-sources.jar>
to org.apache.activemq/activemq-jaas/5.16.0-20170915.141745-27/activemq-jaas-5.16.0-20170915.141745-27-sources.jar
[JENKINS] Archiving <https://builds.apache.org/job/ActiveMQ-Trunk-Deploy/ws/activemq-jaas/target/activemq-jaas-5.16.0-SNAPSHOT-javadoc.jar>
to org.apache.activemq/activemq-jaas/5.16.0-20170915.141745-27/activemq-jaas-5.16.0-20170915.141745-27-javadoc.jar
[JENKINS] Archiving <https://builds.apache.org/job/ActiveMQ-Trunk-Deploy/ws/activemq-itests-spring31/pom.xml>
to org.apache.activemq/activemq-itests-spring31/5.16.0-SNAPSHOT/activemq-itests-spring31-5.16.0-SNAPSHOT.pom
[JENKINS] Archiving <https://builds.apache.org/job/ActiveMQ-Trunk-Deploy/ws/activemq-tooling/activemq-memtest-maven-plugin/pom.xml>
to org.apache.activemq.tooling/activemq-memtest-maven-plugin/5.16.0-SNAPSHOT/activemq-memtest-maven-plugin-5.16.0-SNAPSHOT.pom
[JENKINS] Archiving <https://builds.apache.org/job/ActiveMQ-Trunk-Deploy/ws/activemq-ra/pom.xml>
to org.apache.activemq/activemq-ra/5.16.0-SNAPSHOT/activemq-ra-5.16.0-SNAPSHOT.pom
[JENKINS] Archiving <https://builds.apache.org/job/ActiveMQ-Trunk-Deploy/ws/activemq-partition/pom.xml>
to org.apache.activemq/activemq-partition/5.16.0-SNAPSHOT/activemq-partition-5.16.0-SNAPSHOT.pom
[JENKINS] Archiving <https://builds.apache.org/job/ActiveMQ-Trunk-Deploy/ws/activemq-all/pom.xml>
to org.apache.activemq/activemq-all/5.16.0-SNAPSHOT/activemq-all-5.16.0-SNAPSHOT.pom
[JENKINS] Archiving <https://builds.apache.org/job/ActiveMQ-Trunk-Deploy/ws/assembly/pom.xml>
to org.apache.activemq/apache-activemq/5.16.0-SNAPSHOT/apache-activemq-5.16.0-SNAPSHOT.pom
[JENKINS] Archiving <https://builds.apache.org/job/ActiveMQ-Trunk-Deploy/ws/activemq-console/pom.xml>
to org.apache.activemq/activemq-console/5.16.0-SNAPSHOT/activemq-console-5.16.0-SNAPSHOT.pom
[JENKINS] Archiving <https://builds.apache.org/job/ActiveMQ-Trunk-Deploy/ws/activemq-spring/pom.xml>
to org.apache.activemq/activemq-spring/5.16.0-SNAPSHOT/activemq-spring-5.16.0-SNAPSHOT.pom
[JENKINS] Archiving <https://builds.apache.org/job/ActiveMQ-Trunk-Deploy/ws/activemq-cf/pom.xml>
to org.apache.activemq/activemq-cf/5.16.0-SNAPSHOT/activemq-cf-5.16.0-SNAPSHOT.pom
[JENKINS] Archiving <https://builds.apache.org/job/ActiveMQ-Trunk-Deploy/ws/activemq-leveldb-store/pom.xml>
to org.apache.activemq/activemq-leveldb-store/5.16.0-SNAPSHOT/activemq-leveldb-store-5.16.0-SNAPSHOT.pom
[JENKINS] Archiving <https://builds.apache.org/job/ActiveMQ-Trunk-Deploy/ws/activemq-web/pom.xml>
to org.apache.activemq/activemq-web/5.16.0-SNAPSHOT/activemq-web-5.16.0-SNAPSHOT.pom
[JENKINS] Archiving <https://builds.apache.org/job/ActiveMQ-Trunk-Deploy/ws/activemq-log4j-appender/pom.xml>
to org.apache.activemq/activemq-log4j-appender/5.16.0-SNAPSHOT/activemq-log4j-appender-5.16.0-SNAPSHOT.pom
Sending e-mails to: commits@activemq.apache.org
channel stopped

Mime
View raw message