activemq-commits mailing list archives

Site index · List index
Message view « Date » · « Thread »
Top « Date » · « Thread »
From Apache Jenkins Server <jenk...@builds.apache.org>
Subject Build failed in Jenkins: ActiveMQ-Artemis-Master #1309
Date Wed, 06 Sep 2017 11:10:47 GMT
See <https://builds.apache.org/job/ActiveMQ-Artemis-Master/1309/display/redirect?page=changes>

Changes:

[mtaylor] ARTEMIS-1387 Fix AMQPtoMQTT and Link route issues

------------------------------------------
[...truncated 1.91 MB...]
#test testClear
[main] 11:10:00,779 INFO  [org.apache.activemq.artemis.core.server] #*#*# Finished test: testClear()...
[main] 11:10:00,780 INFO  [org.apache.activemq.artemis.core.server] #*#*# Starting test: testPoll()...
#test testPoll
[main] 11:10:00,789 INFO  [org.apache.activemq.artemis.core.server] #*#*# Finished test: testPoll()...
[main] 11:10:00,790 INFO  [org.apache.activemq.artemis.core.server] #*#*# Starting test: testRemoveHead1()...
#test testRemoveHead1
[main] 11:10:00,803 INFO  [org.apache.activemq.artemis.core.server] #*#*# Finished test: testRemoveHead1()...
[main] 11:10:00,804 INFO  [org.apache.activemq.artemis.core.server] #*#*# Starting test: testRemoveHead2()...
#test testRemoveHead2
[main] 11:10:00,820 INFO  [org.apache.activemq.artemis.core.server] #*#*# Finished test: testRemoveHead2()...
[main] 11:10:00,821 INFO  [org.apache.activemq.artemis.core.server] #*#*# Starting test: testRemoveHead3()...
#test testRemoveHead3
[main] 11:10:00,833 INFO  [org.apache.activemq.artemis.core.server] #*#*# Finished test: testRemoveHead3()...
[main] 11:10:00,833 INFO  [org.apache.activemq.artemis.core.server] #*#*# Starting test: testRemoveTail1()...
#test testRemoveTail1
[main] 11:10:00,844 INFO  [org.apache.activemq.artemis.core.server] #*#*# Finished test: testRemoveTail1()...
[main] 11:10:00,845 INFO  [org.apache.activemq.artemis.core.server] #*#*# Starting test: testRemoveTail2()...
#test testRemoveTail2
[main] 11:10:00,853 INFO  [org.apache.activemq.artemis.core.server] #*#*# Finished test: testRemoveTail2()...
[main] 11:10:00,853 INFO  [org.apache.activemq.artemis.core.server] #*#*# Starting test: testRemoveTail3()...
#test testRemoveTail3
[main] 11:10:00,862 INFO  [org.apache.activemq.artemis.core.server] #*#*# Finished test: testRemoveTail3()...
[main] 11:10:00,862 INFO  [org.apache.activemq.artemis.core.server] #*#*# Starting test: testRemoveInTurn()...
#test testRemoveInTurn
[main] 11:10:00,872 INFO  [org.apache.activemq.artemis.core.server] #*#*# Finished test: testRemoveInTurn()...
[main] 11:10:00,872 INFO  [org.apache.activemq.artemis.core.server] #*#*# Starting test: testRemoveMiddle()...
#test testRemoveMiddle
[main] 11:10:00,889 INFO  [org.apache.activemq.artemis.core.server] #*#*# Finished test: testRemoveMiddle()...
[main] 11:10:00,890 INFO  [org.apache.activemq.artemis.core.server] #*#*# Starting test: testAddHeadAndRemove()...
#test testAddHeadAndRemove
Jumping 500
[main] 11:10:00,900 INFO  [org.apache.activemq.artemis.utils.ThreadLeakCheckRule] #test forceGC
[main] 11:10:01,528 INFO  [org.apache.activemq.artemis.utils.ThreadLeakCheckRule] #test forceGC
Done 
[main] 11:10:01,543 INFO  [org.apache.activemq.artemis.core.server] #*#*# Finished test: testAddHeadAndRemove()...
[main] 11:10:01,544 INFO  [org.apache.activemq.artemis.core.server] #*#*# Starting test: testMultipleIterators1()...
#test testMultipleIterators1
[main] 11:10:01,552 INFO  [org.apache.activemq.artemis.core.server] #*#*# Finished test: testMultipleIterators1()...
[main] 11:10:01,552 INFO  [org.apache.activemq.artemis.core.server] #*#*# Starting test: testMultipleIterators2()...
#test testMultipleIterators2
[main] 11:10:01,558 INFO  [org.apache.activemq.artemis.core.server] #*#*# Finished test: testMultipleIterators2()...
[main] 11:10:01,565 INFO  [org.apache.activemq.artemis.core.server] #*#*# Starting test: testResizing()...
#test testResizing
[main] 11:10:01,592 INFO  [org.apache.activemq.artemis.core.server] #*#*# Finished test: testResizing()...
[main] 11:10:01,592 INFO  [org.apache.activemq.artemis.core.server] #*#*# Starting test: testRepeatAndRemove()...
#test testRepeatAndRemove
[main] 11:10:01,597 INFO  [org.apache.activemq.artemis.core.server] #*#*# Finished test: testRepeatAndRemove()...
[main] 11:10:01,597 INFO  [org.apache.activemq.artemis.core.server] #*#*# Starting test: testIterateNoElements()...
#test testIterateNoElements
[main] 11:10:01,602 INFO  [org.apache.activemq.artemis.core.server] #*#*# Finished test: testIterateNoElements()...
[main] 11:10:01,602 INFO  [org.apache.activemq.artemis.core.server] #*#*# Starting test: testAddAndRemove()...
#test testAddAndRemove
[main] 11:10:01,630 INFO  [org.apache.activemq.artemis.utils.ThreadLeakCheckRule] #test forceGC
[main] 11:10:01,739 INFO  [org.apache.activemq.artemis.utils.ThreadLeakCheckRule] #test forceGC
Done 
[main] 11:10:02,037 INFO  [org.apache.activemq.artemis.utils.ThreadLeakCheckRule] #test forceGC
[main] 11:10:03,378 INFO  [org.apache.activemq.artemis.utils.ThreadLeakCheckRule] #test forceGC
Done 
[main] 11:10:03,378 INFO  [org.apache.activemq.artemis.utils.ThreadLeakCheckRule] #test forceGC
[main] 11:10:03,549 INFO  [org.apache.activemq.artemis.utils.ThreadLeakCheckRule] #test forceGC
Done 
[main] 11:10:03,767 INFO  [org.apache.activemq.artemis.utils.ThreadLeakCheckRule] #test forceGC
[main] 11:10:04,692 INFO  [org.apache.activemq.artemis.utils.ThreadLeakCheckRule] #test forceGC
Done 
[main] 11:10:05,387 INFO  [org.apache.activemq.artemis.utils.ThreadLeakCheckRule] #test forceGC
[main] 11:10:05,512 INFO  [org.apache.activemq.artemis.utils.ThreadLeakCheckRule] #test forceGC
Done 
[main] 11:10:06,142 INFO  [org.apache.activemq.artemis.utils.ThreadLeakCheckRule] #test forceGC
[main] 11:10:06,266 INFO  [org.apache.activemq.artemis.utils.ThreadLeakCheckRule] #test forceGC
Done 
[main] 11:10:06,266 INFO  [org.apache.activemq.artemis.utils.ThreadLeakCheckRule] #test forceGC
[main] 11:10:06,334 INFO  [org.apache.activemq.artemis.utils.ThreadLeakCheckRule] #test forceGC
Done 
[main] 11:10:06,334 INFO  [org.apache.activemq.artemis.utils.ThreadLeakCheckRule] #test forceGC
[main] 11:10:06,424 INFO  [org.apache.activemq.artemis.utils.ThreadLeakCheckRule] #test forceGC
Done 
[main] 11:10:06,424 INFO  [org.apache.activemq.artemis.utils.ThreadLeakCheckRule] #test forceGC
[main] 11:10:06,518 INFO  [org.apache.activemq.artemis.utils.ThreadLeakCheckRule] #test forceGC
Done 
[main] 11:10:07,175 INFO  [org.apache.activemq.artemis.utils.ThreadLeakCheckRule] #test forceGC
[main] 11:10:07,418 INFO  [org.apache.activemq.artemis.utils.ThreadLeakCheckRule] #test forceGC
Done 
[main] 11:10:07,418 INFO  [org.apache.activemq.artemis.utils.ThreadLeakCheckRule] #test forceGC
[main] 11:10:07,475 INFO  [org.apache.activemq.artemis.utils.ThreadLeakCheckRule] #test forceGC
Done 
[main] 11:10:07,489 INFO  [org.apache.activemq.artemis.core.server] #*#*# Finished test: testAddAndRemove()...
[main] 11:10:07,490 INFO  [org.apache.activemq.artemis.core.server] #*#*# Starting test: testRemoveHeadAndTail1()...
#test testRemoveHeadAndTail1
[main] 11:10:07,496 INFO  [org.apache.activemq.artemis.core.server] #*#*# Finished test: testRemoveHeadAndTail1()...
[main] 11:10:07,497 INFO  [org.apache.activemq.artemis.core.server] #*#*# Starting test: testRemoveHeadAndTail2()...
#test testRemoveHeadAndTail2
[main] 11:10:07,502 INFO  [org.apache.activemq.artemis.core.server] #*#*# Finished test: testRemoveHeadAndTail2()...
[main] 11:10:07,502 INFO  [org.apache.activemq.artemis.core.server] #*#*# Starting test: testRemoveHeadAndTail3()...
#test testRemoveHeadAndTail3
[main] 11:10:07,508 INFO  [org.apache.activemq.artemis.core.server] #*#*# Finished test: testRemoveHeadAndTail3()...
[main] 11:10:07,508 INFO  [org.apache.activemq.artemis.core.server] #*#*# Starting test: testRepeat()...
#test testRepeat
[main] 11:10:07,514 INFO  [org.apache.activemq.artemis.core.server] #*#*# Finished test: testRepeat()...
[main] 11:10:07,514 INFO  [org.apache.activemq.artemis.core.server] #*#*# Starting test: testCreateIteratorBeforeAddElements()...
#test testCreateIteratorBeforeAddElements
[main] 11:10:07,520 INFO  [org.apache.activemq.artemis.core.server] #*#*# Finished test: testCreateIteratorBeforeAddElements()...
[main] 11:10:07,520 INFO  [org.apache.activemq.artemis.core.server] #*#*# Starting test: testRemoveAll()...
#test testRemoveAll
[main] 11:10:07,527 INFO  [org.apache.activemq.artemis.core.server] #*#*# Finished test: testRemoveAll()...
[main] 11:10:07,527 INFO  [org.apache.activemq.artemis.core.server] #*#*# Starting test: testRemoveOdd()...
#test testRemoveOdd
[main] 11:10:07,533 INFO  [org.apache.activemq.artemis.core.server] #*#*# Finished test: testRemoveOdd()...
[main] 11:10:07,533 INFO  [org.apache.activemq.artemis.core.server] #*#*# Starting test: testIterateThenAddMoreAndIterateAgain()...
#test testIterateThenAddMoreAndIterateAgain
[main] 11:10:07,539 INFO  [org.apache.activemq.artemis.core.server] #*#*# Finished test: testIterateThenAddMoreAndIterateAgain()...
Tests run: 29, Failures: 0, Errors: 0, Skipped: 0, Time elapsed: 6.811 sec - in org.apache.activemq.artemis.tests.unit.util.LinkedListTest
Running org.apache.activemq.artemis.tests.unit.util.MemorySizeTest
[main] 11:10:17,497 WARN  [org.apache.activemq.artemis.core.client] AMQ212047: Warning: JVM
allocated more data what would make results invalid 2,376,073,216:1,908,932,608
[main] 11:10:17,497 INFO  [org.apache.activemq.artemis.tests.unit] Server message size is
1216
[main] 11:10:27,159 WARN  [org.apache.activemq.artemis.core.client] AMQ212047: Warning: JVM
allocated more data what would make results invalid 1,908,932,608:2,012,217,344
[main] 11:10:27,159 INFO  [org.apache.activemq.artemis.tests.unit] Message reference size
is 64
Tests run: 1, Failures: 0, Errors: 0, Skipped: 0, Time elapsed: 19.614 sec - in org.apache.activemq.artemis.tests.unit.util.MemorySizeTest
Running org.apache.activemq.artemis.tests.unit.util.ObjectInputStreamWithClassLoaderTest
[main] 11:10:27,161 INFO  [org.apache.activemq.artemis.core.server] #*#*# Starting test: testClassLoaderIsolationWithProxy()...
#test testClassLoaderIsolationWithProxy
Deserialized Object org.apache.activemq.artemis.tests.unit.util.ObjectInputStreamWithClassLoaderTest$AnObjectImpl@4784013e
[main] 11:10:27,209 INFO  [org.apache.activemq.artemis.core.server] #*#*# Finished test: testClassLoaderIsolationWithProxy()...
[main] 11:10:27,209 INFO  [org.apache.activemq.artemis.core.server] #*#*# Starting test: testWhiteBlackListAgainstListObject()...
#test testWhiteBlackListAgainstListObject
[main] 11:10:27,218 INFO  [org.apache.activemq.artemis.core.server] #*#*# Finished test: testWhiteBlackListAgainstListObject()...
[main] 11:10:27,218 INFO  [org.apache.activemq.artemis.core.server] #*#*# Starting test: testWhiteBlackListAgainstArrayObject()...
#test testWhiteBlackListAgainstArrayObject
[main] 11:10:27,223 INFO  [org.apache.activemq.artemis.core.server] #*#*# Finished test: testWhiteBlackListAgainstArrayObject()...
[main] 11:10:27,223 INFO  [org.apache.activemq.artemis.core.server] #*#*# Starting test: testWhiteBlackListAnonymousObject()...
#test testWhiteBlackListAnonymousObject
[main] 11:10:27,239 INFO  [org.apache.activemq.artemis.core.server] #*#*# Finished test: testWhiteBlackListAnonymousObject()...
[main] 11:10:27,239 INFO  [org.apache.activemq.artemis.core.server] #*#*# Starting test: testWhiteBlackListLocalObject()...
#test testWhiteBlackListLocalObject
[main] 11:10:27,245 INFO  [org.apache.activemq.artemis.core.server] #*#*# Finished test: testWhiteBlackListLocalObject()...
[main] 11:10:27,245 INFO  [org.apache.activemq.artemis.core.server] #*#*# Starting test: testWhiteBlackListSystemProperty()...
#test testWhiteBlackListSystemProperty
[main] 11:10:27,250 INFO  [org.apache.activemq.artemis.core.server] #*#*# Finished test: testWhiteBlackListSystemProperty()...
[main] 11:10:27,251 INFO  [org.apache.activemq.artemis.core.server] #*#*# Starting test: testClassLoaderIsolation()...
#test testClassLoaderIsolation
[main] 11:10:27,263 INFO  [org.apache.activemq.artemis.core.server] #*#*# Finished test: testClassLoaderIsolation()...
[main] 11:10:27,264 INFO  [org.apache.activemq.artemis.core.server] #*#*# Starting test: testWhiteBlackList()...
#test testWhiteBlackList
[main] 11:10:27,270 INFO  [org.apache.activemq.artemis.core.server] #*#*# Finished test: testWhiteBlackList()...
[main] 11:10:27,270 INFO  [org.apache.activemq.artemis.core.server] #*#*# Starting test: testWhiteBlackListAgainstListMapObject()...
#test testWhiteBlackListAgainstListMapObject
[main] 11:10:27,279 INFO  [org.apache.activemq.artemis.core.server] #*#*# Finished test: testWhiteBlackListAgainstListMapObject()...
Tests run: 9, Failures: 0, Errors: 0, Skipped: 0, Time elapsed: 0.116 sec - in org.apache.activemq.artemis.tests.unit.util.ObjectInputStreamWithClassLoaderTest
Running org.apache.activemq.artemis.tests.unit.util.ReusableLatchTest
[main] 11:10:27,281 INFO  [org.apache.activemq.artemis.core.server] #*#*# Starting test: testLatchWithParameterizedDown()...
#test testLatchWithParameterizedDown
[main] 11:10:27,285 INFO  [org.apache.activemq.artemis.core.server] #*#*# Finished test: testLatchWithParameterizedDown()...
[main] 11:10:27,286 INFO  [org.apache.activemq.artemis.core.server] #*#*# Starting test: testLatchOnSingleThread()...
#test testLatchOnSingleThread
[main] 11:10:27,290 INFO  [org.apache.activemq.artemis.core.server] #*#*# Finished test: testLatchOnSingleThread()...
[main] 11:10:27,290 INFO  [org.apache.activemq.artemis.core.server] #*#*# Starting test: testReuseLatch()...
#test testReuseLatch
[main] 11:10:27,297 INFO  [org.apache.activemq.artemis.core.server] #*#*# Finished test: testReuseLatch()...
[main] 11:10:27,297 INFO  [org.apache.activemq.artemis.core.server] #*#*# Starting test: testLatchOnMultiThread()...
#test testLatchOnMultiThread
[main] 11:10:27,495 INFO  [org.apache.activemq.artemis.core.server] #*#*# Finished test: testLatchOnMultiThread()...
Tests run: 4, Failures: 0, Errors: 0, Skipped: 0, Time elapsed: 0.215 sec - in org.apache.activemq.artemis.tests.unit.util.ReusableLatchTest
Running org.apache.activemq.artemis.tests.unit.util.SoftValueMapTest
[main] 11:10:27,497 INFO  [org.apache.activemq.artemis.core.server] #*#*# Starting test: testEvictionsLeastUsed()...
#test testEvictionsLeastUsed
[main] 11:10:27,500 INFO  [org.apache.activemq.artemis.utils.ThreadLeakCheckRule] #test forceGC
[main] 11:10:27,653 INFO  [org.apache.activemq.artemis.utils.ThreadLeakCheckRule] #test forceGC
Done 
SoftCache.size 200
Soft cache has 200 elements
[main] 11:10:27,671 INFO  [org.apache.activemq.artemis.core.server] #*#*# Finished test: testEvictionsLeastUsed()...
[main] 11:10:27,672 INFO  [org.apache.activemq.artemis.core.server] #*#*# Starting test: testEvictions()...
#test testEvictions
[main] 11:10:27,677 INFO  [org.apache.activemq.artemis.utils.ThreadLeakCheckRule] #test forceGC
[main] 11:10:27,775 INFO  [org.apache.activemq.artemis.utils.ThreadLeakCheckRule] #test forceGC
Done 
Killed

Results :

Tests run: 603, Failures: 0, Errors: 0, Skipped: 0

[INFO] ------------------------------------------------------------------------
[INFO] Reactor Summary:
[INFO] 
[INFO] ActiveMQ Artemis Parent ............................ SUCCESS [  9.409 s]
[INFO] ActiveMQ Artemis Commons ........................... SUCCESS [ 27.214 s]
[INFO] ActiveMQ Artemis Core Client ....................... SUCCESS [ 17.324 s]
[INFO] ActiveMQ Artemis Selector Implementation ........... SUCCESS [  5.820 s]
[INFO] ActiveMQ Artemis JMS Client ........................ SUCCESS [  5.896 s]
[INFO] ActiveMQ Artemis Native POM ........................ SUCCESS [  7.948 s]
[INFO] ActiveMQ Artemis Journal ........................... SUCCESS [  3.650 s]
[INFO] ActiveMQ Artemis JDBC Store ........................ SUCCESS [  7.370 s]
[INFO] ActiveMQ Artemis Server ............................ SUCCESS [01:02 min]
[INFO] ActiveMQ Artemis Protocols ......................... SUCCESS [  0.286 s]
[INFO] ActiveMQ Artemis AMQP Protocol ..................... SUCCESS [  5.947 s]
[INFO] ActiveMQ Artemis STOMP Protocol .................... SUCCESS [  2.394 s]
[INFO] ActiveMQ Artemis OpenWire Protocol ................. SUCCESS [  3.560 s]
[INFO] ActiveMQ Artemis HQClient Protocol ................. SUCCESS [  0.967 s]
[INFO] ActiveMQ Artemis HornetQ Protocol .................. SUCCESS [  0.805 s]
[INFO] ActiveMQ Artemis MQTT Protocol ..................... SUCCESS [  1.425 s]
[INFO] ActiveMQ Artemis DTO ............................... SUCCESS [  2.464 s]
[INFO] ActiveMQ Artemis Service Extensions ................ SUCCESS [  1.336 s]
[INFO] ActiveMQ Artemis JMS Server ........................ SUCCESS [  1.643 s]
[INFO] ActiveMQ Artemis CDI Integration ................... SUCCESS [  5.911 s]
[INFO] ActiveMQ Artemis Boot .............................. SUCCESS [  0.200 s]
[INFO] ActiveMQ Artemis Tools ............................. SUCCESS [  1.014 s]
[INFO] ActiveMQ Artemis CLI ............................... SUCCESS [ 32.776 s]
[INFO] ActiveMQ Artemis Web ............................... SUCCESS [  5.452 s]
[INFO] ActiveMQ Artemis Web ............................... SUCCESS [01:23 min]
[INFO] ActiveMQ Artemis Core Client All ................... SUCCESS [ 17.773 s]
[INFO] ActiveMQ Artemis JUnit Rules ....................... SUCCESS [ 16.903 s]
[INFO] ActiveMQ Artemis JMS Client All .................... SUCCESS [ 11.806 s]
[INFO] ActiveMQ Artemis RAR POM ........................... SUCCESS [  2.084 s]
[INFO] ActiveMQ Artemis REST Interface Implementation ..... SUCCESS [01:30 min]
[INFO] ActiveMQ Artemis Maven Plugin ...................... SUCCESS [  3.743 s]
[INFO] ActiveMQ Artemis Server OSGi ....................... SUCCESS [ 11.622 s]
[INFO] ActiveMQ Artemis Cons .............................. SUCCESS [  0.156 s]
[INFO] ActiveMQ Artemis HawtIO Branding ................... SUCCESS [  5.291 s]
[INFO] ActiveMQ Artemis HawtIO Plugin ..................... SUCCESS [  0.774 s]
[INFO] ActiveMQ Artemis Console ........................... SUCCESS [  3.895 s]
[INFO] ActiveMQ Artemis Spring Integration ................ SUCCESS [  0.642 s]
[INFO] Apache ActiveMQ Artemis Distribution ............... SUCCESS [ 24.610 s]
[INFO] ActiveMQ Artemis Tests POM ......................... SUCCESS [  0.745 s]
[INFO] ActiveMQ Artemis Unit Tests ........................ FAILURE [02:33 min]
[INFO] ActiveMQ Artemis Joram Tests ....................... SKIPPED
[INFO] ActiveMQ Artemis timing Tests ...................... SKIPPED
[INFO] ActiveMQ Artemis JMS Tests ......................... SKIPPED
[INFO] ActiveMQ Artemis Features .......................... SKIPPED
[INFO] ActiveMQ Artemis Test Support ...................... SKIPPED
[INFO] ActiveMQ Artemis Integration Tests ................. SKIPPED
[INFO] ActiveMQ Artemis soak Tests ........................ SKIPPED
[INFO] ActiveMQ Artemis stress Tests ...................... SKIPPED
[INFO] ActiveMQ Artemis performance Tests ................. SKIPPED
[INFO] Smoke Tests ........................................ SKIPPED
[INFO] ActiveMQ Artemis Extra Tests ....................... SKIPPED
[INFO] ------------------------------------------------------------------------
[INFO] BUILD FAILURE
[INFO] ------------------------------------------------------------------------
[INFO] Total time: 10:47 min
[INFO] Finished at: 2017-09-06T11:10:31+00:00
[INFO] Final Memory: 257M/1726M
[INFO] ------------------------------------------------------------------------
[ERROR] Failed to execute goal org.apache.maven.plugins:maven-surefire-plugin:2.18.1:test
(default-test) on project unit-tests: Execution default-test of goal org.apache.maven.plugins:maven-surefire-plugin:2.18.1:test
failed: The forked VM terminated without properly saying goodbye. VM crash or System.exit
called?
[ERROR] Command was /bin/sh -c cd <https://builds.apache.org/job/ActiveMQ-Artemis-Master/ws/tests/unit-tests>
&& /usr/local/asfpackages/java/jdk1.8.0_144/jre/bin/java -Djava.util.logging.manager=org.jboss.logmanager.LogManager
-Dlogging.configuration=<https://builds.apache.org/job/ActiveMQ-Artemis-Master/ws/tests/unit-tests/../../tests/config/logging.properties>
-Djava.library.path=<https://builds.apache.org/job/ActiveMQ-Artemis-Master/ws/tests/unit-tests/../../artemis-native/bin>
-Djgroups.bind_addr=localhost -Dorg.apache.activemq.artemis.api.core.UDPBroadcastEndpointFactory.localBindAddress=localhost
-Djava.net.preferIPv4Stack=true -Dbasedir=<https://builds.apache.org/job/ActiveMQ-Artemis-Master/ws/tests/unit-tests>
-jar <https://builds.apache.org/job/ActiveMQ-Artemis-Master/ws/tests/unit-tests/target/surefire/surefirebooter6980037447032140190.jar>
<https://builds.apache.org/job/ActiveMQ-Artemis-Master/ws/tests/unit-tests/target/surefire/surefire3036078508306696009tmp>
<https://builds.apache.org/job/ActiveMQ-Artemis-Master/ws/tests/unit-tests/target/surefire/surefire_164693394875272459402tmp>
[ERROR] -> [Help 1]
[ERROR] 
[ERROR] To see the full stack trace of the errors, re-run Maven with the -e switch.
[ERROR] Re-run Maven using the -X switch to enable full debug logging.
[ERROR] 
[ERROR] For more information about the errors and possible solutions, please read the following
articles:
[ERROR] [Help 1] http://cwiki.apache.org/confluence/display/MAVEN/PluginExecutionException
[ERROR] 
[ERROR] After correcting the problems, you can resume the build with the command
[ERROR]   mvn <goals> -rf :unit-tests
Build step 'Invoke top-level Maven targets' marked build as failure
Performing Post build task...
Could not match :Too many files with unapproved license  : False
Logical operation result is FALSE
Skipping script  : cat ratReport.txt
END OF POST BUILD TASK 	: 0
Recording test results
Not sending mail to unregistered user mtaylor@redhat.com

Mime
View raw message