activemq-commits mailing list archives

Site index · List index
Message view « Date » · « Thread »
Top « Date » · « Thread »
From Apache Jenkins Server <jenk...@builds.apache.org>
Subject Build failed in Jenkins: ActiveMQ-Artemis-Master #1311
Date Wed, 06 Sep 2017 14:39:48 GMT
See <https://builds.apache.org/job/ActiveMQ-Artemis-Master/1311/display/redirect?page=changes>

Changes:

[clebertsuconic] ARTEMIS-1385 fixed incomplete comment and typo (appendix)

------------------------------------------
[...truncated 2.31 MB...]
	at org.junit.runners.ParentRunner.runChildren(ParentRunner.java:236) [junit-4.11.jar:]
	at org.junit.runners.ParentRunner.access$000(ParentRunner.java:53) [junit-4.11.jar:]
	at org.junit.runners.ParentRunner$2.evaluate(ParentRunner.java:229) [junit-4.11.jar:]
	at org.junit.runners.ParentRunner.run(ParentRunner.java:309) [junit-4.11.jar:]
	at org.apache.maven.surefire.junit4.JUnit4Provider.execute(JUnit4Provider.java:283) [surefire-junit4-2.18.1.jar:2.18.1]
	at org.apache.maven.surefire.junit4.JUnit4Provider.executeWithRerun(JUnit4Provider.java:173)
[surefire-junit4-2.18.1.jar:2.18.1]
	at org.apache.maven.surefire.junit4.JUnit4Provider.executeTestSet(JUnit4Provider.java:153)
[surefire-junit4-2.18.1.jar:2.18.1]
	at org.apache.maven.surefire.junit4.JUnit4Provider.invoke(JUnit4Provider.java:128) [surefire-junit4-2.18.1.jar:2.18.1]
	at org.apache.maven.surefire.booter.ForkedBooter.invokeProviderInSameClassLoader(ForkedBooter.java:203)
[surefire-booter-2.18.1.jar:2.18.1]
	at org.apache.maven.surefire.booter.ForkedBooter.runSuitesInProcess(ForkedBooter.java:155)
[surefire-booter-2.18.1.jar:2.18.1]
	at org.apache.maven.surefire.booter.ForkedBooter.main(ForkedBooter.java:103) [surefire-booter-2.18.1.jar:2.18.1]

[main] 14:36:27,456 INFO  [org.apache.activemq.artemis.ra] AMQ151001: Attempting to reconnect
org.apache.activemq.artemis.ra.inflow.ActiveMQActivationSpec(ra=org.apache.activemq.artemis.ra.ActiveMQResourceAdapter@3c4bef00
destination=test destinationType=javax.jms.Topic ack=Auto-acknowledge durable=false clientID=null
user=user password=**** maxSession=1)
[main] 14:36:27,456 INFO  [org.apache.activemq.artemis.ra] AMQ151004: Instantiating javax.jms.Topic
"test" directly since UseJNDI=false.
[Thread-0 (ActiveMQ-remoting-threads-ActiveMQServerImpl::serverUUID=c2b941b8-9310-11e7-b936-02424ee64064-646445398)]
14:36:27,460 WARN  [org.apache.activemq.artemis.core.server] AMQ222216: Security problem while
creating session: AMQ119031: Unable to validate user from invm:0. Username: user; SSL certificate
subject DN: unavailable
[main] 14:36:27,464 ERROR [org.apache.activemq.artemis.ra] AMQ154003: Unable to reconnect
org.apache.activemq.artemis.ra.inflow.ActiveMQActivationSpec(ra=org.apache.activemq.artemis.ra.ActiveMQResourceAdapter@3c4bef00
destination=test destinationType=javax.jms.Topic ack=Auto-acknowledge durable=false clientID=null
user=user password=**** maxSession=1): ActiveMQSecurityException[errorType=SECURITY_EXCEPTION
message=AMQ119031: Unable to validate user from invm:0. Username: user; SSL certificate subject
DN: unavailable]
	at org.apache.activemq.artemis.core.protocol.core.impl.ChannelImpl.sendBlocking(ChannelImpl.java:409)
[artemis-core-client-2.4.0-SNAPSHOT.jar:2.4.0-SNAPSHOT]
	at org.apache.activemq.artemis.core.protocol.core.impl.ChannelImpl.sendBlocking(ChannelImpl.java:319)
[artemis-core-client-2.4.0-SNAPSHOT.jar:2.4.0-SNAPSHOT]
	at org.apache.activemq.artemis.core.protocol.core.impl.ActiveMQClientProtocolManager.createSessionContext(ActiveMQClientProtocolManager.java:288)
[artemis-core-client-2.4.0-SNAPSHOT.jar:2.4.0-SNAPSHOT]
	at org.apache.activemq.artemis.core.protocol.core.impl.ActiveMQClientProtocolManager.createSessionContext(ActiveMQClientProtocolManager.java:237)
[artemis-core-client-2.4.0-SNAPSHOT.jar:2.4.0-SNAPSHOT]
	at org.apache.activemq.artemis.core.client.impl.ClientSessionFactoryImpl.createSessionChannel(ClientSessionFactoryImpl.java:1294)
[artemis-core-client-2.4.0-SNAPSHOT.jar:2.4.0-SNAPSHOT]
	at org.apache.activemq.artemis.core.client.impl.ClientSessionFactoryImpl.createSessionInternal(ClientSessionFactoryImpl.java:670)
[artemis-core-client-2.4.0-SNAPSHOT.jar:2.4.0-SNAPSHOT]
	at org.apache.activemq.artemis.core.client.impl.ClientSessionFactoryImpl.createSession(ClientSessionFactoryImpl.java:295)
[artemis-core-client-2.4.0-SNAPSHOT.jar:2.4.0-SNAPSHOT]
	at org.apache.activemq.artemis.ra.ActiveMQResourceAdapter.createSession(ActiveMQResourceAdapter.java:1581)
[artemis-ra-2.4.0-SNAPSHOT.jar:2.4.0-SNAPSHOT]
	at org.apache.activemq.artemis.ra.inflow.ActiveMQActivation.setupSession(ActiveMQActivation.java:480)
[artemis-ra-2.4.0-SNAPSHOT.jar:2.4.0-SNAPSHOT]
	at org.apache.activemq.artemis.ra.inflow.ActiveMQActivation.setup(ActiveMQActivation.java:312)
[artemis-ra-2.4.0-SNAPSHOT.jar:2.4.0-SNAPSHOT]
	at org.apache.activemq.artemis.ra.inflow.ActiveMQActivation.reconnect(ActiveMQActivation.java:657)
[artemis-ra-2.4.0-SNAPSHOT.jar:2.4.0-SNAPSHOT]
	at org.apache.activemq.artemis.ra.inflow.ActiveMQActivation$SetupActivation.run(ActiveMQActivation.java:697)
[artemis-ra-2.4.0-SNAPSHOT.jar:2.4.0-SNAPSHOT]
	at org.apache.activemq.artemis.tests.unit.ra.BootstrapContext$1.scheduleWork(BootstrapContext.java:64)
[:]
	at org.apache.activemq.artemis.ra.inflow.ActiveMQActivation.start(ActiveMQActivation.java:249)
[artemis-ra-2.4.0-SNAPSHOT.jar:2.4.0-SNAPSHOT]
	at org.apache.activemq.artemis.tests.unit.ra.ResourceAdapterTest.testForConnectionLeakDuringActivationWhenSessionCreationFails(ResourceAdapterTest.java:547)
[:]
	at sun.reflect.NativeMethodAccessorImpl.invoke0(Native Method) [rt.jar:1.8.0_144]
	at sun.reflect.NativeMethodAccessorImpl.invoke(NativeMethodAccessorImpl.java:62) [rt.jar:1.8.0_144]
	at sun.reflect.DelegatingMethodAccessorImpl.invoke(DelegatingMethodAccessorImpl.java:43)
[rt.jar:1.8.0_144]
	at java.lang.reflect.Method.invoke(Method.java:498) [rt.jar:1.8.0_144]
	at org.junit.runners.model.FrameworkMethod$1.runReflectiveCall(FrameworkMethod.java:47) [junit-4.11.jar:]
	at org.junit.internal.runners.model.ReflectiveCallable.run(ReflectiveCallable.java:12) [junit-4.11.jar:]
	at org.junit.runners.model.FrameworkMethod.invokeExplosively(FrameworkMethod.java:44) [junit-4.11.jar:]
	at org.junit.internal.runners.statements.InvokeMethod.evaluate(InvokeMethod.java:17) [junit-4.11.jar:]
	at org.junit.internal.runners.statements.RunBefores.evaluate(RunBefores.java:26) [junit-4.11.jar:]
	at org.junit.internal.runners.statements.RunAfters.evaluate(RunAfters.java:27) [junit-4.11.jar:]
	at org.junit.rules.ExternalResource$1.evaluate(ExternalResource.java:48) [junit-4.11.jar:]
	at org.junit.rules.TestWatcher$1.evaluate(TestWatcher.java:55) [junit-4.11.jar:]
	at org.junit.rules.ExternalResource$1.evaluate(ExternalResource.java:48) [junit-4.11.jar:]
	at org.junit.rules.ExternalResource$1.evaluate(ExternalResource.java:48) [junit-4.11.jar:]
	at org.junit.rules.TestWatcher$1.evaluate(TestWatcher.java:55) [junit-4.11.jar:]
	at org.junit.rules.RunRules.evaluate(RunRules.java:20) [junit-4.11.jar:]
	at org.junit.runners.ParentRunner.runLeaf(ParentRunner.java:271) [junit-4.11.jar:]
	at org.junit.runners.BlockJUnit4ClassRunner.runChild(BlockJUnit4ClassRunner.java:70) [junit-4.11.jar:]
	at org.junit.runners.BlockJUnit4ClassRunner.runChild(BlockJUnit4ClassRunner.java:50) [junit-4.11.jar:]
	at org.junit.runners.ParentRunner$3.run(ParentRunner.java:238) [junit-4.11.jar:]
	at org.junit.runners.ParentRunner$1.schedule(ParentRunner.java:63) [junit-4.11.jar:]
	at org.junit.runners.ParentRunner.runChildren(ParentRunner.java:236) [junit-4.11.jar:]
	at org.junit.runners.ParentRunner.access$000(ParentRunner.java:53) [junit-4.11.jar:]
	at org.junit.runners.ParentRunner$2.evaluate(ParentRunner.java:229) [junit-4.11.jar:]
	at org.junit.runners.ParentRunner.run(ParentRunner.java:309) [junit-4.11.jar:]
	at org.apache.maven.surefire.junit4.JUnit4Provider.execute(JUnit4Provider.java:283) [surefire-junit4-2.18.1.jar:2.18.1]
	at org.apache.maven.surefire.junit4.JUnit4Provider.executeWithRerun(JUnit4Provider.java:173)
[surefire-junit4-2.18.1.jar:2.18.1]
	at org.apache.maven.surefire.junit4.JUnit4Provider.executeTestSet(JUnit4Provider.java:153)
[surefire-junit4-2.18.1.jar:2.18.1]
	at org.apache.maven.surefire.junit4.JUnit4Provider.invoke(JUnit4Provider.java:128) [surefire-junit4-2.18.1.jar:2.18.1]
	at org.apache.maven.surefire.booter.ForkedBooter.invokeProviderInSameClassLoader(ForkedBooter.java:203)
[surefire-booter-2.18.1.jar:2.18.1]
	at org.apache.maven.surefire.booter.ForkedBooter.runSuitesInProcess(ForkedBooter.java:155)
[surefire-booter-2.18.1.jar:2.18.1]
	at org.apache.maven.surefire.booter.ForkedBooter.main(ForkedBooter.java:103) [surefire-booter-2.18.1.jar:2.18.1]

[main] 14:36:27,467 INFO  [org.apache.activemq.artemis.ra] AMQ151003: resource adaptor stopped
[main] 14:36:27,471 INFO  [org.apache.activemq.artemis.core.server] AMQ221002: Apache ActiveMQ
Artemis Message Broker version 2.4.0-SNAPSHOT [c2b941b8-9310-11e7-b936-02424ee64064] stopped,
uptime 2.094 seconds
[main] 14:36:27,478 INFO  [org.apache.activemq.artemis.core.server] #*#*# Finished test: testForConnectionLeakDuringActivationWhenSessionCreationFails()...
[main] 14:36:27,478 INFO  [org.apache.activemq.artemis.core.server] #*#*# Starting test: testCreateConnectionFactoryThrowsException()...
#test testCreateConnectionFactoryThrowsException
[main] 14:36:27,484 INFO  [org.apache.activemq.artemis.core.server] #*#*# Finished test: testCreateConnectionFactoryThrowsException()...
[main] 14:36:27,485 INFO  [org.apache.activemq.artemis.core.server] #*#*# Starting test: testCreateConnectionFactoryMultipleConnectorsOverrideAndParams()...
#test testCreateConnectionFactoryMultipleConnectorsOverrideAndParams
[main] 14:36:27,493 INFO  [org.apache.activemq.artemis.core.server] #*#*# Finished test: testCreateConnectionFactoryMultipleConnectorsOverrideAndParams()...
[main] 14:36:27,494 INFO  [org.apache.activemq.artemis.core.server] #*#*# Starting test: test2DefaultConnectionFactorySame()...
#test test2DefaultConnectionFactorySame
[main] 14:36:27,501 INFO  [org.apache.activemq.artemis.core.server] #*#*# Finished test: test2DefaultConnectionFactorySame()...
Tests run: 16, Failures: 0, Errors: 0, Skipped: 0, Time elapsed: 2.069 sec - in org.apache.activemq.artemis.tests.unit.ra.ResourceAdapterTest
Running org.apache.activemq.artemis.tests.unit.util.ActiveMQBufferInputStreamTest
[main] 14:36:27,503 INFO  [org.apache.activemq.artemis.core.server] #*#*# Starting test: testReadBytes()...
#test testReadBytes
[main] 14:36:27,516 INFO  [org.apache.activemq.artemis.core.server] #*#*# Finished test: testReadBytes()...
Tests run: 1, Failures: 0, Errors: 0, Skipped: 0, Time elapsed: 0.013 sec - in org.apache.activemq.artemis.tests.unit.util.ActiveMQBufferInputStreamTest
Running org.apache.activemq.artemis.tests.unit.util.LinkedListTest
[main] 14:36:27,518 INFO  [org.apache.activemq.artemis.core.server] #*#*# Starting test: testAddHead()...
#test testAddHead
[main] 14:36:27,525 INFO  [org.apache.activemq.artemis.core.server] #*#*# Finished test: testAddHead()...
[main] 14:36:27,525 INFO  [org.apache.activemq.artemis.core.server] #*#*# Starting test: testAddTail()...
#test testAddTail
[main] 14:36:27,531 INFO  [org.apache.activemq.artemis.core.server] #*#*# Finished test: testAddTail()...
[main] 14:36:27,531 INFO  [org.apache.activemq.artemis.core.server] #*#*# Starting test: testAddHeadAndTail()...
#test testAddHeadAndTail
[main] 14:36:27,536 INFO  [org.apache.activemq.artemis.core.server] #*#*# Finished test: testAddHeadAndTail()...
[main] 14:36:27,537 INFO  [org.apache.activemq.artemis.core.server] #*#*# Starting test: testCreateIteratorAfterAddElements()...
#test testCreateIteratorAfterAddElements
[main] 14:36:27,545 INFO  [org.apache.activemq.artemis.core.server] #*#*# Finished test: testCreateIteratorAfterAddElements()...
[main] 14:36:27,545 INFO  [org.apache.activemq.artemis.core.server] #*#*# Starting test: testClear()...
#test testClear
[main] 14:36:27,553 INFO  [org.apache.activemq.artemis.core.server] #*#*# Finished test: testClear()...
[main] 14:36:27,556 INFO  [org.apache.activemq.artemis.core.server] #*#*# Starting test: testPoll()...
#test testPoll
[main] 14:36:27,564 INFO  [org.apache.activemq.artemis.core.server] #*#*# Finished test: testPoll()...
[main] 14:36:27,565 INFO  [org.apache.activemq.artemis.core.server] #*#*# Starting test: testRemoveHead1()...
#test testRemoveHead1
[main] 14:36:27,571 INFO  [org.apache.activemq.artemis.core.server] #*#*# Finished test: testRemoveHead1()...
[main] 14:36:27,572 INFO  [org.apache.activemq.artemis.core.server] #*#*# Starting test: testRemoveHead2()...
#test testRemoveHead2
[main] 14:36:27,577 INFO  [org.apache.activemq.artemis.core.server] #*#*# Finished test: testRemoveHead2()...
[main] 14:36:27,578 INFO  [org.apache.activemq.artemis.core.server] #*#*# Starting test: testRemoveHead3()...
#test testRemoveHead3
[main] 14:36:27,584 INFO  [org.apache.activemq.artemis.core.server] #*#*# Finished test: testRemoveHead3()...
[main] 14:36:27,585 INFO  [org.apache.activemq.artemis.core.server] #*#*# Starting test: testRemoveTail1()...
#test testRemoveTail1
[main] 14:36:27,596 INFO  [org.apache.activemq.artemis.core.server] #*#*# Finished test: testRemoveTail1()...
[main] 14:36:27,598 INFO  [org.apache.activemq.artemis.core.server] #*#*# Starting test: testRemoveTail2()...
#test testRemoveTail2
[main] 14:36:27,603 INFO  [org.apache.activemq.artemis.core.server] #*#*# Finished test: testRemoveTail2()...
[main] 14:36:27,604 INFO  [org.apache.activemq.artemis.core.server] #*#*# Starting test: testRemoveTail3()...
#test testRemoveTail3
[main] 14:36:27,610 INFO  [org.apache.activemq.artemis.core.server] #*#*# Finished test: testRemoveTail3()...
[main] 14:36:27,610 INFO  [org.apache.activemq.artemis.core.server] #*#*# Starting test: testRemoveInTurn()...
#test testRemoveInTurn
[main] 14:36:27,621 INFO  [org.apache.activemq.artemis.core.server] #*#*# Finished test: testRemoveInTurn()...
[main] 14:36:27,621 INFO  [org.apache.activemq.artemis.core.server] #*#*# Starting test: testRemoveMiddle()...
#test testRemoveMiddle
[main] 14:36:27,628 INFO  [org.apache.activemq.artemis.core.server] #*#*# Finished test: testRemoveMiddle()...
[main] 14:36:27,628 INFO  [org.apache.activemq.artemis.core.server] #*#*# Starting test: testAddHeadAndRemove()...
#test testAddHeadAndRemove
Jumping 500
[main] 14:36:27,638 INFO  [org.apache.activemq.artemis.utils.ThreadLeakCheckRule] #test forceGC
[main] 14:36:28,330 INFO  [org.apache.activemq.artemis.utils.ThreadLeakCheckRule] #test forceGC
Done 
[main] 14:36:28,334 INFO  [org.apache.activemq.artemis.core.server] #*#*# Finished test: testAddHeadAndRemove()...
[main] 14:36:28,336 INFO  [org.apache.activemq.artemis.core.server] #*#*# Starting test: testMultipleIterators1()...
#test testMultipleIterators1
[main] 14:36:28,350 INFO  [org.apache.activemq.artemis.core.server] #*#*# Finished test: testMultipleIterators1()...
[main] 14:36:28,350 INFO  [org.apache.activemq.artemis.core.server] #*#*# Starting test: testMultipleIterators2()...
#test testMultipleIterators2
[main] 14:36:28,357 INFO  [org.apache.activemq.artemis.core.server] #*#*# Finished test: testMultipleIterators2()...
[main] 14:36:28,357 INFO  [org.apache.activemq.artemis.core.server] #*#*# Starting test: testResizing()...
#test testResizing
[main] 14:36:28,374 INFO  [org.apache.activemq.artemis.core.server] #*#*# Finished test: testResizing()...
[main] 14:36:28,375 INFO  [org.apache.activemq.artemis.core.server] #*#*# Starting test: testRepeatAndRemove()...
#test testRepeatAndRemove
[main] 14:36:28,380 INFO  [org.apache.activemq.artemis.core.server] #*#*# Finished test: testRepeatAndRemove()...
[main] 14:36:28,380 INFO  [org.apache.activemq.artemis.core.server] #*#*# Starting test: testIterateNoElements()...
#test testIterateNoElements
[main] 14:36:28,385 INFO  [org.apache.activemq.artemis.core.server] #*#*# Finished test: testIterateNoElements()...
[main] 14:36:28,386 INFO  [org.apache.activemq.artemis.core.server] #*#*# Starting test: testAddAndRemove()...
#test testAddAndRemove
[main] 14:36:28,420 INFO  [org.apache.activemq.artemis.utils.ThreadLeakCheckRule] #test forceGC
[main] 14:36:28,540 INFO  [org.apache.activemq.artemis.utils.ThreadLeakCheckRule] #test forceGC
Done 
[main] 14:36:28,970 INFO  [org.apache.activemq.artemis.utils.ThreadLeakCheckRule] #test forceGC
[main] 14:36:34,367 INFO  [org.apache.activemq.artemis.utils.ThreadLeakCheckRule] #test forceGC
Done 
SUREFIRE-859: Java HotSpot(TM) 64-Bit Server VM warning: INFO: os::commit_memory(0x00000006cfa00000,
184549376, 0) failed; error='Cannot allocate memory' (errno=12)
#
# There is insufficient memory for the Java Runtime Environment to continue.
# Native memory allocation (mmap) failed to map 184549376 bytes for committing reserved memory.
# An error report file with more information is saved as:
# <https://builds.apache.org/job/ActiveMQ-Artemis-Master/ws/tests/unit-tests/hs_err_pid623.log>
SUREFIRE-859: # [ timer expired, abort... ]
Aborted

Results :

Failed tests: 
  RandomUtilDistributionTest.testDistribution:66 The Random distribution is pretty bad. All
tries have returned duplicated randoms. value=17, minimum expected = 400

Tests run: 560, Failures: 1, Errors: 0, Skipped: 0

[INFO] ------------------------------------------------------------------------
[INFO] Reactor Summary:
[INFO] 
[INFO] ActiveMQ Artemis Parent ............................ SUCCESS [  8.888 s]
[INFO] ActiveMQ Artemis Commons ........................... SUCCESS [ 25.528 s]
[INFO] ActiveMQ Artemis Core Client ....................... SUCCESS [ 15.650 s]
[INFO] ActiveMQ Artemis Selector Implementation ........... SUCCESS [  5.421 s]
[INFO] ActiveMQ Artemis JMS Client ........................ SUCCESS [  4.351 s]
[INFO] ActiveMQ Artemis Native POM ........................ SUCCESS [  8.149 s]
[INFO] ActiveMQ Artemis Journal ........................... SUCCESS [  2.862 s]
[INFO] ActiveMQ Artemis JDBC Store ........................ SUCCESS [  8.673 s]
[INFO] ActiveMQ Artemis Server ............................ SUCCESS [01:05 min]
[INFO] ActiveMQ Artemis Protocols ......................... SUCCESS [  0.233 s]
[INFO] ActiveMQ Artemis AMQP Protocol ..................... SUCCESS [  7.127 s]
[INFO] ActiveMQ Artemis STOMP Protocol .................... SUCCESS [  2.221 s]
[INFO] ActiveMQ Artemis OpenWire Protocol ................. SUCCESS [  2.442 s]
[INFO] ActiveMQ Artemis HQClient Protocol ................. SUCCESS [  1.098 s]
[INFO] ActiveMQ Artemis HornetQ Protocol .................. SUCCESS [  1.260 s]
[INFO] ActiveMQ Artemis MQTT Protocol ..................... SUCCESS [  1.499 s]
[INFO] ActiveMQ Artemis DTO ............................... SUCCESS [  4.329 s]
[INFO] ActiveMQ Artemis Service Extensions ................ SUCCESS [  1.830 s]
[INFO] ActiveMQ Artemis JMS Server ........................ SUCCESS [  1.694 s]
[INFO] ActiveMQ Artemis CDI Integration ................... SUCCESS [  7.974 s]
[INFO] ActiveMQ Artemis Boot .............................. SUCCESS [  0.352 s]
[INFO] ActiveMQ Artemis Tools ............................. SUCCESS [  0.901 s]
[INFO] ActiveMQ Artemis CLI ............................... SUCCESS [ 32.980 s]
[INFO] ActiveMQ Artemis Web ............................... SUCCESS [  4.714 s]
[INFO] ActiveMQ Artemis Web ............................... SUCCESS [01:31 min]
[INFO] ActiveMQ Artemis Core Client All ................... SUCCESS [ 17.215 s]
[INFO] ActiveMQ Artemis JUnit Rules ....................... SUCCESS [ 18.043 s]
[INFO] ActiveMQ Artemis JMS Client All .................... SUCCESS [ 14.184 s]
[INFO] ActiveMQ Artemis RAR POM ........................... SUCCESS [  2.490 s]
[INFO] ActiveMQ Artemis REST Interface Implementation ..... SUCCESS [01:33 min]
[INFO] ActiveMQ Artemis Maven Plugin ...................... SUCCESS [  5.406 s]
[INFO] ActiveMQ Artemis Server OSGi ....................... SUCCESS [ 13.471 s]
[INFO] ActiveMQ Artemis Cons .............................. SUCCESS [  0.170 s]
[INFO] ActiveMQ Artemis HawtIO Branding ................... SUCCESS [  6.024 s]
[INFO] ActiveMQ Artemis HawtIO Plugin ..................... SUCCESS [  0.710 s]
[INFO] ActiveMQ Artemis Console ........................... SUCCESS [  5.834 s]
[INFO] ActiveMQ Artemis Spring Integration ................ SUCCESS [  0.728 s]
[INFO] Apache ActiveMQ Artemis Distribution ............... SUCCESS [ 36.405 s]
[INFO] ActiveMQ Artemis Tests POM ......................... SUCCESS [  0.835 s]
[INFO] ActiveMQ Artemis Unit Tests ........................ FAILURE [04:43 min]
[INFO] ActiveMQ Artemis Joram Tests ....................... SKIPPED
[INFO] ActiveMQ Artemis timing Tests ...................... SKIPPED
[INFO] ActiveMQ Artemis JMS Tests ......................... SKIPPED
[INFO] ActiveMQ Artemis Features .......................... SKIPPED
[INFO] ActiveMQ Artemis Test Support ...................... SKIPPED
[INFO] ActiveMQ Artemis Integration Tests ................. SKIPPED
[INFO] ActiveMQ Artemis soak Tests ........................ SKIPPED
[INFO] ActiveMQ Artemis stress Tests ...................... SKIPPED
[INFO] ActiveMQ Artemis performance Tests ................. SKIPPED
[INFO] Smoke Tests ........................................ SKIPPED
[INFO] ActiveMQ Artemis Extra Tests ....................... SKIPPED
[INFO] ------------------------------------------------------------------------
[INFO] BUILD FAILURE
[INFO] ------------------------------------------------------------------------
[INFO] Total time: 13:30 min
[INFO] Finished at: 2017-09-06T14:39:28+00:00
[INFO] Final Memory: 258M/1585M
[INFO] ------------------------------------------------------------------------
[ERROR] Failed to execute goal org.apache.maven.plugins:maven-surefire-plugin:2.18.1:test
(default-test) on project unit-tests: Execution default-test of goal org.apache.maven.plugins:maven-surefire-plugin:2.18.1:test
failed: The forked VM terminated without properly saying goodbye. VM crash or System.exit
called?
[ERROR] Command was /bin/sh -c cd <https://builds.apache.org/job/ActiveMQ-Artemis-Master/ws/tests/unit-tests>
&& /usr/local/asfpackages/java/jdk1.8.0_144/jre/bin/java -Djava.util.logging.manager=org.jboss.logmanager.LogManager
-Dlogging.configuration=<https://builds.apache.org/job/ActiveMQ-Artemis-Master/ws/tests/unit-tests/../../tests/config/logging.properties>
-Djava.library.path=<https://builds.apache.org/job/ActiveMQ-Artemis-Master/ws/tests/unit-tests/../../artemis-native/bin>
-Djgroups.bind_addr=localhost -Dorg.apache.activemq.artemis.api.core.UDPBroadcastEndpointFactory.localBindAddress=localhost
-Djava.net.preferIPv4Stack=true -Dbasedir=<https://builds.apache.org/job/ActiveMQ-Artemis-Master/ws/tests/unit-tests>
-jar <https://builds.apache.org/job/ActiveMQ-Artemis-Master/ws/tests/unit-tests/target/surefire/surefirebooter4286525932130932338.jar>
<https://builds.apache.org/job/ActiveMQ-Artemis-Master/ws/tests/unit-tests/target/surefire/surefire6746794618985868683tmp>
<https://builds.apache.org/job/ActiveMQ-Artemis-Master/ws/tests/unit-tests/target/surefire/surefire_166825124405416025669tmp>
[ERROR] -> [Help 1]
[ERROR] 
[ERROR] To see the full stack trace of the errors, re-run Maven with the -e switch.
[ERROR] Re-run Maven using the -X switch to enable full debug logging.
[ERROR] 
[ERROR] For more information about the errors and possible solutions, please read the following
articles:
[ERROR] [Help 1] http://cwiki.apache.org/confluence/display/MAVEN/PluginExecutionException
[ERROR] 
[ERROR] After correcting the problems, you can resume the build with the command
[ERROR]   mvn <goals> -rf :unit-tests
Build step 'Invoke top-level Maven targets' marked build as failure
Performing Post build task...
Could not match :Too many files with unapproved license  : False
Logical operation result is FALSE
Skipping script  : cat ratReport.txt
END OF POST BUILD TASK 	: 0
Recording test results
Not sending mail to unregistered user mtaylor@redhat.com

Mime
View raw message