activemq-commits mailing list archives

Site index · List index
Message view « Date » · « Thread »
Top « Date » · « Thread »
From Apache Jenkins Server <jenk...@builds.apache.org>
Subject Build failed in Jenkins: ActiveMQ-Java8-All-UnitTests #711
Date Wed, 12 Jul 2017 08:45:01 GMT
See <https://builds.apache.org/job/ActiveMQ-Java8-All-UnitTests/711/display/redirect?page=changes>

Changes:

[tabish121] AMQ-6765 Add trace logging of start failure exception

------------------------------------------
[...truncated 362.32 KB...]
Tests run: 1, Failures: 0, Errors: 0, Skipped: 0, Time elapsed: 0.308 sec - in org.apache.activemq.openwire.v7.JournalTopicAckTest
Running org.apache.activemq.openwire.v7.JournalTraceTest
Tests run: 1, Failures: 0, Errors: 0, Skipped: 0, Time elapsed: 0.26 sec - in org.apache.activemq.openwire.v7.JournalTraceTest
Running org.apache.activemq.openwire.v7.JournalTransactionTest
Tests run: 1, Failures: 0, Errors: 0, Skipped: 0, Time elapsed: 0.264 sec - in org.apache.activemq.openwire.v7.JournalTransactionTest
Running org.apache.activemq.openwire.v7.KeepAliveInfoTest
Tests run: 1, Failures: 0, Errors: 0, Skipped: 0, Time elapsed: 0.271 sec - in org.apache.activemq.openwire.v7.KeepAliveInfoTest
Running org.apache.activemq.openwire.v7.LastPartialCommandTest
Tests run: 1, Failures: 0, Errors: 0, Skipped: 0, Time elapsed: 0.289 sec - in org.apache.activemq.openwire.v7.LastPartialCommandTest
Running org.apache.activemq.openwire.v7.LocalTransactionIdTest
Tests run: 1, Failures: 0, Errors: 0, Skipped: 0, Time elapsed: 0.216 sec - in org.apache.activemq.openwire.v7.LocalTransactionIdTest
Running org.apache.activemq.openwire.v7.MessageAckTest
Tests run: 1, Failures: 0, Errors: 0, Skipped: 0, Time elapsed: 0.316 sec - in org.apache.activemq.openwire.v7.MessageAckTest
Running org.apache.activemq.openwire.v7.MessageDispatchNotificationTest
Tests run: 1, Failures: 0, Errors: 0, Skipped: 0, Time elapsed: 0.331 sec - in org.apache.activemq.openwire.v7.MessageDispatchNotificationTest
Running org.apache.activemq.openwire.v7.MessageDispatchTest
Tests run: 1, Failures: 0, Errors: 0, Skipped: 0, Time elapsed: 0.229 sec - in org.apache.activemq.openwire.v7.MessageDispatchTest
Running org.apache.activemq.openwire.v7.MessageIdTest
Tests run: 1, Failures: 0, Errors: 0, Skipped: 0, Time elapsed: 0.216 sec - in org.apache.activemq.openwire.v7.MessageIdTest
Running org.apache.activemq.openwire.v7.MessagePullTest
Tests run: 1, Failures: 0, Errors: 0, Skipped: 0, Time elapsed: 0.224 sec - in org.apache.activemq.openwire.v7.MessagePullTest
Running org.apache.activemq.openwire.v7.NetworkBridgeFilterTest
Tests run: 1, Failures: 0, Errors: 0, Skipped: 0, Time elapsed: 0.3 sec - in org.apache.activemq.openwire.v7.NetworkBridgeFilterTest
Running org.apache.activemq.openwire.v7.PartialCommandTest
Tests run: 1, Failures: 0, Errors: 0, Skipped: 0, Time elapsed: 0.311 sec - in org.apache.activemq.openwire.v7.PartialCommandTest
Running org.apache.activemq.openwire.v7.ProducerAckTest
Tests run: 1, Failures: 0, Errors: 0, Skipped: 0, Time elapsed: 0.252 sec - in org.apache.activemq.openwire.v7.ProducerAckTest
Running org.apache.activemq.openwire.v7.ProducerIdTest
Tests run: 1, Failures: 0, Errors: 0, Skipped: 0, Time elapsed: 0.252 sec - in org.apache.activemq.openwire.v7.ProducerIdTest
Running org.apache.activemq.openwire.v7.ProducerInfoTest
Tests run: 1, Failures: 0, Errors: 0, Skipped: 0, Time elapsed: 0.269 sec - in org.apache.activemq.openwire.v7.ProducerInfoTest
Running org.apache.activemq.openwire.v7.RemoveInfoTest
Tests run: 1, Failures: 0, Errors: 0, Skipped: 0, Time elapsed: 0.213 sec - in org.apache.activemq.openwire.v7.RemoveInfoTest
Running org.apache.activemq.openwire.v7.RemoveSubscriptionInfoTest
Tests run: 1, Failures: 0, Errors: 0, Skipped: 0, Time elapsed: 0.276 sec - in org.apache.activemq.openwire.v7.RemoveSubscriptionInfoTest
Running org.apache.activemq.openwire.v7.ReplayCommandTest
Tests run: 1, Failures: 0, Errors: 0, Skipped: 0, Time elapsed: 0.246 sec - in org.apache.activemq.openwire.v7.ReplayCommandTest
Running org.apache.activemq.openwire.v7.ResponseTest
Tests run: 1, Failures: 0, Errors: 0, Skipped: 0, Time elapsed: 0.243 sec - in org.apache.activemq.openwire.v7.ResponseTest
Running org.apache.activemq.openwire.v7.SessionIdTest
Tests run: 1, Failures: 0, Errors: 0, Skipped: 0, Time elapsed: 0.284 sec - in org.apache.activemq.openwire.v7.SessionIdTest
Running org.apache.activemq.openwire.v7.SessionInfoTest
Tests run: 1, Failures: 0, Errors: 0, Skipped: 0, Time elapsed: 0.253 sec - in org.apache.activemq.openwire.v7.SessionInfoTest
Running org.apache.activemq.openwire.v7.ShutdownInfoTest
Tests run: 1, Failures: 0, Errors: 0, Skipped: 0, Time elapsed: 0.23 sec - in org.apache.activemq.openwire.v7.ShutdownInfoTest
Running org.apache.activemq.openwire.v7.SubscriptionInfoTest
Tests run: 1, Failures: 0, Errors: 0, Skipped: 0, Time elapsed: 0.236 sec - in org.apache.activemq.openwire.v7.SubscriptionInfoTest
Running org.apache.activemq.openwire.v7.TransactionInfoTest
Tests run: 1, Failures: 0, Errors: 0, Skipped: 0, Time elapsed: 0.259 sec - in org.apache.activemq.openwire.v7.TransactionInfoTest
Running org.apache.activemq.openwire.v7.XATransactionIdTest
Tests run: 1, Failures: 0, Errors: 0, Skipped: 0, Time elapsed: 0.222 sec - in org.apache.activemq.openwire.v7.XATransactionIdTest
Running org.apache.activemq.openwire.v8.BrokerIdTest
Tests run: 1, Failures: 0, Errors: 0, Skipped: 0, Time elapsed: 0.232 sec - in org.apache.activemq.openwire.v8.BrokerIdTest
Running org.apache.activemq.openwire.v8.BrokerInfoTest
Tests run: 1, Failures: 0, Errors: 0, Skipped: 0, Time elapsed: 0.259 sec - in org.apache.activemq.openwire.v8.BrokerInfoTest
Running org.apache.activemq.openwire.v8.ConnectionControlTest
Tests run: 1, Failures: 0, Errors: 0, Skipped: 0, Time elapsed: 0.292 sec - in org.apache.activemq.openwire.v8.ConnectionControlTest
Running org.apache.activemq.openwire.v8.ConnectionErrorTest
Tests run: 1, Failures: 0, Errors: 0, Skipped: 0, Time elapsed: 0.243 sec - in org.apache.activemq.openwire.v8.ConnectionErrorTest
Running org.apache.activemq.openwire.v8.ConnectionIdTest
Tests run: 1, Failures: 0, Errors: 0, Skipped: 0, Time elapsed: 0.251 sec - in org.apache.activemq.openwire.v8.ConnectionIdTest
Running org.apache.activemq.openwire.v8.ConnectionInfoTest
Tests run: 1, Failures: 0, Errors: 0, Skipped: 0, Time elapsed: 0.241 sec - in org.apache.activemq.openwire.v8.ConnectionInfoTest
Running org.apache.activemq.openwire.v8.ConsumerControlTest
Tests run: 1, Failures: 0, Errors: 0, Skipped: 0, Time elapsed: 0.316 sec - in org.apache.activemq.openwire.v8.ConsumerControlTest
Running org.apache.activemq.openwire.v8.ConsumerIdTest
Tests run: 1, Failures: 0, Errors: 0, Skipped: 0, Time elapsed: 0.248 sec - in org.apache.activemq.openwire.v8.ConsumerIdTest
Running org.apache.activemq.openwire.v8.ConsumerInfoTest
Tests run: 1, Failures: 0, Errors: 0, Skipped: 0, Time elapsed: 0.282 sec - in org.apache.activemq.openwire.v8.ConsumerInfoTest
Running org.apache.activemq.openwire.v8.ControlCommandTest
Tests run: 1, Failures: 0, Errors: 0, Skipped: 0, Time elapsed: 0.237 sec - in org.apache.activemq.openwire.v8.ControlCommandTest
Running org.apache.activemq.openwire.v8.DataArrayResponseTest
Tests run: 1, Failures: 0, Errors: 0, Skipped: 0, Time elapsed: 0.243 sec - in org.apache.activemq.openwire.v8.DataArrayResponseTest
Running org.apache.activemq.openwire.v8.DataResponseTest
Tests run: 1, Failures: 0, Errors: 0, Skipped: 0, Time elapsed: 0.241 sec - in org.apache.activemq.openwire.v8.DataResponseTest
Running org.apache.activemq.openwire.v8.DestinationInfoTest
Tests run: 1, Failures: 0, Errors: 0, Skipped: 0, Time elapsed: 0.238 sec - in org.apache.activemq.openwire.v8.DestinationInfoTest
Running org.apache.activemq.openwire.v8.DiscoveryEventTest
Tests run: 1, Failures: 0, Errors: 0, Skipped: 0, Time elapsed: 0.243 sec - in org.apache.activemq.openwire.v8.DiscoveryEventTest
Running org.apache.activemq.openwire.v8.ExceptionResponseTest
Tests run: 1, Failures: 0, Errors: 0, Skipped: 0, Time elapsed: 0.227 sec - in org.apache.activemq.openwire.v8.ExceptionResponseTest
Running org.apache.activemq.openwire.v8.FlushCommandTest
Tests run: 1, Failures: 0, Errors: 0, Skipped: 0, Time elapsed: 0.238 sec - in org.apache.activemq.openwire.v8.FlushCommandTest
Running org.apache.activemq.openwire.v8.IntegerResponseTest
Tests run: 1, Failures: 0, Errors: 0, Skipped: 0, Time elapsed: 0.273 sec - in org.apache.activemq.openwire.v8.IntegerResponseTest
Running org.apache.activemq.openwire.v8.JournalQueueAckTest
Tests run: 1, Failures: 0, Errors: 0, Skipped: 0, Time elapsed: 0.282 sec - in org.apache.activemq.openwire.v8.JournalQueueAckTest
Running org.apache.activemq.openwire.v8.JournalTopicAckTest
Tests run: 1, Failures: 0, Errors: 0, Skipped: 0, Time elapsed: 0.319 sec - in org.apache.activemq.openwire.v8.JournalTopicAckTest
Running org.apache.activemq.openwire.v8.JournalTraceTest
Tests run: 1, Failures: 0, Errors: 0, Skipped: 0, Time elapsed: 0.244 sec - in org.apache.activemq.openwire.v8.JournalTraceTest
Running org.apache.activemq.openwire.v8.JournalTransactionTest
Tests run: 1, Failures: 0, Errors: 0, Skipped: 0, Time elapsed: 0.298 sec - in org.apache.activemq.openwire.v8.JournalTransactionTest
Running org.apache.activemq.openwire.v8.KeepAliveInfoTest
Tests run: 1, Failures: 0, Errors: 0, Skipped: 0, Time elapsed: 0.262 sec - in org.apache.activemq.openwire.v8.KeepAliveInfoTest
Running org.apache.activemq.openwire.v8.LastPartialCommandTest
Tests run: 1, Failures: 0, Errors: 0, Skipped: 0, Time elapsed: 0.239 sec - in org.apache.activemq.openwire.v8.LastPartialCommandTest
Running org.apache.activemq.openwire.v8.LocalTransactionIdTest
Tests run: 1, Failures: 0, Errors: 0, Skipped: 0, Time elapsed: 0.209 sec - in org.apache.activemq.openwire.v8.LocalTransactionIdTest
Running org.apache.activemq.openwire.v8.MessageAckTest
Tests run: 1, Failures: 0, Errors: 0, Skipped: 0, Time elapsed: 0.276 sec - in org.apache.activemq.openwire.v8.MessageAckTest
Running org.apache.activemq.openwire.v8.MessageDispatchNotificationTest
Tests run: 1, Failures: 0, Errors: 0, Skipped: 0, Time elapsed: 0.348 sec - in org.apache.activemq.openwire.v8.MessageDispatchNotificationTest
Running org.apache.activemq.openwire.v8.MessageDispatchTest
Tests run: 1, Failures: 0, Errors: 0, Skipped: 0, Time elapsed: 0.307 sec - in org.apache.activemq.openwire.v8.MessageDispatchTest
Running org.apache.activemq.openwire.v8.MessageIdTest
Tests run: 1, Failures: 0, Errors: 0, Skipped: 0, Time elapsed: 0.281 sec - in org.apache.activemq.openwire.v8.MessageIdTest
Running org.apache.activemq.openwire.v8.MessagePullTest
Tests run: 1, Failures: 0, Errors: 0, Skipped: 0, Time elapsed: 0.278 sec - in org.apache.activemq.openwire.v8.MessagePullTest
Running org.apache.activemq.openwire.v8.NetworkBridgeFilterTest
Tests run: 1, Failures: 0, Errors: 0, Skipped: 0, Time elapsed: 0.35 sec - in org.apache.activemq.openwire.v8.NetworkBridgeFilterTest
Running org.apache.activemq.openwire.v8.PartialCommandTest
Tests run: 1, Failures: 0, Errors: 0, Skipped: 0, Time elapsed: 0.288 sec - in org.apache.activemq.openwire.v8.PartialCommandTest
Running org.apache.activemq.openwire.v8.ProducerAckTest
Tests run: 1, Failures: 0, Errors: 0, Skipped: 0, Time elapsed: 0.321 sec - in org.apache.activemq.openwire.v8.ProducerAckTest
Running org.apache.activemq.openwire.v8.ProducerIdTest
Tests run: 1, Failures: 0, Errors: 0, Skipped: 0, Time elapsed: 0.315 sec - in org.apache.activemq.openwire.v8.ProducerIdTest
Running org.apache.activemq.openwire.v8.ProducerInfoTest
Tests run: 1, Failures: 0, Errors: 0, Skipped: 0, Time elapsed: 0.296 sec - in org.apache.activemq.openwire.v8.ProducerInfoTest
Running org.apache.activemq.openwire.v8.RemoveInfoTest
Tests run: 1, Failures: 0, Errors: 0, Skipped: 0, Time elapsed: 0.247 sec - in org.apache.activemq.openwire.v8.RemoveInfoTest
Running org.apache.activemq.openwire.v8.RemoveSubscriptionInfoTest
Tests run: 1, Failures: 0, Errors: 0, Skipped: 0, Time elapsed: 0.314 sec - in org.apache.activemq.openwire.v8.RemoveSubscriptionInfoTest
Running org.apache.activemq.openwire.v8.ReplayCommandTest
Tests run: 1, Failures: 0, Errors: 0, Skipped: 0, Time elapsed: 0.292 sec - in org.apache.activemq.openwire.v8.ReplayCommandTest
Running org.apache.activemq.openwire.v8.ResponseTest
Tests run: 1, Failures: 0, Errors: 0, Skipped: 0, Time elapsed: 0.289 sec - in org.apache.activemq.openwire.v8.ResponseTest
Running org.apache.activemq.openwire.v8.SessionIdTest
Tests run: 1, Failures: 0, Errors: 0, Skipped: 0, Time elapsed: 0.315 sec - in org.apache.activemq.openwire.v8.SessionIdTest
Running org.apache.activemq.openwire.v8.SessionInfoTest
Tests run: 1, Failures: 0, Errors: 0, Skipped: 0, Time elapsed: 0.278 sec - in org.apache.activemq.openwire.v8.SessionInfoTest
Running org.apache.activemq.openwire.v8.ShutdownInfoTest
Tests run: 1, Failures: 0, Errors: 0, Skipped: 0, Time elapsed: 0.221 sec - in org.apache.activemq.openwire.v8.ShutdownInfoTest
Running org.apache.activemq.openwire.v8.SubscriptionInfoTest
Tests run: 1, Failures: 0, Errors: 0, Skipped: 0, Time elapsed: 0.312 sec - in org.apache.activemq.openwire.v8.SubscriptionInfoTest
Running org.apache.activemq.openwire.v8.TransactionInfoTest
Tests run: 1, Failures: 0, Errors: 0, Skipped: 0, Time elapsed: 0.297 sec - in org.apache.activemq.openwire.v8.TransactionInfoTest
Running org.apache.activemq.openwire.v8.XATransactionIdTest
Tests run: 1, Failures: 0, Errors: 0, Skipped: 0, Time elapsed: 0.321 sec - in org.apache.activemq.openwire.v8.XATransactionIdTest
Running org.apache.activemq.openwire.v9.BrokerIdTest
Tests run: 1, Failures: 0, Errors: 0, Skipped: 0, Time elapsed: 0.224 sec - in org.apache.activemq.openwire.v9.BrokerIdTest
Running org.apache.activemq.openwire.v9.BrokerInfoTest
Tests run: 1, Failures: 0, Errors: 0, Skipped: 0, Time elapsed: 0.315 sec - in org.apache.activemq.openwire.v9.BrokerInfoTest
Running org.apache.activemq.openwire.v9.ConnectionControlTest
Tests run: 1, Failures: 0, Errors: 0, Skipped: 0, Time elapsed: 0.256 sec - in org.apache.activemq.openwire.v9.ConnectionControlTest
Running org.apache.activemq.openwire.v9.ConnectionErrorTest
Tests run: 1, Failures: 0, Errors: 0, Skipped: 0, Time elapsed: 0.321 sec - in org.apache.activemq.openwire.v9.ConnectionErrorTest
Running org.apache.activemq.openwire.v9.ConnectionIdTest
Tests run: 1, Failures: 0, Errors: 0, Skipped: 0, Time elapsed: 0.29 sec - in org.apache.activemq.openwire.v9.ConnectionIdTest
Running org.apache.activemq.openwire.v9.ConnectionInfoTest
Tests run: 1, Failures: 0, Errors: 0, Skipped: 0, Time elapsed: 0.296 sec - in org.apache.activemq.openwire.v9.ConnectionInfoTest
Running org.apache.activemq.openwire.v9.ConsumerControlTest
Tests run: 1, Failures: 0, Errors: 0, Skipped: 0, Time elapsed: 0.265 sec - in org.apache.activemq.openwire.v9.ConsumerControlTest
Running org.apache.activemq.openwire.v9.ConsumerIdTest
Tests run: 1, Failures: 0, Errors: 0, Skipped: 0, Time elapsed: 0.227 sec - in org.apache.activemq.openwire.v9.ConsumerIdTest
Running org.apache.activemq.openwire.v9.ConsumerInfoTest
Tests run: 1, Failures: 0, Errors: 0, Skipped: 0, Time elapsed: 0.365 sec - in org.apache.activemq.openwire.v9.ConsumerInfoTest
Running org.apache.activemq.openwire.v9.ControlCommandTest
Tests run: 1, Failures: 0, Errors: 0, Skipped: 0, Time elapsed: 0.281 sec - in org.apache.activemq.openwire.v9.ControlCommandTest
Running org.apache.activemq.openwire.v9.DataArrayResponseTest
Tests run: 1, Failures: 0, Errors: 0, Skipped: 0, Time elapsed: 0.323 sec - in org.apache.activemq.openwire.v9.DataArrayResponseTest
Running org.apache.activemq.openwire.v9.DataResponseTest
Tests run: 1, Failures: 0, Errors: 0, Skipped: 0, Time elapsed: 0.251 sec - in org.apache.activemq.openwire.v9.DataResponseTest
Running org.apache.activemq.openwire.v9.DestinationInfoTest
Tests run: 1, Failures: 0, Errors: 0, Skipped: 0, Time elapsed: 0.286 sec - in org.apache.activemq.openwire.v9.DestinationInfoTest
Running org.apache.activemq.openwire.v9.DiscoveryEventTest
Tests run: 1, Failures: 0, Errors: 0, Skipped: 0, Time elapsed: 0.268 sec - in org.apache.activemq.openwire.v9.DiscoveryEventTest
Running org.apache.activemq.openwire.v9.ExceptionResponseTest
Tests run: 1, Failures: 0, Errors: 0, Skipped: 0, Time elapsed: 0.227 sec - in org.apache.activemq.openwire.v9.ExceptionResponseTest
Running org.apache.activemq.openwire.v9.FlushCommandTest
Tests run: 1, Failures: 0, Errors: 0, Skipped: 0, Time elapsed: 0.327 sec - in org.apache.activemq.openwire.v9.FlushCommandTest
Running org.apache.activemq.openwire.v9.IntegerResponseTest
Tests run: 1, Failures: 0, Errors: 0, Skipped: 0, Time elapsed: 0.307 sec - in org.apache.activemq.openwire.v9.IntegerResponseTest
Running org.apache.activemq.openwire.v9.JournalQueueAckTest
Tests run: 1, Failures: 0, Errors: 0, Skipped: 0, Time elapsed: 0.366 sec - in org.apache.activemq.openwire.v9.JournalQueueAckTest
Running org.apache.activemq.openwire.v9.JournalTopicAckTest
Tests run: 1, Failures: 0, Errors: 0, Skipped: 0, Time elapsed: 0.253 sec - in org.apache.activemq.openwire.v9.JournalTopicAckTest
Running org.apache.activemq.openwire.v9.JournalTraceTest
Tests run: 1, Failures: 0, Errors: 0, Skipped: 0, Time elapsed: 0.291 sec - in org.apache.activemq.openwire.v9.JournalTraceTest
Running org.apache.activemq.openwire.v9.JournalTransactionTest
Tests run: 1, Failures: 0, Errors: 0, Skipped: 0, Time elapsed: 0.35 sec - in org.apache.activemq.openwire.v9.JournalTransactionTest
Running org.apache.activemq.openwire.v9.KeepAliveInfoTest
Tests run: 1, Failures: 0, Errors: 0, Skipped: 0, Time elapsed: 0.235 sec - in org.apache.activemq.openwire.v9.KeepAliveInfoTest
Running org.apache.activemq.openwire.v9.LastPartialCommandTest
Tests run: 1, Failures: 0, Errors: 0, Skipped: 0, Time elapsed: 0.277 sec - in org.apache.activemq.openwire.v9.LastPartialCommandTest
Running org.apache.activemq.openwire.v9.LocalTransactionIdTest
Tests run: 1, Failures: 0, Errors: 0, Skipped: 0, Time elapsed: 0.298 sec - in org.apache.activemq.openwire.v9.LocalTransactionIdTest
Running org.apache.activemq.openwire.v9.MessageAckTest
Tests run: 1, Failures: 0, Errors: 0, Skipped: 0, Time elapsed: 0.382 sec - in org.apache.activemq.openwire.v9.MessageAckTest
Running org.apache.activemq.openwire.v9.MessageDispatchNotificationTest
Tests run: 1, Failures: 0, Errors: 0, Skipped: 0, Time elapsed: 0.316 sec - in org.apache.activemq.openwire.v9.MessageDispatchNotificationTest
Running org.apache.activemq.openwire.v9.MessageDispatchTest
Tests run: 1, Failures: 0, Errors: 0, Skipped: 0, Time elapsed: 0.325 sec - in org.apache.activemq.openwire.v9.MessageDispatchTest
Running org.apache.activemq.openwire.v9.MessageIdTest
Tests run: 1, Failures: 0, Errors: 0, Skipped: 0, Time elapsed: 0.252 sec - in org.apache.activemq.openwire.v9.MessageIdTest
Running org.apache.activemq.openwire.v9.MessagePullTest
Tests run: 1, Failures: 0, Errors: 0, Skipped: 0, Time elapsed: 0.313 sec - in org.apache.activemq.openwire.v9.MessagePullTest
Running org.apache.activemq.openwire.v9.NetworkBridgeFilterTest
Tests run: 1, Failures: 0, Errors: 0, Skipped: 0, Time elapsed: 0.341 sec - in org.apache.activemq.openwire.v9.NetworkBridgeFilterTest
Running org.apache.activemq.openwire.v9.PartialCommandTest
Tests run: 1, Failures: 0, Errors: 0, Skipped: 0, Time elapsed: 0.236 sec - in org.apache.activemq.openwire.v9.PartialCommandTest
Running org.apache.activemq.openwire.v9.ProducerAckTest
Tests run: 1, Failures: 0, Errors: 0, Skipped: 0, Time elapsed: 0.268 sec - in org.apache.activemq.openwire.v9.ProducerAckTest
Running org.apache.activemq.openwire.v9.ProducerIdTest
Tests run: 1, Failures: 0, Errors: 0, Skipped: 0, Time elapsed: 0.223 sec - in org.apache.activemq.openwire.v9.ProducerIdTest
Running org.apache.activemq.openwire.v9.ProducerInfoTest
Tests run: 1, Failures: 0, Errors: 0, Skipped: 0, Time elapsed: 0.279 sec - in org.apache.activemq.openwire.v9.ProducerInfoTest
Running org.apache.activemq.openwire.v9.RemoveInfoTest
Tests run: 1, Failures: 0, Errors: 0, Skipped: 0, Time elapsed: 0.255 sec - in org.apache.activemq.openwire.v9.RemoveInfoTest
Running org.apache.activemq.openwire.v9.RemoveSubscriptionInfoTest
Tests run: 1, Failures: 0, Errors: 0, Skipped: 0, Time elapsed: 0.275 sec - in org.apache.activemq.openwire.v9.RemoveSubscriptionInfoTest
Running org.apache.activemq.openwire.v9.ReplayCommandTest
Tests run: 1, Failures: 0, Errors: 0, Skipped: 0, Time elapsed: 0.302 sec - in org.apache.activemq.openwire.v9.ReplayCommandTest
Running org.apache.activemq.openwire.v9.ResponseTest
Tests run: 1, Failures: 0, Errors: 0, Skipped: 0, Time elapsed: 0.276 sec - in org.apache.activemq.openwire.v9.ResponseTest
Running org.apache.activemq.openwire.v9.SessionIdTest
Tests run: 1, Failures: 0, Errors: 0, Skipped: 0, Time elapsed: 0.307 sec - in org.apache.activemq.openwire.v9.SessionIdTest
[locks-and-latches] Releasing all the locks
[locks-and-latches] All the locks released
ERROR: Failed to parse POMs
java.io.IOException: Backing channel 'H24' is disconnected.
	at hudson.remoting.RemoteInvocationHandler.channelOrFail(RemoteInvocationHandler.java:192)
	at hudson.remoting.RemoteInvocationHandler.invoke(RemoteInvocationHandler.java:257)
	at com.sun.proxy.$Proxy197.isAlive(Unknown Source)
	at hudson.Launcher$RemoteLauncher$ProcImpl.isAlive(Launcher.java:1043)
	at hudson.maven.ProcessCache$MavenProcess.call(ProcessCache.java:166)
	at hudson.maven.MavenModuleSetBuild$MavenModuleSetBuildExecution.doRun(MavenModuleSetBuild.java:878)
	at hudson.model.AbstractBuild$AbstractBuildExecution.run(AbstractBuild.java:534)
	at hudson.model.Run.execute(Run.java:1728)
	at hudson.maven.MavenModuleSetBuild.run(MavenModuleSetBuild.java:542)
	at hudson.model.ResourceController.execute(ResourceController.java:98)
	at hudson.model.Executor.run(Executor.java:405)
Caused by: hudson.remoting.Channel$OrderlyShutdown: hudson.remoting.ProxyException: java.util.concurrent.TimeoutException:
Ping started at 1499848746290 hasn't completed by 1499848986291
	at hudson.remoting.Channel$CloseCommand.execute(Channel.java:1129)
	at hudson.remoting.Channel$1.handle(Channel.java:527)
	at hudson.remoting.SynchronousCommandTransport$ReaderThread.run(SynchronousCommandTransport.java:83)
Caused by: Command close created at
	at hudson.remoting.Command.<init>(Command.java:60)
	at hudson.remoting.Channel$CloseCommand.<init>(Channel.java:1123)
	at hudson.remoting.Channel$CloseCommand.<init>(Channel.java:1121)
	at hudson.remoting.Channel.close(Channel.java:1281)
	at hudson.slaves.ChannelPinger$1.onDead(ChannelPinger.java:180)
	at hudson.remoting.PingThread.ping(PingThread.java:130)
	at hudson.remoting.PingThread.run(PingThread.java:86)
Caused by: hudson.remoting.ProxyException: java.util.concurrent.TimeoutException: Ping started
at 1499848746290 hasn't completed by 1499848986291
	... 2 more
ERROR: H24 is offline; cannot locate JDK 1.8 (latest)
ERROR: H24 is offline; cannot locate Maven 3.3.9


Mime
View raw message