activemq-commits mailing list archives

Site index · List index
Message view « Date » · « Thread »
Top « Date » · « Thread »
From Apache Jenkins Server <jenk...@builds.apache.org>
Subject Build failed in Jenkins: ActiveMQ-Artemis-Master #1216
Date Wed, 26 Jul 2017 00:14:28 GMT
See <https://builds.apache.org/job/ActiveMQ-Artemis-Master/1216/display/redirect>

------------------------------------------
[...truncated 1.27 MB...]
[INFO] 
[INFO] --- maven-enforcer-plugin:1.4:enforce (enforce-java) @ artemis-junit ---
[INFO] 
[INFO] <<< maven-source-plugin:2.2.1:jar (default) < generate-sources @ artemis-junit
<<<
[INFO] 
[INFO] --- maven-source-plugin:2.2.1:jar (default) @ artemis-junit ---
[INFO] 
[INFO] --- dependency-check-maven:1.4.3:check (default) @ artemis-junit ---
[INFO] Skipping dependency-check
[INFO] 
[INFO] --- maven-install-plugin:2.4:install (default-install) @ artemis-junit ---
[INFO] Installing <https://builds.apache.org/job/ActiveMQ-Artemis-Master/ws/artemis-junit/target/artemis-junit-2.3.0-SNAPSHOT.jar>
to /home/jenkins/.m2/repository/org/apache/activemq/artemis-junit/2.3.0-SNAPSHOT/artemis-junit-2.3.0-SNAPSHOT.jar
[INFO] Installing <https://builds.apache.org/job/ActiveMQ-Artemis-Master/ws/artemis-junit/pom.xml>
to /home/jenkins/.m2/repository/org/apache/activemq/artemis-junit/2.3.0-SNAPSHOT/artemis-junit-2.3.0-SNAPSHOT.pom
[INFO] Installing <https://builds.apache.org/job/ActiveMQ-Artemis-Master/ws/artemis-junit/target/artemis-junit-2.3.0-SNAPSHOT-sources.jar>
to /home/jenkins/.m2/repository/org/apache/activemq/artemis-junit/2.3.0-SNAPSHOT/artemis-junit-2.3.0-SNAPSHOT-sources.jar
[INFO] Installing <https://builds.apache.org/job/ActiveMQ-Artemis-Master/ws/artemis-junit/target/artemis-junit-2.3.0-SNAPSHOT-sources.jar>
to /home/jenkins/.m2/repository/org/apache/activemq/artemis-junit/2.3.0-SNAPSHOT/artemis-junit-2.3.0-SNAPSHOT-sources.jar
[INFO]                                                                         
[INFO] ------------------------------------------------------------------------
[INFO] Building ActiveMQ Artemis JMS Client All 2.3.0-SNAPSHOT
[INFO] ------------------------------------------------------------------------
[INFO] 
[INFO] --- maven-enforcer-plugin:1.4:enforce (enforce-maven) @ artemis-jms-client-all ---
[INFO] 
[INFO] --- maven-enforcer-plugin:1.4:enforce (enforce-java) @ artemis-jms-client-all ---
[INFO] 
[INFO] --- maven-remote-resources-plugin:1.5:process (process-resource-bundles) @ artemis-jms-client-all
---
[INFO] 
[INFO] --- maven-resources-plugin:2.6:resources (default-resources) @ artemis-jms-client-all
---
[INFO] Using 'UTF-8' encoding to copy filtered resources.
[INFO] skip non existing resourceDirectory <https://builds.apache.org/job/ActiveMQ-Artemis-Master/ws/artemis-jms-client-all/src/main/resources>
[INFO] Copying 3 resources
[INFO] 
[INFO] --- maven-compiler-plugin:3.1:compile (default-compile) @ artemis-jms-client-all ---
[INFO] No sources to compile
[INFO] 
[INFO] --- maven-checkstyle-plugin:2.17:check (default) @ artemis-jms-client-all ---
[INFO] Starting audit...
Audit done.
[INFO] 
[INFO] --- apache-rat-plugin:0.12:check (default) @ artemis-jms-client-all ---
[INFO] Enabled default license matchers.
[INFO] Will parse SCM ignores for exclusions...
[INFO] Finished adding exclusions from SCM ignore files.
[INFO] 61 implicit excludes (use -debug for more details).
[INFO] Exclude: **/*.txt
[INFO] Exclude: **/*.md
[INFO] Exclude: etc/ide-settings/**
[INFO] Exclude: docs/**/*.json
[INFO] Exclude: docs/**/_book/
[INFO] Exclude: **/target/
[INFO] Exclude: **/META-INF/services/*
[INFO] Exclude: **/META-INF/MANIFEST.MF
[INFO] Exclude: **/*.iml
[INFO] Exclude: **/*.jceks
[INFO] Exclude: **/*.jks
[INFO] Exclude: **/org/apache/activemq/artemis/utils/json/**
[INFO] Exclude: **/org/apache/activemq/artemis/utils/Base64.java
[INFO] Exclude: **/.settings/**
[INFO] Exclude: **/.project
[INFO] Exclude: **/.classpath
[INFO] Exclude: **/.editorconfig
[INFO] Exclude: **/.checkstyle
[INFO] Exclude: **/.factorypath
[INFO] Exclude: **/org.apache.activemq.artemis.cfg
[INFO] Exclude: **/nb-configuration.xml
[INFO] Exclude: **/*.data
[INFO] Exclude: **/*.bin
[INFO] Exclude: **/src/test/resources/keystore
[INFO] Exclude: **/*.log
[INFO] Exclude: **/*.redo
[INFO] Exclude: **/node/**
[INFO] Exclude: **/node_modules/**
[INFO] Exclude: **/package.json
[INFO] Exclude: **/npm-shrinkwrap.json
[INFO] Exclude: **/CMakeFiles/
[INFO] Exclude: **/Makefile
[INFO] Exclude: **/cmake_install.cmake
[INFO] Exclude: artemis-native/src/main/c/org_apache_activemq_artemis_jlibaio_LibaioContext.h
[INFO] Exclude: **/dependency-reduced-pom.xml
[INFO] 1 resources included (use -debug for more details)
[INFO] Rat check: Summary over all files. Unapproved: 0, unknown: 0, generated: 0, approved:
1 licenses.
[INFO] 
[INFO] --- maven-resources-plugin:2.6:testResources (default-testResources) @ artemis-jms-client-all
---
[INFO] Using 'UTF-8' encoding to copy filtered resources.
[INFO] skip non existing resourceDirectory <https://builds.apache.org/job/ActiveMQ-Artemis-Master/ws/artemis-jms-client-all/src/test/resources>
[INFO] Copying 3 resources
[INFO] 
[INFO] --- maven-compiler-plugin:3.1:testCompile (default-testCompile) @ artemis-jms-client-all
---
[INFO] No sources to compile
[INFO] 
[INFO] --- maven-surefire-plugin:2.18.1:test (default-test) @ artemis-jms-client-all ---
[INFO] 
[INFO] --- maven-jar-plugin:2.4:jar (default-jar) @ artemis-jms-client-all ---
[INFO] Building jar: <https://builds.apache.org/job/ActiveMQ-Artemis-Master/ws/artemis-jms-client-all/target/artemis-jms-client-all-2.3.0-SNAPSHOT.jar>
[INFO] 
[INFO] --- maven-site-plugin:3.3:attach-descriptor (attach-descriptor) @ artemis-jms-client-all
---
[INFO] 
[INFO] >>> maven-source-plugin:2.2.1:jar (attach-sources) > generate-sources @
artemis-jms-client-all >>>
[INFO] 
[INFO] --- maven-enforcer-plugin:1.4:enforce (enforce-maven) @ artemis-jms-client-all ---
[INFO] 
[INFO] --- maven-enforcer-plugin:1.4:enforce (enforce-java) @ artemis-jms-client-all ---
[INFO] 
[INFO] <<< maven-source-plugin:2.2.1:jar (attach-sources) < generate-sources @
artemis-jms-client-all <<<
[INFO] 
[INFO] --- maven-source-plugin:2.2.1:jar (attach-sources) @ artemis-jms-client-all ---
[INFO] Building jar: <https://builds.apache.org/job/ActiveMQ-Artemis-Master/ws/artemis-jms-client-all/target/artemis-jms-client-all-2.3.0-SNAPSHOT-sources.jar>
[INFO] 
[INFO] --- maven-shade-plugin:3.0.0:shade (default) @ artemis-jms-client-all ---
[INFO] Including org.apache.activemq:artemis-jms-client:jar:2.3.0-SNAPSHOT in the shaded jar.
[INFO] Including org.apache.activemq:artemis-core-client:jar:2.3.0-SNAPSHOT in the shaded
jar.
[INFO] Including org.jgroups:jgroups:jar:3.6.13.Final in the shaded jar.
[INFO] Including org.apache.activemq:artemis-commons:jar:2.3.0-SNAPSHOT in the shaded jar.
[INFO] Including org.jboss.logging:jboss-logging:jar:3.3.0.Final in the shaded jar.
[INFO] Including commons-beanutils:commons-beanutils:jar:1.9.2 in the shaded jar.
[INFO] Including commons-logging:commons-logging:jar:1.2 in the shaded jar.
[INFO] Including commons-collections:commons-collections:jar:3.2.2 in the shaded jar.
[INFO] Including com.google.guava:guava:jar:19.0 in the shaded jar.
[INFO] Including io.netty:netty-all:jar:4.1.9.Final in the shaded jar.
[INFO] Including org.apache.geronimo.specs:geronimo-json_1.0_spec:jar:1.0-alpha-1 in the shaded
jar.
[INFO] Including org.apache.johnzon:johnzon-core:jar:0.9.5 in the shaded jar.
[INFO] Including org.apache.activemq:artemis-selector:jar:2.3.0-SNAPSHOT in the shaded jar.
[INFO] Including org.apache.geronimo.specs:geronimo-jms_2.0_spec:jar:1.0-alpha-2 in the shaded
jar.
[INFO] Replacing original artifact with shaded artifact.
[INFO] Replacing <https://builds.apache.org/job/ActiveMQ-Artemis-Master/ws/artemis-jms-client-all/target/artemis-jms-client-all-2.3.0-SNAPSHOT.jar>
with <https://builds.apache.org/job/ActiveMQ-Artemis-Master/ws/artemis-jms-client-all/target/artemis-jms-client-all-2.3.0-SNAPSHOT-shaded.jar>
[INFO] Replacing original source artifact with shaded source artifact.
[INFO] Replacing <https://builds.apache.org/job/ActiveMQ-Artemis-Master/ws/artemis-jms-client-all/target/artemis-jms-client-all-2.3.0-SNAPSHOT-sources.jar>
with <https://builds.apache.org/job/ActiveMQ-Artemis-Master/ws/artemis-jms-client-all/target/artemis-jms-client-all-2.3.0-SNAPSHOT-shaded-sources.jar>
[INFO] Dependency-reduced POM written at: <https://builds.apache.org/job/ActiveMQ-Artemis-Master/ws/artemis-jms-client-all/dependency-reduced-pom.xml>
[INFO] 
[INFO] >>> maven-source-plugin:2.2.1:jar (default) > generate-sources @ artemis-jms-client-all
>>>
[INFO] 
[INFO] --- maven-enforcer-plugin:1.4:enforce (enforce-maven) @ artemis-jms-client-all ---
[INFO] 
[INFO] --- maven-enforcer-plugin:1.4:enforce (enforce-java) @ artemis-jms-client-all ---
[INFO] 
[INFO] <<< maven-source-plugin:2.2.1:jar (default) < generate-sources @ artemis-jms-client-all
<<<
[INFO] 
[INFO] --- maven-source-plugin:2.2.1:jar (default) @ artemis-jms-client-all ---
[INFO] 
[INFO] --- dependency-check-maven:1.4.3:check (default) @ artemis-jms-client-all ---
[INFO] Skipping dependency-check
[INFO] 
[INFO] --- maven-install-plugin:2.4:install (default-install) @ artemis-jms-client-all ---
[INFO] Installing <https://builds.apache.org/job/ActiveMQ-Artemis-Master/ws/artemis-jms-client-all/target/artemis-jms-client-all-2.3.0-SNAPSHOT.jar>
to /home/jenkins/.m2/repository/org/apache/activemq/artemis-jms-client-all/2.3.0-SNAPSHOT/artemis-jms-client-all-2.3.0-SNAPSHOT.jar
[INFO] Installing <https://builds.apache.org/job/ActiveMQ-Artemis-Master/ws/artemis-jms-client-all/dependency-reduced-pom.xml>
to /home/jenkins/.m2/repository/org/apache/activemq/artemis-jms-client-all/2.3.0-SNAPSHOT/artemis-jms-client-all-2.3.0-SNAPSHOT.pom
[INFO] Installing <https://builds.apache.org/job/ActiveMQ-Artemis-Master/ws/artemis-jms-client-all/target/artemis-jms-client-all-2.3.0-SNAPSHOT-sources.jar>
to /home/jenkins/.m2/repository/org/apache/activemq/artemis-jms-client-all/2.3.0-SNAPSHOT/artemis-jms-client-all-2.3.0-SNAPSHOT-sources.jar
[INFO] Installing <https://builds.apache.org/job/ActiveMQ-Artemis-Master/ws/artemis-jms-client-all/target/artemis-jms-client-all-2.3.0-SNAPSHOT-sources.jar>
to /home/jenkins/.m2/repository/org/apache/activemq/artemis-jms-client-all/2.3.0-SNAPSHOT/artemis-jms-client-all-2.3.0-SNAPSHOT-sources.jar
[INFO] Installing <https://builds.apache.org/job/ActiveMQ-Artemis-Master/ws/artemis-jms-client-all/target/artemis-jms-client-all-2.3.0-SNAPSHOT-sources.jar>
to /home/jenkins/.m2/repository/org/apache/activemq/artemis-jms-client-all/2.3.0-SNAPSHOT/artemis-jms-client-all-2.3.0-SNAPSHOT-sources.jar
[INFO]                                                                         
[INFO] ------------------------------------------------------------------------
[INFO] Building ActiveMQ Artemis RAR POM 2.3.0-SNAPSHOT
[INFO] ------------------------------------------------------------------------
[INFO] 
[INFO] --- maven-enforcer-plugin:1.4:enforce (enforce-maven) @ artemis-ra ---
[INFO] 
[INFO] --- maven-enforcer-plugin:1.4:enforce (enforce-java) @ artemis-ra ---
[INFO] 
[INFO] --- maven-remote-resources-plugin:1.5:process (process-resource-bundles) @ artemis-ra
---
[INFO] 
[INFO] --- maven-resources-plugin:2.6:resources (default-resources) @ artemis-ra ---
[INFO] Using 'UTF-8' encoding to copy filtered resources.
[INFO] skip non existing resourceDirectory <https://builds.apache.org/job/ActiveMQ-Artemis-Master/ws/artemis-ra/src/main/resources>
[INFO] Copying 3 resources
[INFO] 
[INFO] --- maven-compiler-plugin:3.1:compile (default-compile) @ artemis-ra ---
[INFO] Changes detected - recompiling the module!
[INFO] Compiling 41 source files to <https://builds.apache.org/job/ActiveMQ-Artemis-Master/ws/artemis-ra/target/classes>
Note: <https://builds.apache.org/job/ActiveMQ-Artemis-Master/ws/artemis-ra/src/main/java/org/apache/activemq/artemis/ra/inflow/ActiveMQMessageHandler.java>
uses or overrides a deprecated API.
Note: Recompile with -Xlint:deprecation for details.
[INFO] 
[INFO] --- maven-checkstyle-plugin:2.17:check (default) @ artemis-ra ---
[INFO] Starting audit...
[ERROR] <https://builds.apache.org/job/ActiveMQ-Artemis-Master/ws/artemis-ra/src/main/java/org/apache/activemq/artemis/ra/inflow/ActiveMQActivation.java>:67:
Line has trailing spaces. [RegexpSingleline]
Audit done.
[INFO] There is 1 error reported by Checkstyle 7.7 with <https://builds.apache.org/job/ActiveMQ-Artemis-Master/ws/artemis-ra/../etc/checkstyle.xml>
ruleset.
[ERROR] src/main/java/org/apache/activemq/artemis/ra/inflow/ActiveMQActivation.java:[67] (regexp)
RegexpSingleline: Line has trailing spaces.
[INFO] ------------------------------------------------------------------------
[INFO] Reactor Summary:
[INFO] 
[INFO] ActiveMQ Artemis Parent ............................ SUCCESS [  6.562 s]
[INFO] ActiveMQ Artemis Commons ........................... SUCCESS [ 46.300 s]
[INFO] ActiveMQ Artemis Core Client ....................... SUCCESS [ 20.997 s]
[INFO] ActiveMQ Artemis Selector Implementation ........... SUCCESS [  5.511 s]
[INFO] ActiveMQ Artemis JMS Client ........................ SUCCESS [  8.109 s]
[INFO] ActiveMQ Artemis Native POM ........................ SUCCESS [  8.017 s]
[INFO] ActiveMQ Artemis Journal ........................... SUCCESS [  6.413 s]
[INFO] ActiveMQ Artemis JDBC Store ........................ SUCCESS [  7.869 s]
[INFO] ActiveMQ Artemis Server ............................ SUCCESS [01:17 min]
[INFO] ActiveMQ Artemis Protocols ......................... SUCCESS [  0.219 s]
[INFO] ActiveMQ Artemis AMQP Protocol ..................... SUCCESS [  7.644 s]
[INFO] ActiveMQ Artemis STOMP Protocol .................... SUCCESS [  3.450 s]
[INFO] ActiveMQ Artemis OpenWire Protocol ................. SUCCESS [  3.780 s]
[INFO] ActiveMQ Artemis HQClient Protocol ................. SUCCESS [  1.271 s]
[INFO] ActiveMQ Artemis HornetQ Protocol .................. SUCCESS [  1.269 s]
[INFO] ActiveMQ Artemis MQTT Protocol ..................... SUCCESS [  2.270 s]
[INFO] ActiveMQ Artemis DTO ............................... SUCCESS [  3.096 s]
[INFO] ActiveMQ Artemis Service Extensions ................ SUCCESS [  2.675 s]
[INFO] ActiveMQ Artemis JMS Server ........................ SUCCESS [  3.241 s]
[INFO] ActiveMQ Artemis CDI Integration ................... SUCCESS [  7.853 s]
[INFO] ActiveMQ Artemis Boot .............................. SUCCESS [  0.428 s]
[INFO] ActiveMQ Artemis Tools ............................. SUCCESS [  1.342 s]
[INFO] ActiveMQ Artemis CLI ............................... SUCCESS [ 28.177 s]
[INFO] ActiveMQ Artemis Web ............................... SUCCESS [  7.325 s]
[INFO] ActiveMQ Artemis Web ............................... SUCCESS [01:59 min]
[INFO] ActiveMQ Artemis Core Client All ................... SUCCESS [ 26.237 s]
[INFO] ActiveMQ Artemis JUnit Rules ....................... SUCCESS [ 11.140 s]
[INFO] ActiveMQ Artemis JMS Client All .................... SUCCESS [ 25.019 s]
[INFO] ActiveMQ Artemis RAR POM ........................... FAILURE [  4.891 s]
[INFO] ActiveMQ Artemis REST Interface Implementation ..... SKIPPED
[INFO] ActiveMQ Artemis Maven Plugin ...................... SKIPPED
[INFO] ActiveMQ Artemis Server OSGi ....................... SKIPPED
[INFO] ActiveMQ Artemis Spring Integration ................ SKIPPED
[INFO] Apache ActiveMQ Artemis Distribution ............... SKIPPED
[INFO] ActiveMQ Artemis Tests POM ......................... SKIPPED
[INFO] ActiveMQ Artemis Unit Tests ........................ SKIPPED
[INFO] ActiveMQ Artemis Joram Tests ....................... SKIPPED
[INFO] ActiveMQ Artemis timing Tests ...................... SKIPPED
[INFO] ActiveMQ Artemis JMS Tests ......................... SKIPPED
[INFO] ActiveMQ Artemis Features .......................... SKIPPED
[INFO] ActiveMQ Artemis Test Support ...................... SKIPPED
[INFO] ActiveMQ Artemis Integration Tests ................. SKIPPED
[INFO] ActiveMQ Artemis soak Tests ........................ SKIPPED
[INFO] ActiveMQ Artemis stress Tests ...................... SKIPPED
[INFO] ActiveMQ Artemis performance Tests ................. SKIPPED
[INFO] Smoke Tests ........................................ SKIPPED
[INFO] ActiveMQ Artemis Extra Tests ....................... SKIPPED
[INFO] ------------------------------------------------------------------------
[INFO] BUILD FAILURE
[INFO] ------------------------------------------------------------------------
[INFO] Total time: 07:31 min
[INFO] Finished at: 2017-07-26T00:14:21+00:00
[INFO] Final Memory: 215M/3110M
[INFO] ------------------------------------------------------------------------
[ERROR] Failed to execute goal org.apache.maven.plugins:maven-checkstyle-plugin:2.17:check
(default) on project artemis-ra: You have 1 Checkstyle violation. -> [Help 1]
[ERROR] 
[ERROR] To see the full stack trace of the errors, re-run Maven with the -e switch.
[ERROR] Re-run Maven using the -X switch to enable full debug logging.
[ERROR] 
[ERROR] For more information about the errors and possible solutions, please read the following
articles:
[ERROR] [Help 1] http://cwiki.apache.org/confluence/display/MAVEN/MojoFailureException
[ERROR] 
[ERROR] After correcting the problems, you can resume the build with the command
[ERROR]   mvn <goals> -rf :artemis-ra
Build step 'Invoke top-level Maven targets' marked build as failure
Performing Post build task...
Could not match :Too many files with unapproved license  : False
Logical operation result is FALSE
Skipping script  : cat ratReport.txt
END OF POST BUILD TASK 	: 0
Recording test results

Mime
View raw message