activemq-commits mailing list archives

Site index · List index
Message view « Date » · « Thread »
Top « Date » · « Thread »
From Apache Jenkins Server <jenk...@builds.apache.org>
Subject Build failed in Jenkins: ActiveMQ-Java8 #1011
Date Tue, 30 May 2017 10:18:46 GMT
See <https://builds.apache.org/job/ActiveMQ-Java8/1011/display/redirect>

------------------------------------------
[...truncated 84.39 KB...]
Running org.apache.activemq.transport.stomp.StompAdvisoryTest
Tests run: 11, Failures: 0, Errors: 0, Skipped: 0, Time elapsed: 3.739 sec - in org.apache.activemq.transport.stomp.StompAdvisoryTest
Running org.apache.activemq.transport.stomp.StompCompositeDestinationTest
Tests run: 6, Failures: 0, Errors: 0, Skipped: 0, Time elapsed: 1.761 sec - in org.apache.activemq.transport.stomp.StompCompositeDestinationTest
Running org.apache.activemq.transport.stomp.StompConnectTimeoutTest
Tests run: 4, Failures: 0, Errors: 0, Skipped: 0, Time elapsed: 6.569 sec - in org.apache.activemq.transport.stomp.StompConnectTimeoutTest
Running org.apache.activemq.transport.stomp.StompFrameTest
Tests run: 1, Failures: 0, Errors: 0, Skipped: 0, Time elapsed: 0.059 sec - in org.apache.activemq.transport.stomp.StompFrameTest
Running org.apache.activemq.transport.stomp.StompInactivityMonitorTest
Tests run: 4, Failures: 0, Errors: 0, Skipped: 0, Time elapsed: 14.66 sec - in org.apache.activemq.transport.stomp.StompInactivityMonitorTest
Running org.apache.activemq.transport.stomp.StompLoadTest
Tests run: 1, Failures: 0, Errors: 0, Skipped: 0, Time elapsed: 11.527 sec - in org.apache.activemq.transport.stomp.StompLoadTest
Running org.apache.activemq.transport.stomp.StompMaxDataSizeTest
Tests run: 4, Failures: 0, Errors: 0, Skipped: 0, Time elapsed: 1.744 sec - in org.apache.activemq.transport.stomp.StompMaxDataSizeTest
Running org.apache.activemq.transport.stomp.StompMaxFrameSizeTest
Tests run: 60, Failures: 0, Errors: 0, Skipped: 40, Time elapsed: 3.82 sec - in org.apache.activemq.transport.stomp.StompMaxFrameSizeTest
Running org.apache.activemq.transport.stomp.StompMissingMessageTest
Tests run: 2, Failures: 0, Errors: 0, Skipped: 0, Time elapsed: 45.881 sec - in org.apache.activemq.transport.stomp.StompMissingMessageTest
Running org.apache.activemq.transport.stomp.StompNIOLoadTest
Tests run: 1, Failures: 0, Errors: 0, Skipped: 0, Time elapsed: 11.563 sec - in org.apache.activemq.transport.stomp.StompNIOLoadTest
Running org.apache.activemq.transport.stomp.StompNIOSSLLargeMessageTest
Tests run: 1, Failures: 0, Errors: 0, Skipped: 0, Time elapsed: 6.765 sec - in org.apache.activemq.transport.stomp.StompNIOSSLLargeMessageTest
Running org.apache.activemq.transport.stomp.StompNIOSSLTest
Tests run: 74, Failures: 0, Errors: 0, Skipped: 0, Time elapsed: 30.203 sec - in org.apache.activemq.transport.stomp.StompNIOSSLTest
Running org.apache.activemq.transport.stomp.StompNIOTest
Tests run: 74, Failures: 0, Errors: 0, Skipped: 0, Time elapsed: 22.184 sec - in org.apache.activemq.transport.stomp.StompNIOTest
Running org.apache.activemq.transport.stomp.StompPrefetchTest
Tests run: 4, Failures: 0, Errors: 0, Skipped: 0, Time elapsed: 1.316 sec - in org.apache.activemq.transport.stomp.StompPrefetchTest
Running org.apache.activemq.transport.stomp.StompSSLLoadTest
Tests run: 1, Failures: 0, Errors: 0, Skipped: 0, Time elapsed: 13.034 sec - in org.apache.activemq.transport.stomp.StompSSLLoadTest
Running org.apache.activemq.transport.stomp.StompSslAuthTest
Tests run: 74, Failures: 0, Errors: 0, Skipped: 0, Time elapsed: 48.726 sec - in org.apache.activemq.transport.stomp.StompSslAuthTest
Running org.apache.activemq.transport.stomp.StompSslTest
Tests run: 74, Failures: 0, Errors: 0, Skipped: 0, Time elapsed: 31.702 sec - in org.apache.activemq.transport.stomp.StompSslTest
Running org.apache.activemq.transport.stomp.StompSubscriptionRemoveTest
Tests run: 1, Failures: 0, Errors: 0, Skipped: 0, Time elapsed: 3.423 sec - in org.apache.activemq.transport.stomp.StompSubscriptionRemoveTest
Running org.apache.activemq.transport.stomp.StompTelnetTest
Tests run: 2, Failures: 0, Errors: 0, Skipped: 0, Time elapsed: 0.913 sec - in org.apache.activemq.transport.stomp.StompTelnetTest
Running org.apache.activemq.transport.stomp.StompTest
Tests run: 74, Failures: 0, Errors: 0, Skipped: 0, Time elapsed: 21.296 sec - in org.apache.activemq.transport.stomp.StompTest
Running org.apache.activemq.transport.stomp.StompTimeStampingBrokerPluginTest
Tests run: 1, Failures: 0, Errors: 0, Skipped: 0, Time elapsed: 13.534 sec - in org.apache.activemq.transport.stomp.StompTimeStampingBrokerPluginTest
Running org.apache.activemq.transport.stomp.StompVirtualTopicTest
Tests run: 1, Failures: 0, Errors: 0, Skipped: 0, Time elapsed: 18.237 sec - in org.apache.activemq.transport.stomp.StompVirtualTopicTest
Running org.apache.activemq.transport.stomp.auto.AutoStompConnectTimeoutTest
Tests run: 4, Failures: 0, Errors: 0, Skipped: 0, Time elapsed: 8.071 sec - in org.apache.activemq.transport.stomp.auto.AutoStompConnectTimeoutTest
Running org.apache.activemq.transport.stomp.auto.StompAutoNioSslTest
Tests run: 74, Failures: 0, Errors: 0, Skipped: 0, Time elapsed: 31.974 sec - in org.apache.activemq.transport.stomp.auto.StompAutoNioSslTest
Running org.apache.activemq.transport.stomp.auto.StompAutoNioTest
Tests run: 74, Failures: 0, Errors: 0, Skipped: 0, Time elapsed: 21.886 sec - in org.apache.activemq.transport.stomp.auto.StompAutoNioTest
Running org.apache.activemq.transport.stomp.auto.StompAutoSslAuthTest
Tests run: 2, Failures: 0, Errors: 0, Skipped: 0, Time elapsed: 1.55 sec - in org.apache.activemq.transport.stomp.auto.StompAutoSslAuthTest
Running org.apache.activemq.transport.stomp.auto.StompAutoSslTest
Tests run: 74, Failures: 0, Errors: 0, Skipped: 0, Time elapsed: 32.483 sec - in org.apache.activemq.transport.stomp.auto.StompAutoSslTest
Running org.apache.activemq.transport.stomp.auto.StompAutoTest
Tests run: 74, Failures: 0, Errors: 0, Skipped: 0, Time elapsed: 22.551 sec - in org.apache.activemq.transport.stomp.auto.StompAutoTest

Results :

Tests run: 934, Failures: 0, Errors: 0, Skipped: 40

[JENKINS] Recording test results
[INFO] 
[INFO] --- maven-jar-plugin:2.4:jar (default-jar) @ activemq-stomp ---
[INFO] Building jar: <https://builds.apache.org/job/ActiveMQ-Java8/ws/activemq-stomp/target/activemq-stomp-5.15.0-SNAPSHOT.jar>
[INFO] 
[INFO] --- maven-site-plugin:3.4:attach-descriptor (attach-descriptor) @ activemq-stomp ---
[INFO] 
[INFO] --- ianal-maven-plugin:1.0-alpha-1:verify-legal-files (default) @ activemq-stomp ---
[INFO] Checking legal files in: activemq-stomp-5.15.0-SNAPSHOT.jar
[INFO] 
[INFO] --- maven-install-plugin:2.5.2:install (default-install) @ activemq-stomp ---
[INFO] Installing <https://builds.apache.org/job/ActiveMQ-Java8/ws/activemq-stomp/target/activemq-stomp-5.15.0-SNAPSHOT.jar>
to /home/jenkins/jenkins-slave/maven-repositories/1/org/apache/activemq/activemq-stomp/5.15.0-SNAPSHOT/activemq-stomp-5.15.0-SNAPSHOT.jar
[INFO] Installing <https://builds.apache.org/job/ActiveMQ-Java8/ws/activemq-stomp/pom.xml>
to /home/jenkins/jenkins-slave/maven-repositories/1/org/apache/activemq/activemq-stomp/5.15.0-SNAPSHOT/activemq-stomp-5.15.0-SNAPSHOT.pom
[INFO] 
[INFO] >>> maven-source-plugin:2.4:jar (default-cli) > generate-sources @ activemq-stomp
>>>
[INFO] 
[INFO] --- maven-bundle-plugin:2.3.7:cleanVersions (cleanVersions) @ activemq-stomp ---
[WARNING] Failed to getClass for org.apache.maven.plugin.source.SourceJarMojo
[INFO] 
[INFO] <<< maven-source-plugin:2.4:jar (default-cli) < generate-sources @ activemq-stomp
<<<
[INFO] 
[INFO] --- maven-source-plugin:2.4:jar (default-cli) @ activemq-stomp ---
[INFO] Building jar: <https://builds.apache.org/job/ActiveMQ-Java8/ws/activemq-stomp/target/activemq-stomp-5.15.0-SNAPSHOT-sources.jar>
[INFO]                                                                         
[INFO] ------------------------------------------------------------------------
[INFO] Building ActiveMQ :: MQTT Protocol 5.15.0-SNAPSHOT
[INFO] ------------------------------------------------------------------------
[INFO] 
[INFO] --- maven-clean-plugin:2.5:clean (default-clean) @ activemq-mqtt ---
[INFO] 
[INFO] --- maven-bundle-plugin:2.3.7:cleanVersions (cleanVersions) @ activemq-mqtt ---
[INFO] 
[INFO] --- activemq-protobuf:1.1:compile (default) @ activemq-mqtt ---
[WARNING] No proto files found in directory: <https://builds.apache.org/job/ActiveMQ-Java8/ws/activemq-mqtt/src/main/proto>
[INFO] 
[INFO] --- maven-remote-resources-plugin:1.5:process (default) @ activemq-mqtt ---
[INFO] 
[INFO] --- maven-resources-plugin:2.7:resources (default-resources) @ activemq-mqtt ---
[INFO] Using 'UTF-8' encoding to copy filtered resources.
[INFO] Copying 7 resources
[INFO] skip non existing resourceDirectory <https://builds.apache.org/job/ActiveMQ-Java8/ws/activemq-mqtt/src/main/filtered-resources>
[INFO] Copying 3 resources
[INFO] 
[INFO] --- maven-compiler-plugin:3.3:compile (default-compile) @ activemq-mqtt ---
[INFO] Changes detected - recompiling the module!
[INFO] Compiling 22 source files to <https://builds.apache.org/job/ActiveMQ-Java8/ws/activemq-mqtt/target/classes>
[INFO] 
[INFO] --- maven-resources-plugin:2.7:testResources (default-testResources) @ activemq-mqtt
---
[INFO] Using 'UTF-8' encoding to copy filtered resources.
[INFO] Copying 3 resources
[INFO] Copying 3 resources
[INFO] 
[INFO] --- maven-compiler-plugin:3.3:testCompile (default-testCompile) @ activemq-mqtt ---
[INFO] Changes detected - recompiling the module!
[INFO] Compiling 29 source files to <https://builds.apache.org/job/ActiveMQ-Java8/ws/activemq-mqtt/target/test-classes>
[INFO] 
[INFO] --- maven-surefire-plugin:2.16:test (default-test) @ activemq-mqtt ---
[INFO] Surefire report directory: <https://builds.apache.org/job/ActiveMQ-Java8/ws/activemq-mqtt/target/surefire-reports>

-------------------------------------------------------
 T E S T S
-------------------------------------------------------

-------------------------------------------------------
 T E S T S
-------------------------------------------------------
Running org.apache.activemq.transport.mqtt.MQTTAuthTest
Tests run: 28, Failures: 0, Errors: 0, Skipped: 0, Time elapsed: 12.417 sec - in org.apache.activemq.transport.mqtt.MQTTAuthTest
Running org.apache.activemq.transport.mqtt.MQTTCodecTest
Tests run: 7, Failures: 0, Errors: 0, Skipped: 0, Time elapsed: 1.105 sec - in org.apache.activemq.transport.mqtt.MQTTCodecTest
Running org.apache.activemq.transport.mqtt.MQTTCompositeQueueRetainedTest
Tests run: 1, Failures: 0, Errors: 0, Skipped: 0, Time elapsed: 7.019 sec - in org.apache.activemq.transport.mqtt.MQTTCompositeQueueRetainedTest
Running org.apache.activemq.transport.mqtt.MQTTConnectTest
Tests run: 8, Failures: 0, Errors: 0, Skipped: 0, Time elapsed: 7.802 sec - in org.apache.activemq.transport.mqtt.MQTTConnectTest
Running org.apache.activemq.transport.mqtt.MQTTMaxFrameSizeTest
Tests run: 8, Failures: 0, Errors: 0, Skipped: 0, Time elapsed: 1.594 sec - in org.apache.activemq.transport.mqtt.MQTTMaxFrameSizeTest
Running org.apache.activemq.transport.mqtt.MQTTNIOSSLTest
Tests run: 55, Failures: 1, Errors: 0, Skipped: 0, Time elapsed: 136.004 sec <<<
FAILURE! - in org.apache.activemq.transport.mqtt.MQTTNIOSSLTest
testReceiveMessageSentWhileOffline(org.apache.activemq.transport.mqtt.MQTTNIOSSLTest)  Time
elapsed: 0.489 sec  <<< FAILURE!
java.lang.AssertionError: Should have received 202 messages expected:<202> but was:<14>
	at org.junit.Assert.fail(Assert.java:88)
	at org.junit.Assert.failNotEquals(Assert.java:834)
	at org.junit.Assert.assertEquals(Assert.java:645)
	at org.apache.activemq.transport.mqtt.MQTTTest.testReceiveMessageSentWhileOffline(MQTTTest.java:1698)
	at sun.reflect.NativeMethodAccessorImpl.invoke0(Native Method)
	at sun.reflect.NativeMethodAccessorImpl.invoke(NativeMethodAccessorImpl.java:62)
	at sun.reflect.DelegatingMethodAccessorImpl.invoke(DelegatingMethodAccessorImpl.java:43)
	at java.lang.reflect.Method.invoke(Method.java:498)
	at org.junit.runners.model.FrameworkMethod$1.runReflectiveCall(FrameworkMethod.java:50)
	at org.junit.internal.runners.model.ReflectiveCallable.run(ReflectiveCallable.java:12)
	at org.junit.runners.model.FrameworkMethod.invokeExplosively(FrameworkMethod.java:47)
	at org.junit.internal.runners.statements.InvokeMethod.evaluate(InvokeMethod.java:17)
	at org.junit.internal.runners.statements.FailOnTimeout$CallableStatement.call(FailOnTimeout.java:298)
	at org.junit.internal.runners.statements.FailOnTimeout$CallableStatement.call(FailOnTimeout.java:292)
	at java.util.concurrent.FutureTask.run(FutureTask.java:266)
	at java.lang.Thread.run(Thread.java:745)

Running org.apache.activemq.transport.mqtt.MQTTNIOTest
Tests run: 55, Failures: 0, Errors: 0, Skipped: 0, Time elapsed: 115.33 sec - in org.apache.activemq.transport.mqtt.MQTTNIOTest
Running org.apache.activemq.transport.mqtt.MQTTOverlapedSubscriptionsTest
Tests run: 1, Failures: 0, Errors: 0, Skipped: 0, Time elapsed: 1.732 sec - in org.apache.activemq.transport.mqtt.MQTTOverlapedSubscriptionsTest
Running org.apache.activemq.transport.mqtt.MQTTPingReqTest
Tests run: 4, Failures: 0, Errors: 0, Skipped: 0, Time elapsed: 1.293 sec - in org.apache.activemq.transport.mqtt.MQTTPingReqTest
Running org.apache.activemq.transport.mqtt.MQTTProtocolConverterTest
Tests run: 2, Failures: 0, Errors: 0, Skipped: 0, Time elapsed: 0.562 sec - in org.apache.activemq.transport.mqtt.MQTTProtocolConverterTest
Running org.apache.activemq.transport.mqtt.MQTTSSLTest
Tests run: 55, Failures: 0, Errors: 0, Skipped: 0, Time elapsed: 131.439 sec - in org.apache.activemq.transport.mqtt.MQTTSSLTest
Running org.apache.activemq.transport.mqtt.MQTTSubscriptionRecoveryTest
Tests run: 2, Failures: 0, Errors: 0, Skipped: 0, Time elapsed: 6.415 sec - in org.apache.activemq.transport.mqtt.MQTTSubscriptionRecoveryTest
Running org.apache.activemq.transport.mqtt.MQTTTest
Tests run: 55, Failures: 0, Errors: 0, Skipped: 0, Time elapsed: 119.767 sec - in org.apache.activemq.transport.mqtt.MQTTTest
Running org.apache.activemq.transport.mqtt.MQTTVirtualTopicSubscriptionsTest
Tests run: 57, Failures: 0, Errors: 0, Skipped: 0, Time elapsed: 127.456 sec - in org.apache.activemq.transport.mqtt.MQTTVirtualTopicSubscriptionsTest
Running org.apache.activemq.transport.mqtt.MQTTWillTest
Tests run: 2, Failures: 0, Errors: 0, Skipped: 0, Time elapsed: 3.396 sec - in org.apache.activemq.transport.mqtt.MQTTWillTest
Running org.apache.activemq.transport.mqtt.PahoMQTTNIOTest
Tests run: 6, Failures: 0, Errors: 0, Skipped: 0, Time elapsed: 25.016 sec - in org.apache.activemq.transport.mqtt.PahoMQTTNIOTest
Running org.apache.activemq.transport.mqtt.PahoMQTTTest
Tests run: 6, Failures: 0, Errors: 0, Skipped: 0, Time elapsed: 25.09 sec - in org.apache.activemq.transport.mqtt.PahoMQTTTest
Running org.apache.activemq.transport.mqtt.PahoVirtualTopicMQTTTest
Tests run: 7, Failures: 0, Errors: 0, Skipped: 0, Time elapsed: 26.458 sec - in org.apache.activemq.transport.mqtt.PahoVirtualTopicMQTTTest
Running org.apache.activemq.transport.mqtt.auto.MQTTAutoNioSslTest
Tests run: 55, Failures: 0, Errors: 0, Skipped: 0, Time elapsed: 146.727 sec - in org.apache.activemq.transport.mqtt.auto.MQTTAutoNioSslTest
Running org.apache.activemq.transport.mqtt.auto.MQTTAutoNioTest
Tests run: 55, Failures: 0, Errors: 0, Skipped: 0, Time elapsed: 132.708 sec - in org.apache.activemq.transport.mqtt.auto.MQTTAutoNioTest
Running org.apache.activemq.transport.mqtt.auto.MQTTAutoSslAuthTest
Tests run: 2, Failures: 0, Errors: 0, Skipped: 0, Time elapsed: 1.862 sec - in org.apache.activemq.transport.mqtt.auto.MQTTAutoSslAuthTest
Running org.apache.activemq.transport.mqtt.auto.MQTTAutoSslTest
Tests run: 55, Failures: 0, Errors: 0, Skipped: 0, Time elapsed: 154.247 sec - in org.apache.activemq.transport.mqtt.auto.MQTTAutoSslTest
Running org.apache.activemq.transport.mqtt.auto.MQTTAutoTest
Tests run: 55, Failures: 0, Errors: 0, Skipped: 0, Time elapsed: 136.291 sec - in org.apache.activemq.transport.mqtt.auto.MQTTAutoTest

Results :

Failed tests: 
  MQTTNIOSSLTest>MQTTTest.testReceiveMessageSentWhileOffline:1698 Should have received
202 messages expected:<202> but was:<14>

Tests run: 581, Failures: 1, Errors: 0, Skipped: 0

[ERROR] There are test failures.

Please refer to <https://builds.apache.org/job/ActiveMQ-Java8/ws/activemq-mqtt/target/surefire-reports>
for the individual test results.
[locks-and-latches] Releasing all the locks
[locks-and-latches] All the locks released
ERROR: Failed to parse POMs
java.io.IOException: Backing channel 'ubuntu-1' is disconnected.
	at hudson.remoting.RemoteInvocationHandler.channelOrFail(RemoteInvocationHandler.java:192)
	at hudson.remoting.RemoteInvocationHandler.invoke(RemoteInvocationHandler.java:257)
	at com.sun.proxy.$Proxy124.isAlive(Unknown Source)
	at hudson.Launcher$RemoteLauncher$ProcImpl.isAlive(Launcher.java:1043)
	at hudson.maven.ProcessCache$MavenProcess.call(ProcessCache.java:166)
	at hudson.maven.MavenModuleSetBuild$MavenModuleSetBuildExecution.doRun(MavenModuleSetBuild.java:873)
	at hudson.model.AbstractBuild$AbstractBuildExecution.run(AbstractBuild.java:534)
	at hudson.model.Run.execute(Run.java:1728)
	at hudson.maven.MavenModuleSetBuild.run(MavenModuleSetBuild.java:544)
	at hudson.model.ResourceController.execute(ResourceController.java:98)
	at hudson.model.Executor.run(Executor.java:405)
Caused by: java.io.IOException: Unexpected termination of the channel
	at hudson.remoting.SynchronousCommandTransport$ReaderThread.run(SynchronousCommandTransport.java:73)
Caused by: java.io.EOFException
	at java.io.ObjectInputStream$PeekInputStream.readFully(ObjectInputStream.java:2353)
	at java.io.ObjectInputStream$BlockDataInputStream.readShort(ObjectInputStream.java:2822)
	at java.io.ObjectInputStream.readStreamHeader(ObjectInputStream.java:804)
	at java.io.ObjectInputStream.<init>(ObjectInputStream.java:301)
	at hudson.remoting.ObjectInputStreamEx.<init>(ObjectInputStreamEx.java:48)
	at hudson.remoting.AbstractSynchronousByteArrayCommandTransport.read(AbstractSynchronousByteArrayCommandTransport.java:34)
	at hudson.remoting.SynchronousCommandTransport$ReaderThread.run(SynchronousCommandTransport.java:59)
FATAL: channel is already closed
java.io.EOFException
	at java.io.ObjectInputStream$PeekInputStream.readFully(ObjectInputStream.java:2353)
	at java.io.ObjectInputStream$BlockDataInputStream.readShort(ObjectInputStream.java:2822)
	at java.io.ObjectInputStream.readStreamHeader(ObjectInputStream.java:804)
	at java.io.ObjectInputStream.<init>(ObjectInputStream.java:301)
	at hudson.remoting.ObjectInputStreamEx.<init>(ObjectInputStreamEx.java:48)
	at hudson.remoting.AbstractSynchronousByteArrayCommandTransport.read(AbstractSynchronousByteArrayCommandTransport.java:34)
	at hudson.remoting.SynchronousCommandTransport$ReaderThread.run(SynchronousCommandTransport.java:59)
Caused: java.io.IOException: Unexpected termination of the channel
	at hudson.remoting.SynchronousCommandTransport$ReaderThread.run(SynchronousCommandTransport.java:73)
Caused: hudson.remoting.ChannelClosedException: channel is already closed
	at hudson.remoting.Channel.send(Channel.java:605)
	at hudson.remoting.Request.call(Request.java:130)
	at hudson.remoting.Channel.call(Channel.java:829)
	at hudson.Launcher$RemoteLauncher.kill(Launcher.java:984)
	at hudson.model.AbstractBuild$AbstractBuildExecution.run(AbstractBuild.java:540)
	at hudson.model.Run.execute(Run.java:1728)
	at hudson.maven.MavenModuleSetBuild.run(MavenModuleSetBuild.java:544)
	at hudson.model.ResourceController.execute(ResourceController.java:98)
	at hudson.model.Executor.run(Executor.java:405)

Mime
View raw message