activemq-commits mailing list archives

Site index · List index
Message view « Date » · « Thread »
Top « Date » · « Thread »
From Apache Jenkins Server <jenk...@builds.apache.org>
Subject Build failed in Jenkins: ActiveMQ-Artemis-Master #1053
Date Thu, 04 May 2017 16:17:46 GMT
See <https://builds.apache.org/job/ActiveMQ-Artemis-Master/1053/display/redirect?page=changes>

Changes:

[jbertram] ARTEMIS-904 Remove cyclic dependencies from artemis-cli

------------------------------------------
[...truncated 2.68 MB...]
[main] 16:17:30,661 INFO  [org.apache.activemq.artemis.jms.tests] Got message 11
[main] 16:17:30,661 INFO  [org.apache.activemq.artemis.jms.tests] Got message 12
[main] 16:17:30,661 INFO  [org.apache.activemq.artemis.jms.tests] Got message 13
[main] 16:17:30,661 INFO  [org.apache.activemq.artemis.jms.tests] Got message 14
[main] 16:17:30,661 INFO  [org.apache.activemq.artemis.jms.tests] Got message 15
[main] 16:17:30,661 INFO  [org.apache.activemq.artemis.jms.tests] Got message 16
[main] 16:17:30,661 INFO  [org.apache.activemq.artemis.jms.tests] Got message 17
[main] 16:17:30,661 INFO  [org.apache.activemq.artemis.jms.tests] Got message 18
[main] 16:17:30,661 INFO  [org.apache.activemq.artemis.jms.tests] Got message 19
[main] 16:17:30,661 INFO  [org.apache.activemq.artemis.jms.tests] Got message 20
[main] 16:17:30,661 INFO  [org.apache.activemq.artemis.jms.tests] Got message 21
[main] 16:17:30,661 INFO  [org.apache.activemq.artemis.jms.tests] Got message 22
[main] 16:17:30,661 INFO  [org.apache.activemq.artemis.jms.tests] Got message 23
[main] 16:17:30,661 INFO  [org.apache.activemq.artemis.jms.tests] Got message 24
[main] 16:17:30,661 INFO  [org.apache.activemq.artemis.jms.tests] Got message 25
[main] 16:17:30,661 INFO  [org.apache.activemq.artemis.jms.tests] Got message 26
[main] 16:17:30,661 INFO  [org.apache.activemq.artemis.jms.tests] Got message 27
[main] 16:17:30,661 INFO  [org.apache.activemq.artemis.jms.tests] Got message 28
[main] 16:17:30,661 INFO  [org.apache.activemq.artemis.jms.tests] Got message 29
[main] 16:17:30,662 INFO  [org.apache.activemq.artemis.jms.tests] Got message 30
[main] 16:17:30,662 INFO  [org.apache.activemq.artemis.jms.tests] Got message 31
[main] 16:17:30,662 INFO  [org.apache.activemq.artemis.jms.tests] Got message 32
[main] 16:17:30,662 INFO  [org.apache.activemq.artemis.jms.tests] Got message 33
[main] 16:17:30,662 INFO  [org.apache.activemq.artemis.jms.tests] Got message 34
[main] 16:17:30,662 INFO  [org.apache.activemq.artemis.jms.tests] Got message 35
[main] 16:17:30,662 INFO  [org.apache.activemq.artemis.jms.tests] Got message 36
[main] 16:17:30,662 INFO  [org.apache.activemq.artemis.jms.tests] Got message 37
[main] 16:17:30,662 INFO  [org.apache.activemq.artemis.jms.tests] Got message 38
[main] 16:17:30,662 INFO  [org.apache.activemq.artemis.jms.tests] Got message 39
[main] 16:17:30,662 INFO  [org.apache.activemq.artemis.jms.tests] Got message 40
[main] 16:17:30,662 INFO  [org.apache.activemq.artemis.jms.tests] Got message 41
[main] 16:17:30,662 INFO  [org.apache.activemq.artemis.jms.tests] Got message 42
[main] 16:17:30,662 INFO  [org.apache.activemq.artemis.jms.tests] Got message 43
[main] 16:17:30,662 INFO  [org.apache.activemq.artemis.jms.tests] Got message 44
[main] 16:17:30,662 INFO  [org.apache.activemq.artemis.jms.tests] Got message 45
[main] 16:17:30,662 INFO  [org.apache.activemq.artemis.jms.tests] Got message 46
[main] 16:17:30,662 INFO  [org.apache.activemq.artemis.jms.tests] Got message 47
[main] 16:17:30,662 INFO  [org.apache.activemq.artemis.jms.tests] Got message 48
[main] 16:17:30,663 INFO  [org.apache.activemq.artemis.jms.tests] Got message 49
[main] 16:17:30,663 INFO  [org.apache.activemq.artemis.jms.tests] Got message 50
[main] 16:17:30,663 INFO  [org.apache.activemq.artemis.jms.tests] Got message 51
[main] 16:17:30,663 INFO  [org.apache.activemq.artemis.jms.tests] Got message 52
[main] 16:17:30,663 INFO  [org.apache.activemq.artemis.jms.tests] Got message 53
[main] 16:17:30,663 INFO  [org.apache.activemq.artemis.jms.tests] Got message 54
[main] 16:17:30,663 INFO  [org.apache.activemq.artemis.jms.tests] Got message 55
[main] 16:17:30,663 INFO  [org.apache.activemq.artemis.jms.tests] Got message 56
[main] 16:17:30,663 INFO  [org.apache.activemq.artemis.jms.tests] Got message 57
[main] 16:17:30,663 INFO  [org.apache.activemq.artemis.jms.tests] Got message 58
[main] 16:17:30,663 INFO  [org.apache.activemq.artemis.jms.tests] Got message 59
[main] 16:17:30,663 INFO  [org.apache.activemq.artemis.jms.tests] Got message 60
[main] 16:17:30,663 INFO  [org.apache.activemq.artemis.jms.tests] Got message 61
[main] 16:17:30,663 INFO  [org.apache.activemq.artemis.jms.tests] Got message 62
[main] 16:17:30,663 INFO  [org.apache.activemq.artemis.jms.tests] Got message 63
[main] 16:17:30,663 INFO  [org.apache.activemq.artemis.jms.tests] Got message 64
[main] 16:17:30,663 INFO  [org.apache.activemq.artemis.jms.tests] Got message 65
[main] 16:17:30,663 INFO  [org.apache.activemq.artemis.jms.tests] Got message 66
[main] 16:17:30,663 INFO  [org.apache.activemq.artemis.jms.tests] Got message 67
[main] 16:17:30,664 INFO  [org.apache.activemq.artemis.jms.tests] Got message 68
[main] 16:17:30,664 INFO  [org.apache.activemq.artemis.jms.tests] Got message 69
[main] 16:17:30,664 INFO  [org.apache.activemq.artemis.jms.tests] Got message 70
[main] 16:17:30,664 INFO  [org.apache.activemq.artemis.jms.tests] Got message 71
[main] 16:17:30,664 INFO  [org.apache.activemq.artemis.jms.tests] Got message 72
[main] 16:17:30,664 INFO  [org.apache.activemq.artemis.jms.tests] Got message 73
[main] 16:17:30,664 INFO  [org.apache.activemq.artemis.jms.tests] Got message 74
[main] 16:17:30,664 INFO  [org.apache.activemq.artemis.jms.tests] Got message 75
[main] 16:17:30,664 INFO  [org.apache.activemq.artemis.jms.tests] Got message 76
[main] 16:17:30,664 INFO  [org.apache.activemq.artemis.jms.tests] Got message 77
[main] 16:17:30,664 INFO  [org.apache.activemq.artemis.jms.tests] Got message 78
[main] 16:17:30,664 INFO  [org.apache.activemq.artemis.jms.tests] Got message 79
[main] 16:17:30,664 INFO  [org.apache.activemq.artemis.jms.tests] Got message 80
[main] 16:17:30,664 INFO  [org.apache.activemq.artemis.jms.tests] Got message 81
[main] 16:17:30,664 INFO  [org.apache.activemq.artemis.jms.tests] Got message 82
[main] 16:17:30,664 INFO  [org.apache.activemq.artemis.jms.tests] Got message 83
[main] 16:17:30,664 INFO  [org.apache.activemq.artemis.jms.tests] Got message 84
[main] 16:17:30,664 INFO  [org.apache.activemq.artemis.jms.tests] Got message 85
[main] 16:17:30,664 INFO  [org.apache.activemq.artemis.jms.tests] Got message 86
[main] 16:17:30,664 INFO  [org.apache.activemq.artemis.jms.tests] Got message 87
[main] 16:17:30,664 INFO  [org.apache.activemq.artemis.jms.tests] Got message 88
[main] 16:17:30,665 INFO  [org.apache.activemq.artemis.jms.tests] Got message 89
[main] 16:17:30,665 INFO  [org.apache.activemq.artemis.jms.tests] Got message 90
[main] 16:17:30,665 INFO  [org.apache.activemq.artemis.jms.tests] Got message 91
[main] 16:17:30,665 INFO  [org.apache.activemq.artemis.jms.tests] Got message 92
[main] 16:17:30,665 INFO  [org.apache.activemq.artemis.jms.tests] Got message 93
[main] 16:17:30,665 INFO  [org.apache.activemq.artemis.jms.tests] Got message 94
[main] 16:17:30,665 INFO  [org.apache.activemq.artemis.jms.tests] Got message 95
[main] 16:17:30,665 INFO  [org.apache.activemq.artemis.jms.tests] Got message 96
[main] 16:17:30,665 INFO  [org.apache.activemq.artemis.jms.tests] Got message 97
[main] 16:17:30,665 INFO  [org.apache.activemq.artemis.jms.tests] Got message 98
[main] 16:17:30,665 INFO  [org.apache.activemq.artemis.jms.tests] Got message 99
[main] 16:17:30,671 INFO  [org.apache.activemq.artemis.jms.tests] #*#*# Finished test: testManyQueue()...
[main] 16:17:30,671 INFO  [org.apache.activemq.artemis.jms.tests] #*#*# Starting test: testManyTopic()...
[main] 16:17:31,220 INFO  [org.apache.activemq.artemis.jms.tests] #*#*# Finished test: testManyTopic()...
[main] 16:17:31,220 INFO  [org.apache.activemq.artemis.jms.tests] #*#*# Starting test: testManyConsumersWithDifferentSelectors()...
[main] 16:17:32,248 INFO  [org.apache.activemq.artemis.jms.tests] #*#*# Finished test: testManyConsumersWithDifferentSelectors()...
[main] 16:17:32,248 INFO  [org.apache.activemq.artemis.jms.tests] #*#*# Starting test: testDeliveryModeOnSelector()...
[main] 16:17:33,262 INFO  [org.apache.activemq.artemis.jms.tests] #*#*# Finished test: testDeliveryModeOnSelector()...
[main] 16:17:33,374 INFO  [org.apache.activemq.artemis.core.server] AMQ221002: Apache ActiveMQ
Artemis Message Broker version 2.1.0-SNAPSHOT [287b42b9-30e5-11e7-9a4b-0242f413908b] stopped,
uptime 9.086 seconds
Tests run: 15, Failures: 0, Errors: 0, Skipped: 0, Time elapsed: 9.097 sec - in org.apache.activemq.artemis.jms.tests.selector.SelectorTest
Running org.apache.activemq.artemis.jms.tests.util.JNDIUtilTest
[main] 16:17:33,376 INFO  [org.apache.activemq.artemis.jms.tests] #*#*# Starting test: testRebind_1()...
[main] 16:17:33,378 INFO  [org.apache.activemq.artemis.jms.tests] Deleted dir: <https://builds.apache.org/job/ActiveMQ-Artemis-Master/ws/tests/jms-tests/target/data>
deleted: true
[main] 16:17:33,399 INFO  [org.apache.activemq.artemis.core.server] AMQ221000: live Message
Broker is starting with configuration Broker Configuration (clustered=false,journalDirectory=target/data/journal,bindingsDirectory=target/data/binding,largeMessagesDirectory=target/data/largemessages,pagingDirectory=target/data/paging)
[main] 16:17:33,399 INFO  [org.apache.activemq.artemis.core.server] AMQ221012: Using AIO Journal
[main] 16:17:33,400 INFO  [org.apache.activemq.artemis.core.server] AMQ221043: Protocol module
found: [artemis-server]. Adding protocol support for: CORE
[main] 16:17:33,408 INFO  [org.apache.activemq.artemis.core.server] AMQ221034: Waiting indefinitely
to obtain live lock
[main] 16:17:33,409 INFO  [org.apache.activemq.artemis.core.server] AMQ221035: Live Server
Obtained live lock
[main] 16:17:33,749 INFO  [org.apache.activemq.artemis.core.server] AMQ221020: Started EPOLL
Acceptor at localhost:61616 for protocols [CORE]
[main] 16:17:33,751 INFO  [org.apache.activemq.artemis.core.server] AMQ221007: Server is now
live
[main] 16:17:33,751 INFO  [org.apache.activemq.artemis.core.server] AMQ221001: Apache ActiveMQ
Artemis Message Broker version 2.1.0-SNAPSHOT [localhost, nodeID=2de907fe-30e5-11e7-9a4b-0242f413908b]

[main] 16:17:33,775 INFO  [org.apache.activemq.artemis.jms.tests] #*#*# Finished test: testRebind_1()...
[main] 16:17:33,775 INFO  [org.apache.activemq.artemis.jms.tests] #*#*# Starting test: testRebind_2()...
[main] 16:17:33,776 INFO  [org.apache.activemq.artemis.jms.tests] #*#*# Finished test: testRebind_2()...
[main] 16:17:33,776 INFO  [org.apache.activemq.artemis.jms.tests] #*#*# Starting test: testRebind_3()...
[main] 16:17:33,776 INFO  [org.apache.activemq.artemis.jms.tests] #*#*# Finished test: testRebind_3()...
[main] 16:17:33,859 INFO  [org.apache.activemq.artemis.core.server] AMQ221002: Apache ActiveMQ
Artemis Message Broker version 2.1.0-SNAPSHOT [2de907fe-30e5-11e7-9a4b-0242f413908b] stopped,
uptime 0.466 seconds
Tests run: 3, Failures: 0, Errors: 0, Skipped: 0, Time elapsed: 0.483 sec - in org.apache.activemq.artemis.jms.tests.util.JNDIUtilTest

Results :

Tests run: 427, Failures: 0, Errors: 0, Skipped: 0

[INFO] 
[INFO] --- maven-jar-plugin:2.4:test-jar (default) @ jms-tests ---
[INFO] Building jar: <https://builds.apache.org/job/ActiveMQ-Artemis-Master/ws/tests/jms-tests/target/jms-tests-2.1.0-SNAPSHOT-tests.jar>
[INFO] 
[INFO] --- maven-jar-plugin:2.4:jar (default-jar) @ jms-tests ---
[INFO] Building jar: <https://builds.apache.org/job/ActiveMQ-Artemis-Master/ws/tests/jms-tests/target/jms-tests-2.1.0-SNAPSHOT.jar>
[INFO] 
[INFO] --- maven-site-plugin:3.3:attach-descriptor (attach-descriptor) @ jms-tests ---
[INFO] 
[INFO] >>> maven-source-plugin:2.2.1:jar (attach-sources) > generate-sources @
jms-tests >>>
[INFO] 
[INFO] --- maven-enforcer-plugin:1.4:enforce (enforce-maven) @ jms-tests ---
[INFO] 
[INFO] --- maven-enforcer-plugin:1.4:enforce (enforce-java) @ jms-tests ---
[INFO] 
[INFO] <<< maven-source-plugin:2.2.1:jar (attach-sources) < generate-sources @
jms-tests <<<
[INFO] 
[INFO] --- maven-source-plugin:2.2.1:jar (attach-sources) @ jms-tests ---
[INFO] Building jar: <https://builds.apache.org/job/ActiveMQ-Artemis-Master/ws/tests/jms-tests/target/jms-tests-2.1.0-SNAPSHOT-sources.jar>
[INFO] 
[INFO] >>> maven-source-plugin:2.2.1:jar (default) > generate-sources @ jms-tests
>>>
[INFO] 
[INFO] --- maven-enforcer-plugin:1.4:enforce (enforce-maven) @ jms-tests ---
[INFO] 
[INFO] --- maven-enforcer-plugin:1.4:enforce (enforce-java) @ jms-tests ---
[INFO] 
[INFO] <<< maven-source-plugin:2.2.1:jar (default) < generate-sources @ jms-tests
<<<
[INFO] 
[INFO] --- maven-source-plugin:2.2.1:jar (default) @ jms-tests ---
[INFO] 
[INFO] --- dependency-check-maven:1.4.3:check (default) @ jms-tests ---
[INFO] Skipping dependency-check
[INFO] 
[INFO] --- maven-install-plugin:2.4:install (default-install) @ jms-tests ---
[INFO] Installing <https://builds.apache.org/job/ActiveMQ-Artemis-Master/ws/tests/jms-tests/target/jms-tests-2.1.0-SNAPSHOT.jar>
to /home/jenkins/.m2/repository/org/apache/activemq/tests/jms-tests/2.1.0-SNAPSHOT/jms-tests-2.1.0-SNAPSHOT.jar
[INFO] Installing <https://builds.apache.org/job/ActiveMQ-Artemis-Master/ws/tests/jms-tests/pom.xml>
to /home/jenkins/.m2/repository/org/apache/activemq/tests/jms-tests/2.1.0-SNAPSHOT/jms-tests-2.1.0-SNAPSHOT.pom
[INFO] Installing <https://builds.apache.org/job/ActiveMQ-Artemis-Master/ws/tests/jms-tests/target/jms-tests-2.1.0-SNAPSHOT-tests.jar>
to /home/jenkins/.m2/repository/org/apache/activemq/tests/jms-tests/2.1.0-SNAPSHOT/jms-tests-2.1.0-SNAPSHOT-tests.jar
[INFO] Installing <https://builds.apache.org/job/ActiveMQ-Artemis-Master/ws/tests/jms-tests/target/jms-tests-2.1.0-SNAPSHOT-sources.jar>
to /home/jenkins/.m2/repository/org/apache/activemq/tests/jms-tests/2.1.0-SNAPSHOT/jms-tests-2.1.0-SNAPSHOT-sources.jar
[INFO] Installing <https://builds.apache.org/job/ActiveMQ-Artemis-Master/ws/tests/jms-tests/target/jms-tests-2.1.0-SNAPSHOT-sources.jar>
to /home/jenkins/.m2/repository/org/apache/activemq/tests/jms-tests/2.1.0-SNAPSHOT/jms-tests-2.1.0-SNAPSHOT-sources.jar
[INFO]                                                                         
[INFO] ------------------------------------------------------------------------
[INFO] Building ActiveMQ Artemis Features 2.1.0-SNAPSHOT
[INFO] ------------------------------------------------------------------------
[INFO] 
[INFO] --- maven-enforcer-plugin:1.4:enforce (enforce-maven) @ artemis-features ---
[INFO] 
[INFO] --- maven-enforcer-plugin:1.4:enforce (enforce-java) @ artemis-features ---
[INFO] 
[INFO] --- maven-remote-resources-plugin:1.5:process (process-resource-bundles) @ artemis-features
---
[INFO] 
[INFO] --- maven-resources-plugin:2.6:resources (filter) @ artemis-features ---
[INFO] Using 'UTF-8' encoding to copy filtered resources.
[INFO] Copying 3 resources
[INFO] Copying 3 resources
[INFO] 
[INFO] --- karaf-maven-plugin:4.1.1:verify (verify) @ artemis-features ---
[INFO] ------------------------------------------------------------------------
[INFO] Reactor Summary:
[INFO] 
[INFO] ActiveMQ Artemis Parent ............................ SUCCESS [  3.547 s]
[INFO] ActiveMQ Artemis Commons ........................... SUCCESS [ 14.004 s]
[INFO] ActiveMQ Artemis Core Client ....................... SUCCESS [  9.723 s]
[INFO] ActiveMQ Artemis Selector Implementation ........... SUCCESS [  3.095 s]
[INFO] ActiveMQ Artemis JMS Client ........................ SUCCESS [  3.988 s]
[INFO] ActiveMQ Artemis Native POM ........................ SUCCESS [  7.033 s]
[INFO] ActiveMQ Artemis Journal ........................... SUCCESS [  2.890 s]
[INFO] ActiveMQ Artemis JDBC Store ........................ SUCCESS [  4.262 s]
[INFO] ActiveMQ Artemis Server ............................ SUCCESS [ 46.805 s]
[INFO] ActiveMQ Artemis Protocols ......................... SUCCESS [  0.401 s]
[INFO] ActiveMQ Artemis AMQP Protocol ..................... SUCCESS [  3.454 s]
[INFO] ActiveMQ Artemis STOMP Protocol .................... SUCCESS [  1.608 s]
[INFO] ActiveMQ Artemis OpenWire Protocol ................. SUCCESS [  2.044 s]
[INFO] ActiveMQ Artemis HQClient Protocol ................. SUCCESS [  0.726 s]
[INFO] ActiveMQ Artemis HornetQ Protocol .................. SUCCESS [  0.874 s]
[INFO] ActiveMQ Artemis MQTT Protocol ..................... SUCCESS [  1.273 s]
[INFO] ActiveMQ Artemis DTO ............................... SUCCESS [  1.888 s]
[INFO] ActiveMQ Artemis Service Extensions ................ SUCCESS [  1.822 s]
[INFO] ActiveMQ Artemis JMS Server ........................ SUCCESS [  1.528 s]
[INFO] ActiveMQ Artemis CDI Integration ................... SUCCESS [  4.072 s]
[INFO] ActiveMQ Artemis Boot .............................. SUCCESS [  0.364 s]
[INFO] ActiveMQ Artemis Tools ............................. SUCCESS [  0.888 s]
[INFO] ActiveMQ Artemis CLI ............................... SUCCESS [ 15.568 s]
[INFO] ActiveMQ Artemis Web ............................... SUCCESS [  5.091 s]
[INFO] ActiveMQ Artemis Web ............................... SUCCESS [01:00 min]
[INFO] ActiveMQ Artemis JUnit Rules ....................... SUCCESS [  7.647 s]
[INFO] ActiveMQ Artemis RAR POM ........................... SUCCESS [  2.190 s]
[INFO] ActiveMQ Artemis REST Interface Implementation ..... SUCCESS [01:24 min]
[INFO] ActiveMQ Artemis Maven Plugin ...................... SUCCESS [  3.403 s]
[INFO] ActiveMQ Artemis Server OSGi ....................... SUCCESS [  2.802 s]
[INFO] ActiveMQ Artemis Spring Integration ................ SUCCESS [  0.658 s]
[INFO] Apache ActiveMQ Artemis Distribution ............... SUCCESS [ 18.600 s]
[INFO] ActiveMQ Artemis Tests POM ......................... SUCCESS [  0.693 s]
[INFO] ActiveMQ Artemis Unit Tests ........................ SUCCESS [02:25 min]
[INFO] ActiveMQ Artemis Joram Tests ....................... SUCCESS [ 33.826 s]
[INFO] ActiveMQ Artemis timing Tests ...................... SUCCESS [  0.989 s]
[INFO] ActiveMQ Artemis JMS Tests ......................... SUCCESS [03:06 min]
[INFO] ActiveMQ Artemis Features .......................... FAILURE [  0.579 s]
[INFO] ActiveMQ Artemis Test Support ...................... SKIPPED
[INFO] ActiveMQ Artemis Integration Tests ................. SKIPPED
[INFO] ActiveMQ Artemis soak Tests ........................ SKIPPED
[INFO] ActiveMQ Artemis stress Tests ...................... SKIPPED
[INFO] ActiveMQ Artemis performance Tests ................. SKIPPED
[INFO] Smoke Tests ........................................ SKIPPED
[INFO] ActiveMQ Artemis Extra Tests ....................... SKIPPED
[INFO] ------------------------------------------------------------------------
[INFO] BUILD FAILURE
[INFO] ------------------------------------------------------------------------
[INFO] Total time: 11:27 min
[INFO] Finished at: 2017-05-04T16:17:34+00:00
[INFO] Final Memory: 247M/4341M
[INFO] ------------------------------------------------------------------------
[ERROR] Failed to execute goal org.apache.karaf.tooling:karaf-maven-plugin:4.1.1:verify (verify)
on project artemis-features: Execution verify of goal org.apache.karaf.tooling:karaf-maven-plugin:4.1.1:verify
failed: Plugin org.apache.karaf.tooling:karaf-maven-plugin:4.1.1 or one of its dependencies
could not be resolved: Failure to find org.apache.felix:maven-bundle-plugin:jar:3.3.0 in http://sevntu-checkstyle.github.io/sevntu.checkstyle/maven2
was cached in the local repository, resolution will not be reattempted until the update interval
of sevntu-maven has elapsed or updates are forced -> [Help 1]
[ERROR] 
[ERROR] To see the full stack trace of the errors, re-run Maven with the -e switch.
[ERROR] Re-run Maven using the -X switch to enable full debug logging.
[ERROR] 
[ERROR] For more information about the errors and possible solutions, please read the following
articles:
[ERROR] [Help 1] http://cwiki.apache.org/confluence/display/MAVEN/PluginResolutionException
[ERROR] 
[ERROR] After correcting the problems, you can resume the build with the command
[ERROR]   mvn <goals> -rf :artemis-features
Build step 'Invoke top-level Maven targets' marked build as failure
Performing Post build task...
Could not match :Too many files with unapproved license  : False
Logical operation result is FALSE
Skipping script  : cat ratReport.txt
END OF POST BUILD TASK 	: 0
Recording test results

Mime
View raw message