activemq-commits mailing list archives

Site index · List index
Message view « Date » · « Thread »
Top « Date » · « Thread »
From Apache Jenkins Server <>
Subject Build failed in Jenkins: ActiveMQ-Artemis-Master #1056
Date Fri, 05 May 2017 06:24:03 GMT
See <>


[gnodet] [ARTEMIS-1141] Fix some OSGi metadata issues

Started by an SCM change
[EnvInject] - Loading node environment variables.
Building remotely on H22 (ubuntu xenial) in workspace <>
 > git rev-parse --is-inside-work-tree # timeout=10
Fetching changes from the remote Git repository
 > git config remote.origin.url
# timeout=10
Cleaning workspace
 > git rev-parse --verify HEAD # timeout=10
Resetting working tree
 > git reset --hard # timeout=10
 > git clean -fdx # timeout=10
Fetching upstream changes from
 > git --version # timeout=10
 > git fetch --tags --progress
 > git rev-parse origin/master^{commit} # timeout=10
Checking out Revision f46fa8b927a6e0d618744322fad57c544a323200 (origin/master)
 > git config core.sparsecheckout # timeout=10
 > git checkout -f f46fa8b927a6e0d618744322fad57c544a323200
 > git rev-list 955bba7ed020aa8a4f84bcbd2932d1100bc27e6d # timeout=10
[ActiveMQ-Artemis-Master] $ /home/jenkins/tools/maven/apache-maven-3.2.5/bin/mvn -Pfast-tests
-Pextra-tests install
[INFO] Scanning for projects...
[ERROR] The build could not read 1 project -> [Help 1]
[ERROR]   The project org.apache.activemq:artemis-server-osgi:2.1.0-SNAPSHOT (<>
has 2 errors
[ERROR]     Unresolveable build extension: Plugin org.apache.felix:maven-bundle-plugin:3.3.0
or one of its dependencies could not be resolved: Could not find artifact org.apache.felix:maven-bundle-plugin:jar:3.3.0
in sevntu-maven ( -> [Help
[ERROR]     Unknown packaging: bundle @ org.apache.activemq:artemis-server-osgi:[unknown-version],
line 21, column 15
[ERROR] To see the full stack trace of the errors, re-run Maven with the -e switch.
[ERROR] Re-run Maven using the -X switch to enable full debug logging.
[ERROR] For more information about the errors and possible solutions, please read the following
[ERROR] [Help 1]
[ERROR] [Help 2]
Build step 'Invoke top-level Maven targets' marked build as failure
Performing Post build task...
Could not match :Too many files with unapproved license  : False
Logical operation result is FALSE
Skipping script  : cat ratReport.txt
Recording test results
ERROR: Step ?Publish JUnit test result report? failed: No test report files were found. Configuration

View raw message