activemq-commits mailing list archives

Site index · List index
Message view « Date » · « Thread »
Top « Date » · « Thread »
From Apache Jenkins Server <jenk...@builds.apache.org>
Subject Build failed in Jenkins: ActiveMQ-Artemis-Master #1078
Date Thu, 11 May 2017 16:18:04 GMT
See <https://builds.apache.org/job/ActiveMQ-Artemis-Master/1078/display/redirect?page=changes>

Changes:

[jbertram] ARTEMIS-1154 tweak logic to support previous semantics

------------------------------------------
[...truncated 257.54 KB...]
java.util.concurrent.ScheduledThreadPoolExecutor$DelayedWorkQueue.take(ScheduledThreadPoolExecutor.java:809)
java.util.concurrent.ThreadPoolExecutor.getTask(ThreadPoolExecutor.java:1067)
java.util.concurrent.ThreadPoolExecutor.runWorker(ThreadPoolExecutor.java:1127)
java.util.concurrent.ThreadPoolExecutor$Worker.run(ThreadPoolExecutor.java:617)
java.lang.Thread.run(Thread.java:745)
*********************************************************************************
[main] 16:17:37,899 INFO  [org.apache.activemq.artemis.utils.ThreadLeakCheckRule] #test forceGC
[Finalizer] 16:17:38,091 WARN  [org.apache.activemq.artemis.core.server] AMQ222000: ActiveMQServer
is being finalized and has not been stopped. Please remember to stop the server before letting
it go out of scope
[main] 16:17:38,093 INFO  [org.apache.activemq.artemis.utils.ThreadLeakCheckRule] #test forceGC
Done 
[Finalizer] 16:17:38,093 INFO  [org.apache.activemq.artemis.core.server] AMQ221002: Apache
ActiveMQ Artemis Message Broker version 2.2.0-SNAPSHOT [null] stopped, uptime 3.432 seconds
******************** Threads cleared after retries ********************

[main] 16:17:38,596 INFO  [org.apache.activemq.artemis.core.server] #*#*# Finished test: liveOnlyTest5()...
[main] 16:17:38,596 INFO  [org.apache.activemq.artemis.core.server] #*#*# Starting test: ReplicaTest2()...
#test ReplicaTest2
[main] 16:17:38,739 INFO  [org.apache.activemq.artemis.core.server] AMQ221000: backup Message
Broker is starting with configuration Broker Configuration (clustered=false,journalDirectory=<https://builds.apache.org/job/ActiveMQ-Artemis-Master/ws/artemis-server/./target/tmp/junit2810421542041859166/data/journal,bindingsDirectory=/home/jenkins/jenkins-slave/workspace/ActiveMQ-Artemis-Master/artemis-server/./target/tmp/junit2810421542041859166/data/bindings,largeMessagesDirectory=/home/jenkins/jenkins-slave/workspace/ActiveMQ-Artemis-Master/artemis-server/./target/tmp/junit2810421542041859166/data/largemessages,pagingDirectory=/home/jenkins/jenkins-slave/workspace/ActiveMQ-Artemis-Master/artemis-server/./target/tmp/junit2810421542041859166/data/paging)>
[AMQ119000: Activation for server ActiveMQServerImpl::serverUUID=null] 16:17:38,755 WARN 
[org.apache.activemq.artemis.core.server.impl.ActiveMQServerImpl] null: java.lang.InterruptedException
	at java.util.concurrent.locks.AbstractQueuedSynchronizer.acquireSharedInterruptibly(AbstractQueuedSynchronizer.java:1302)
[rt.jar:1.8.0_121]
	at java.util.concurrent.Semaphore.acquire(Semaphore.java:312) [rt.jar:1.8.0_121]
	at org.apache.activemq.artemis.core.server.impl.ActiveMQServerImpl.lockActivation(ActiveMQServerImpl.java:569)
[:]
	at org.apache.activemq.artemis.core.server.impl.ActiveMQServerImpl$ActivationThread.run(ActiveMQServerImpl.java:2795)
[:]

[AMQ119000: Activation for server ActiveMQServerImpl::serverUUID=null] 16:17:38,768 INFO 
[org.apache.activemq.artemis.core.server] AMQ222162: Moving data directory <https://builds.apache.org/job/ActiveMQ-Artemis-Master/ws/artemis-server/./target/tmp/junit2810421542041859166/data/journal>
to <https://builds.apache.org/job/ActiveMQ-Artemis-Master/ws/artemis-server/./target/tmp/junit2810421542041859166/data/journal/oldreplica.1>
[main] 16:17:38,769 INFO  [org.apache.activemq.artemis.core.server] AMQ221002: Apache ActiveMQ
Artemis Message Broker version 2.2.0-SNAPSHOT [null] stopped, uptime 0.057 seconds
[main] 16:17:38,776 INFO  [org.apache.activemq.artemis.core.server] #*#*# Finished test: ReplicaTest2()...
[main] 16:17:38,777 INFO  [org.apache.activemq.artemis.core.server] #*#*# Starting test: ReplicaTest3()...
#test ReplicaTest3
[main] 16:17:38,837 INFO  [org.apache.activemq.artemis.core.server] AMQ221000: backup Message
Broker is starting with configuration Broker Configuration (clustered=false,journalDirectory=<https://builds.apache.org/job/ActiveMQ-Artemis-Master/ws/artemis-server/./target/tmp/junit3310853676671782690/data/journal,bindingsDirectory=/home/jenkins/jenkins-slave/workspace/ActiveMQ-Artemis-Master/artemis-server/./target/tmp/junit3310853676671782690/data/bindings,largeMessagesDirectory=/home/jenkins/jenkins-slave/workspace/ActiveMQ-Artemis-Master/artemis-server/./target/tmp/junit3310853676671782690/data/largemessages,pagingDirectory=/home/jenkins/jenkins-slave/workspace/ActiveMQ-Artemis-Master/artemis-server/./target/tmp/junit3310853676671782690/data/paging)>
[AMQ119000: Activation for server ActiveMQServerImpl::serverUUID=null] 16:17:38,860 WARN 
[org.apache.activemq.artemis.core.server.impl.ActiveMQServerImpl] null: java.lang.InterruptedException
	at java.util.concurrent.locks.AbstractQueuedSynchronizer.acquireSharedInterruptibly(AbstractQueuedSynchronizer.java:1302)
[rt.jar:1.8.0_121]
	at java.util.concurrent.Semaphore.acquire(Semaphore.java:312) [rt.jar:1.8.0_121]
	at org.apache.activemq.artemis.core.server.impl.ActiveMQServerImpl.lockActivation(ActiveMQServerImpl.java:569)
[:]
	at org.apache.activemq.artemis.core.server.impl.ActiveMQServerImpl$ActivationThread.run(ActiveMQServerImpl.java:2795)
[:]

[AMQ119000: Activation for server ActiveMQServerImpl::serverUUID=null] 16:17:38,880 INFO 
[org.apache.activemq.artemis.core.server] AMQ222162: Moving data directory <https://builds.apache.org/job/ActiveMQ-Artemis-Master/ws/artemis-server/./target/tmp/junit3310853676671782690/data/journal>
to <https://builds.apache.org/job/ActiveMQ-Artemis-Master/ws/artemis-server/./target/tmp/junit3310853676671782690/data/journal/oldreplica.1>
[main] 16:17:38,881 INFO  [org.apache.activemq.artemis.core.server] AMQ221002: Apache ActiveMQ
Artemis Message Broker version 2.2.0-SNAPSHOT [null] stopped, uptime 0.083 seconds
[main] 16:17:38,883 INFO  [org.apache.activemq.artemis.core.server] #*#*# Finished test: ReplicaTest3()...
[main] 16:17:38,883 INFO  [org.apache.activemq.artemis.core.server] #*#*# Starting test: colocatedTestNullBackup()...
#test colocatedTestNullBackup
[main] 16:17:38,958 INFO  [org.apache.activemq.artemis.core.server] AMQ221000: live Message
Broker is starting with configuration Broker Configuration (clustered=false,journalDirectory=<https://builds.apache.org/job/ActiveMQ-Artemis-Master/ws/artemis-server/./target/tmp/junit2283451818505125837/data/journal,bindingsDirectory=/home/jenkins/jenkins-slave/workspace/ActiveMQ-Artemis-Master/artemis-server/./target/tmp/junit2283451818505125837/data/bindings,largeMessagesDirectory=/home/jenkins/jenkins-slave/workspace/ActiveMQ-Artemis-Master/artemis-server/./target/tmp/junit2283451818505125837/data/largemessages,pagingDirectory=/home/jenkins/jenkins-slave/workspace/ActiveMQ-Artemis-Master/artemis-server/./target/tmp/junit2283451818505125837/data/paging)>
[main] 16:17:38,959 INFO  [org.apache.activemq.artemis.core.server] AMQ221012: Using AIO Journal
[main] 16:17:38,960 INFO  [org.apache.activemq.artemis.core.server] AMQ221043: Protocol module
found: [artemis-server]. Adding protocol support for: CORE
[main] 16:17:39,359 INFO  [org.apache.activemq.artemis.core.server] AMQ221007: Server is now
live
[main] 16:17:39,360 INFO  [org.apache.activemq.artemis.core.server] AMQ221001: Apache ActiveMQ
Artemis Message Broker version 2.2.0-SNAPSHOT [localhost, nodeID=5a1c4c0e-3665-11e7-b1c9-02424ee64064]

[main] 16:17:39,460 INFO  [org.apache.activemq.artemis.core.server] AMQ221002: Apache ActiveMQ
Artemis Message Broker version 2.2.0-SNAPSHOT [5a1c4c0e-3665-11e7-b1c9-02424ee64064] stopped,
uptime 0.537 seconds
[main] 16:17:39,463 INFO  [org.apache.activemq.artemis.core.server] #*#*# Finished test: colocatedTestNullBackup()...
Tests run: 17, Failures: 0, Errors: 0, Skipped: 0, Time elapsed: 8.685 sec - in org.apache.activemq.artemis.core.config.impl.HAPolicyConfigurationTest
Running org.apache.activemq.artemis.core.config.impl.ValidatorsTest
Tests run: 8, Failures: 0, Errors: 0, Skipped: 0, Time elapsed: 0.033 sec - in org.apache.activemq.artemis.core.config.impl.ValidatorsTest
Running org.apache.activemq.artemis.core.config.impl.WrongRoleFileConfigurationParserTest
[main] 16:17:39,516 INFO  [org.apache.activemq.artemis.core.server] #*#*# Starting test: testParsingDefaultServerConfig()...
#test testParsingDefaultServerConfig
[main] 16:17:39,539 WARN  [org.apache.activemq.artemis.core.server] AMQ222177: Wrong configuration
for role, create-durable-queue is not a valid permission
[main] 16:17:39,539 WARN  [org.apache.activemq.artemis.core.server] AMQ222177: Wrong configuration
for role, delete-durable-queue is not a valid permission
[main] 16:17:39,552 INFO  [org.apache.activemq.artemis.core.server] #*#*# Finished test: testParsingDefaultServerConfig()...
Tests run: 1, Failures: 0, Errors: 0, Skipped: 0, Time elapsed: 0.048 sec - in org.apache.activemq.artemis.core.config.impl.WrongRoleFileConfigurationParserTest
Running org.apache.activemq.artemis.core.filter.impl.FilterTest
[main] 16:17:39,708 ERROR [org.apache.activemq.artemis.core.server] AMQ224006: Invalid filter:
color = 'red: org.apache.activemq.artemis.selector.filter.FilterException: color = 'red
	at org.apache.activemq.artemis.selector.impl.SelectorParser.parse(SelectorParser.java:86)
[artemis-selector-2.2.0-SNAPSHOT.jar:2.2.0-SNAPSHOT]
	at org.apache.activemq.artemis.core.filter.impl.FilterImpl.createFilter(FilterImpl.java:80)
[:]
	at org.apache.activemq.artemis.core.filter.impl.FilterImpl.createFilter(FilterImpl.java:66)
[:]
	at org.apache.activemq.artemis.core.filter.impl.FilterTest.testInvalidFilter(FilterTest.java:705)
[:]
	at org.apache.activemq.artemis.core.filter.impl.FilterTest.testInvalidString(FilterTest.java:68)
[:]
	at sun.reflect.NativeMethodAccessorImpl.invoke0(Native Method) [rt.jar:1.8.0_121]
	at sun.reflect.NativeMethodAccessorImpl.invoke(NativeMethodAccessorImpl.java:62) [rt.jar:1.8.0_121]
	at sun.reflect.DelegatingMethodAccessorImpl.invoke(DelegatingMethodAccessorImpl.java:43)
[rt.jar:1.8.0_121]
	at java.lang.reflect.Method.invoke(Method.java:498) [rt.jar:1.8.0_121]
	at org.junit.runners.model.FrameworkMethod$1.runReflectiveCall(FrameworkMethod.java:47) [junit-4.11.jar:]
	at org.junit.internal.runners.model.ReflectiveCallable.run(ReflectiveCallable.java:12) [junit-4.11.jar:]
	at org.junit.runners.model.FrameworkMethod.invokeExplosively(FrameworkMethod.java:44) [junit-4.11.jar:]
	at org.junit.internal.runners.statements.InvokeMethod.evaluate(InvokeMethod.java:17) [junit-4.11.jar:]
	at org.junit.internal.runners.statements.RunBefores.evaluate(RunBefores.java:26) [junit-4.11.jar:]
	at org.junit.internal.runners.statements.RunAfters.evaluate(RunAfters.java:27) [junit-4.11.jar:]
	at org.junit.runners.ParentRunner.runLeaf(ParentRunner.java:271) [junit-4.11.jar:]
	at org.junit.runners.BlockJUnit4ClassRunner.runChild(BlockJUnit4ClassRunner.java:70) [junit-4.11.jar:]
	at org.junit.runners.BlockJUnit4ClassRunner.runChild(BlockJUnit4ClassRunner.java:50) [junit-4.11.jar:]
	at org.junit.runners.ParentRunner$3.run(ParentRunner.java:238) [junit-4.11.jar:]
	at org.junit.runners.ParentRunner$1.schedule(ParentRunner.java:63) [junit-4.11.jar:]
	at org.junit.runners.ParentRunner.runChildren(ParentRunner.java:236) [junit-4.11.jar:]
	at org.junit.runners.ParentRunner.access$000(ParentRunner.java:53) [junit-4.11.jar:]
	at org.junit.runners.ParentRunner$2.evaluate(ParentRunner.java:229) [junit-4.11.jar:]
	at org.junit.runners.ParentRunner.run(ParentRunner.java:309) [junit-4.11.jar:]
	at org.apache.maven.surefire.junit4.JUnit4Provider.execute(JUnit4Provider.java:283) [surefire-junit4-2.18.1.jar:2.18.1]
	at org.apache.maven.surefire.junit4.JUnit4Provider.executeWithRerun(JUnit4Provider.java:173)
[surefire-junit4-2.18.1.jar:2.18.1]
	at org.apache.maven.surefire.junit4.JUnit4Provider.executeTestSet(JUnit4Provider.java:153)
[surefire-junit4-2.18.1.jar:2.18.1]
	at org.apache.maven.surefire.junit4.JUnit4Provider.invoke(JUnit4Provider.java:128) [surefire-junit4-2.18.1.jar:2.18.1]
	at org.apache.maven.surefire.booter.ForkedBooter.invokeProviderInSameClassLoader(ForkedBooter.java:203)
[surefire-booter-2.18.1.jar:2.18.1]
	at org.apache.maven.surefire.booter.ForkedBooter.runSuitesInProcess(ForkedBooter.java:155)
[surefire-booter-2.18.1.jar:2.18.1]
	at org.apache.maven.surefire.booter.ForkedBooter.main(ForkedBooter.java:103) [surefire-booter-2.18.1.jar:2.18.1]
Caused by: org.apache.activemq.artemis.selector.strict.TokenMgrError: Lexical error at line
1, column 13.  Encountered: <EOF> after : "\'red"
	at org.apache.activemq.artemis.selector.strict.StrictParserTokenManager.getNextToken(StrictParserTokenManager.java:1050)
[artemis-selector-2.2.0-SNAPSHOT.jar:2.2.0-SNAPSHOT]
	at org.apache.activemq.artemis.selector.strict.StrictParser.jj_scan_token(StrictParser.java:1130)
[artemis-selector-2.2.0-SNAPSHOT.jar:2.2.0-SNAPSHOT]
	at org.apache.activemq.artemis.selector.strict.StrictParser.jj_3_6(StrictParser.java:803)
[artemis-selector-2.2.0-SNAPSHOT.jar:2.2.0-SNAPSHOT]
	at org.apache.activemq.artemis.selector.strict.StrictParser.jj_2_6(StrictParser.java:550)
[artemis-selector-2.2.0-SNAPSHOT.jar:2.2.0-SNAPSHOT]
	at org.apache.activemq.artemis.selector.strict.StrictParser.unaryExpr(StrictParser.java:372)
[artemis-selector-2.2.0-SNAPSHOT.jar:2.2.0-SNAPSHOT]
	at org.apache.activemq.artemis.selector.strict.StrictParser.multExpr(StrictParser.java:332)
[artemis-selector-2.2.0-SNAPSHOT.jar:2.2.0-SNAPSHOT]
	at org.apache.activemq.artemis.selector.strict.StrictParser.addExpression(StrictParser.java:301)
[artemis-selector-2.2.0-SNAPSHOT.jar:2.2.0-SNAPSHOT]
	at org.apache.activemq.artemis.selector.strict.StrictParser.comparisonExpression(StrictParser.java:153)
[artemis-selector-2.2.0-SNAPSHOT.jar:2.2.0-SNAPSHOT]
	at org.apache.activemq.artemis.selector.strict.StrictParser.equalityExpression(StrictParser.java:113)
[artemis-selector-2.2.0-SNAPSHOT.jar:2.2.0-SNAPSHOT]
	at org.apache.activemq.artemis.selector.strict.StrictParser.andExpression(StrictParser.java:77)
[artemis-selector-2.2.0-SNAPSHOT.jar:2.2.0-SNAPSHOT]
	at org.apache.activemq.artemis.selector.strict.StrictParser.orExpression(StrictParser.java:56)
[artemis-selector-2.2.0-SNAPSHOT.jar:2.2.0-SNAPSHOT]
	at org.apache.activemq.artemis.selector.strict.StrictParser.JmsSelector(StrictParser.java:47)
[artemis-selector-2.2.0-SNAPSHOT.jar:2.2.0-SNAPSHOT]
	at org.apache.activemq.artemis.selector.impl.SelectorParser.parse(SelectorParser.java:81)
[artemis-selector-2.2.0-SNAPSHOT.jar:2.2.0-SNAPSHOT]
	... 30 more

[main] 16:17:39,709 ERROR [org.apache.activemq.artemis.core.server] AMQ224006: Invalid filter:
color = 'red: org.apache.activemq.artemis.selector.filter.FilterException: color = 'red
	at org.apache.activemq.artemis.selector.impl.SelectorParser.parse(SelectorParser.java:86)
[artemis-selector-2.2.0-SNAPSHOT.jar:2.2.0-SNAPSHOT]
	at org.apache.activemq.artemis.core.filter.impl.FilterImpl.createFilter(FilterImpl.java:80)
[:]
	at org.apache.activemq.artemis.core.filter.impl.FilterImpl.createFilter(FilterImpl.java:66)
[:]
	at org.apache.activemq.artemis.core.filter.impl.FilterTest.testInvalidFilter(FilterTest.java:705)
[:]
	at org.apache.activemq.artemis.core.filter.impl.FilterTest.testInvalidString(FilterTest.java:68)
[:]
	at sun.reflect.NativeMethodAccessorImpl.invoke0(Native Method) [rt.jar:1.8.0_121]
	at sun.reflect.NativeMethodAccessorImpl.invoke(NativeMethodAccessorImpl.java:62) [rt.jar:1.8.0_121]
	at sun.reflect.DelegatingMethodAccessorImpl.invoke(DelegatingMethodAccessorImpl.java:43)
[rt.jar:1.8.0_121]
	at java.lang.reflect.Method.invoke(Method.java:498) [rt.jar:1.8.0_121]
	at org.junit.runners.model.FrameworkMethod$1.runReflectiveCall(FrameworkMethod.java:47) [junit-4.11.jar:]
	at org.junit.internal.runners.model.ReflectiveCallable.run(ReflectiveCallable.java:12) [junit-4.11.jar:]
	at org.junit.runners.model.FrameworkMethod.invokeExplosively(FrameworkMethod.java:44) [junit-4.11.jar:]
	at org.junit.internal.runners.statements.InvokeMethod.evaluate(InvokeMethod.java:17) [junit-4.11.jar:]
	at org.junit.internal.runners.statements.RunBefores.evaluate(RunBefores.java:26) [junit-4.11.jar:]
	at org.junit.internal.runners.statements.RunAfters.evaluate(RunAfters.java:27) [junit-4.11.jar:]
	at org.junit.runners.ParentRunner.runLeaf(ParentRunner.java:271) [junit-4.11.jar:]
	at org.junit.runners.BlockJUnit4ClassRunner.runChild(BlockJUnit4ClassRunner.java:70) [junit-4.11.jar:]
	at org.junit.runners.BlockJUnit4ClassRunner.runChild(BlockJUnit4ClassRunner.java:50) [junit-4.11.jar:]
	at org.junit.runners.ParentRunner$3.run(ParentRunner.java:238) [junit-4.11.jar:]
	at org.junit.runners.ParentRunner$1.schedule(ParentRunner.java:63) [junit-4.11.jar:]
	at org.junit.runners.ParentRunner.runChildren(ParentRunner.java:236) [junit-4.11.jar:]
	at org.junit.runners.ParentRunner.access$000(ParentRunner.java:53) [junit-4.11.jar:]
	at org.junit.runners.ParentRunner$2.evaluate(ParentRunner.java:229) [junit-4.11.jar:]
	at org.junit.runners.ParentRunner.run(ParentRunner.java:309) [junit-4.11.jar:]
	at org.apache.maven.surefire.junit4.JUnit4Provider.execute(JUnit4Provider.java:283) [surefire-junit4-2.18.1.jar:2.18.1]
	at org.apache.maven.surefire.junit4.JUnit4Provider.executeWithRerun(JUnit4Provider.java:173)
[surefire-junit4-2.18.1.jar:2.18.1]
	at org.apache.maven.surefire.junit4.JUnit4Provider.executeTestSet(JUnit4Provider.java:153)
[surefire-junit4-2.18.1.jar:2.18.1]
	at org.apache.maven.surefire.junit4.JUnit4Provider.invoke(JUnit4Provider.java:128) [surefire-junit4-2.18.1.jar:2.18.1]
	at org.apache.maven.surefire.booter.ForkedBooter.invokeProviderInSameClassLoader(ForkedBooter.java:203)
[surefire-booter-2.18.1.jar:2.18.1]
	at org.apache.maven.surefire.booter.ForkedBooter.runSuitesInProcess(ForkedBooter.java:155)
[surefire-booter-2.18.1.jar:2.18.1]
	at org.apache.maven.surefire.booter.ForkedBooter.main(ForkedBooter.java:103) [surefire-booter-2.18.1.jar:2.18.1]
Caused by: org.apache.activemq.artemis.selector.strict.TokenMgrError: Lexical error at line
1, column 13.  Encountered: <EOF> after : "\'red"
	at org.apache.activemq.artemis.selector.strict.StrictParserTokenManager.getNextToken(StrictParserTokenManager.java:1050)
[artemis-selector-2.2.0-SNAPSHOT.jar:2.2.0-SNAPSHOT]
	at org.apache.activemq.artemis.selector.strict.StrictParser.jj_scan_token(StrictParser.java:1130)
[artemis-selector-2.2.0-SNAPSHOT.jar:2.2.0-SNAPSHOT]
	at org.apache.activemq.artemis.selector.strict.StrictParser.jj_3_6(StrictParser.java:803)
[artemis-selector-2.2.0-SNAPSHOT.jar:2.2.0-SNAPSHOT]
	at org.apache.activemq.artemis.selector.strict.StrictParser.jj_2_6(StrictParser.java:550)
[artemis-selector-2.2.0-SNAPSHOT.jar:2.2.0-SNAPSHOT]
	at org.apache.activemq.artemis.selector.strict.StrictParser.unaryExpr(StrictParser.java:372)
[artemis-selector-2.2.0-SNAPSHOT.jar:2.2.0-SNAPSHOT]
	at org.apache.activemq.artemis.selector.strict.StrictParser.multExpr(StrictParser.java:332)
[artemis-selector-2.2.0-SNAPSHOT.jar:2.2.0-SNAPSHOT]
	at org.apache.activemq.artemis.selector.strict.StrictParser.addExpression(StrictParser.java:301)
[artemis-selector-2.2.0-SNAPSHOT.jar:2.2.0-SNAPSHOT]
	at org.apache.activemq.artemis.selector.strict.StrictParser.comparisonExpression(StrictParser.java:153)
[artemis-selector-2.2.0-SNAPSHOT.jar:2.2.0-SNAPSHOT]
	at org.apache.activemq.artemis.selector.strict.StrictParser.equalityExpression(StrictParser.java:113)
[artemis-selector-2.2.0-SNAPSHOT.jar:2.2.0-SNAPSHOT]
	at org.apache.activemq.artemis.selector.strict.StrictParser.andExpression(StrictParser.java:77)
[artemis-selector-2.2.0-SNAPSHOT.jar:2.2.0-SNAPSHOT]
	at org.apache.activemq.artemis.selector.strict.StrictParser.orExpression(StrictParser.java:56)
[artemis-selector-2.2.0-SNAPSHOT.jar:2.2.0-SNAPSHOT]
	at org.apache.activemq.artemis.selector.strict.StrictParser.JmsSelector(StrictParser.java:47)
[artemis-selector-2.2.0-SNAPSHOT.jar:2.2.0-SNAPSHOT]
	at org.apache.activemq.artemis.selector.impl.SelectorParser.parse(SelectorParser.java:81)
[artemis-selector-2.2.0-SNAPSHOT.jar:2.2.0-SNAPSHOT]
	... 30 more

[main] 16:17:39,710 ERROR [org.apache.activemq.artemis.core.server] AMQ224006: Invalid filter:
3: org.apache.activemq.artemis.selector.filter.FilterException: 3
	at org.apache.activemq.artemis.selector.impl.SelectorParser.parse(SelectorParser.java:86)
[artemis-selector-2.2.0-SNAPSHOT.jar:2.2.0-SNAPSHOT]
	at org.apache.activemq.artemis.core.filter.impl.FilterImpl.createFilter(FilterImpl.java:80)
[:]
	at org.apache.activemq.artemis.core.filter.impl.FilterImpl.createFilter(FilterImpl.java:66)
[:]
	at org.apache.activemq.artemis.core.filter.impl.FilterTest.testInvalidFilter(FilterTest.java:705)
[:]
	at org.apache.activemq.artemis.core.filter.impl.FilterTest.testInvalidString(FilterTest.java:71)
[:]
	at sun.reflect.NativeMethodAccessorImpl.invoke0(Native Method) [rt.jar:1.8.0_121]
	at sun.reflect.NativeMethodAccessorImpl.invoke(NativeMethodAccessorImpl.java:62) [rt.jar:1.8.0_121]
	at sun.reflect.DelegatingMethodAccessorImpl.invoke(DelegatingMethodAccessorImpl.java:43)
[rt.jar:1.8.0_121]
	at java.lang.reflect.Method.invoke(Method.java:498) [rt.jar:1.8.0_121]
	at org.junit.runners.model.FrameworkMethod$1.runReflectiveCall(FrameworkMethod.java:47) [junit-4.11.jar:]
	at org.junit.internal.runners.model.ReflectiveCallable.run(ReflectiveCallable.java:12) [junit-4.11.jar:]
	at org.junit.runners.model.FrameworkMethod.invokeExplosively(FrameworkMethod.java:44) [junit-4.11.jar:]
	at org.junit.internal.runners.statements.InvokeMethod.evaluate(InvokeMethod.java:17) [junit-4.11.jar:]
	at org.junit.internal.runners.statements.RunBefores.evaluate(RunBefores.java:26) [junit-4.11.jar:]
	at org.junit.internal.runners.statements.RunAfters.evaluate(RunAfters.java:27) [junit-4.11.jar:]
	at org.junit.runners.ParentRunner.runLeaf(ParentRunner.java:271) [junit-4.11.jar:]
	at org.junit.runners.BlockJUnit4ClassRunner.runChild(BlockJUnit4ClassRunner.java:70) [junit-4.11.jar:]
	at org.junit.runners.BlockJUnit4ClassRunner.runChild(BlockJUnit4ClassRunner.java:50) [junit-4.11.jar:]
	at org.junit.runners.ParentRunner$3.run(ParentRunner.java:238) [junit-4.11.jar:]
	at org.junit.runners.ParentRunner$1.schedule(ParentRunner.java:63) [junit-4.11.jar:]
	at org.junit.runners.ParentRunner.runChildren(ParentRunner.java:236) [junit-4.11.jar:]
	at org.junit.runners.ParentRunner.access$000(ParentRunner.java:53) [junit-4.11.jar:]
	at org.junit.runners.ParentRunner$2.evaluate(ParentRunner.java:229) [junit-4.11.jar:]
	at org.junit.runners.ParentRunner.run(ParentRunner.java:309) [junit-4.11.jar:]
	at org.apache.maven.surefire.junit4.JUnit4Provider.execute(JUnit4Provider.java:283) [surefire-junit4-2.18.1.jar:2.18.1]
	at org.apache.maven.surefire.junit4.JUnit4Provider.executeWithRerun(JUnit4Provider.java:173)
[surefire-junit4-2.18.1.jar:2.18.1]
	at org.apache.maven.surefire.junit4.JUnit4Provider.executeTestSet(JUnit4Provider.java:153)
[surefire-junit4-2.18.1.jar:2.18.1]
	at org.apache.maven.surefire.junit4.JUnit4Provider.invoke(JUnit4Provider.java:128) [surefire-junit4-2.18.1.jar:2.18.1]
	at org.apache.maven.surefire.booter.ForkedBooter.invokeProviderInSameClassLoader(ForkedBooter.java:203)
[surefire-booter-2.18.1.jar:2.18.1]
	at org.apache.maven.surefire.booter.ForkedBooter.runSuitesInProcess(ForkedBooter.java:155)
[surefire-booter-2.18.1.jar:2.18.1]
	at org.apache.maven.surefire.booter.ForkedBooter.main(ForkedBooter.java:103) [surefire-booter-2.18.1.jar:2.18.1]
Caused by: org.apache.activemq.artemis.selector.strict.ParseException: Expression will not
result in a boolean value: 3
	at org.apache.activemq.artemis.selector.strict.StrictParser.asBooleanExpression(StrictParser.java:39)
[artemis-selector-2.2.0-SNAPSHOT.jar:2.2.0-SNAPSHOT]
	at org.apache.activemq.artemis.selector.strict.StrictParser.JmsSelector(StrictParser.java:49)
[artemis-selector-2.2.0-SNAPSHOT.jar:2.2.0-SNAPSHOT]
	at org.apache.activemq.artemis.selector.impl.SelectorParser.parse(SelectorParser.java:81)
[artemis-selector-2.2.0-SNAPSHOT.jar:2.2.0-SNAPSHOT]
	... 30 more

[main] 16:17:39,711 ERROR [org.apache.activemq.artemis.core.server] AMQ224006: Invalid filter:
3: org.apache.activemq.artemis.selector.filter.FilterException: 3
	at org.apache.activemq.artemis.selector.impl.SelectorParser.parse(SelectorParser.java:86)
[artemis-selector-2.2.0-SNAPSHOT.jar:2.2.0-SNAPSHOT]
	at org.apache.activemq.artemis.core.filter.impl.FilterImpl.createFilter(FilterImpl.java:80)
[:]
	at org.apache.activemq.artemis.core.filter.impl.FilterImpl.createFilter(FilterImpl.java:66)
[:]
	at org.apache.activemq.artemis.core.filter.impl.FilterTest.testInvalidFilter(FilterTest.java:705)
[:]
	at org.apache.activemq.artemis.core.filter.impl.FilterTest.testInvalidString(FilterTest.java:71)
[:]
	at sun.reflect.NativeMethodAccessorImpl.invoke0(Native Method) [rt.jar:1.8.0_121]
	at sun.reflect.NativeMethodAccessorImpl.invoke(NativeMethodAccessorImpl.java:62) [rt.jar:1.8.0_121]
	at sun.reflect.DelegatingMethodAccessorImpl.invoke(DelegatingMethodAccessorImpl.java:43)
[rt.jar:1.8.0_121]
	at java.lang.reflect.Method.invoke(Method.java:498) [rt.jar:1.8.0_121]
	at org.junit.runners.model.FrameworkMethod$1.runReflectiveCall(FrameworkMethod.java:47) [junit-4.11.jar:]
	at org.junit.internal.runners.model.ReflectiveCallable.run(ReflectiveCallable.java:12) [junit-4.11.jar:]
	at org.junit.runners.model.FrameworkMethod.invokeExplosively(FrameworkMethod.java:44) [junit-4.11.jar:]
	at org.junit.internal.runners.statements.InvokeMethod.evaluate(InvokeMethod.java:17) [junit-4.11.jar:]
	at org.junit.internal.runners.statements.RunBefores.evaluate(RunBefores.java:26) [junit-4.11.jar:]
	at org.junit.internal.runners.statements.RunAfters.evaluate(RunAfters.java:27) [junit-4.11.jar:]
	at org.junit.runners.ParentRunner.runLeaf(ParentRunner.java:271) [junit-4.11.jar:]
	at org.junit.runners.BlockJUnit4ClassRunner.runChild(BlockJUnit4ClassRunner.java:70) [junit-4.11.jar:]
	at org.junit.runners.BlockJUnit4ClassRunner.runChild(BlockJUnit4ClassRunner.java:50) [junit-4.11.jar:]
	at org.junit.runners.ParentRunner$3.run(ParentRunner.java:238) [junit-4.11.jar:]
	at org.junit.runners.ParentRunner$1.schedule(ParentRunner.java:63) [junit-4.11.jar:]
	at org.junit.runners.ParentRunner.runChildren(ParentRunner.java:236) [junit-4.11.jar:]
	at org.junit.runners.ParentRunner.access$000(ParentRunner.java:53) [junit-4.11.jar:]
	at org.junit.runners.ParentRunner$2.evaluate(ParentRunner.java:229) [junit-4.11.jar:]
	at org.junit.runners.ParentRunner.run(ParentRunner.java:309) [junit-4.11.jar:]
	at org.apache.maven.surefire.junit4.JUnit4Provider.execute(JUnit4Provider.java:283) [surefire-junit4-2.18.1.jar:2.18.1]
	at org.apache.maven.surefire.junit4.JUnit4Provider.executeWithRerun(JUnit4Provider.java:173)
[surefire-junit4-2.18.1.jar:2.18.1]
	at org.apache.maven.surefire.junit4.JUnit4Provider.executeTestSet(JUnit4Provider.java:153)
[surefire-junit4-2.18.1.jar:2.18.1]
	at org.apache.maven.surefire.junit4.JUnit4Provider.invoke(JUnit4Provider.java:128) [surefire-junit4-2.18.1.jar:2.18.1]
	at org.apache.maven.surefire.booter.ForkedBooter.invokeProviderInSameClassLoader(ForkedBooter.java:203)
[surefire-booter-2.18.1.jar:2.18.1]
	at org.apache.maven.surefire.booter.ForkedBooter.runSuitesInProcess(ForkedBooter.java:155)
[surefire-booter-2.18.1.jar:2.18.1]
	at org.apache.maven.surefire.booter.ForkedBooter.main(ForkedBooter.java:103) [surefire-booter-2.18.1.jar:2.18.1]
Caused by: org.apache.activemq.artemis.selector.strict.ParseException: Expression will not
result in a boolean value: 3
	at org.apache.activemq.artemis.selector.strict.StrictParser.asBooleanExpression(StrictParser.java:39)
[artemis-selector-2.2.0-SNAPSHOT.jar:2.2.0-SNAPSHOT]
	at org.apache.activemq.artemis.selector.strict.StrictParser.JmsSelector(StrictParser.java:49)
[artemis-selector-2.2.0-SNAPSHOT.jar:2.2.0-SNAPSHOT]
	at org.apache.activemq.artemis.selector.impl.SelectorParser.parse(SelectorParser.java:81)
[artemis-selector-2.2.0-SNAPSHOT.jar:2.2.0-SNAPSHOT]
	... 30 more

Tests run: 21, Failures: 0, Errors: 0, Skipped: 0, Time elapsed: 0.183 sec - in org.apache.activemq.artemis.core.filter.impl.FilterTest
Running org.apache.activemq.artemis.core.list.PriorityLinkedListTest
Tests run: 11, Failures: 0, Errors: 0, Skipped: 0, Time elapsed: 0.018 sec - in org.apache.activemq.artemis.core.list.PriorityLinkedListTest
Running org.apache.activemq.artemis.core.message.impl.MessagePropertyTest
[main] 16:17:39,763 INFO  [org.apache.activemq.artemis.core.server] #*#*# Starting test: testProperties()...
#test testProperties
[main] 16:17:39,852 INFO  [org.apache.activemq.artemis.core.server] AMQ221000: live Message
Broker is starting with configuration Broker Configuration (clustered=false,journalDirectory=<https://builds.apache.org/job/ActiveMQ-Artemis-Master/ws/artemis-server/./target/tmp/junit4227446633757158005/journal0-L,bindingsDirectory=/home/jenkins/jenkins-slave/workspace/ActiveMQ-Artemis-Master/artemis-server/./target/tmp/junit4227446633757158005/bindings0-L,largeMessagesDirectory=/home/jenkins/jenkins-slave/workspace/ActiveMQ-Artemis-Master/artemis-server/./target/tmp/junit4227446633757158005/large-msg0-L,pagingDirectory=/home/jenkins/jenkins-slave/workspace/ActiveMQ-Artemis-Master/artemis-server/./target/tmp/junit4227446633757158005/page0-L)>
[main] 16:17:39,853 INFO  [org.apache.activemq.artemis.core.server] AMQ221012: Using AIO Journal
[main] 16:17:39,853 INFO  [org.apache.activemq.artemis.core.server] AMQ221043: Protocol module
found: [artemis-server]. Adding protocol support for: CORE
[main] 16:17:39,887 INFO  [org.apache.activemq.artemis.core.server] AMQ221034: Waiting indefinitely
to obtain live lock
[main] 16:17:39,887 INFO  [org.apache.activemq.artemis.core.server] AMQ221035: Live Server
Obtained live lock
[main] 16:17:39,966 INFO  [org.apache.activemq.artemis.core.server] AMQ221007: Server is now
live
[main] 16:17:39,966 INFO  [org.apache.activemq.artemis.core.server] AMQ221001: Apache ActiveMQ
Artemis Message Broker version 2.2.0-SNAPSHOT [localhost, nodeID=5aa5522f-3665-11e7-b1c9-02424ee64064]

Build step 'Invoke top-level Maven targets' marked build as failure
Performing Post build task...
Could not match :Too many files with unapproved license  : False
Logical operation result is FALSE
Skipping script  : cat ratReport.txt
END OF POST BUILD TASK 	: 0
Recording test results

Mime
View raw message