activemq-commits mailing list archives

Site index · List index
Message view « Date » · « Thread »
Top « Date » · « Thread »
From Apache Jenkins Server <jenk...@builds.apache.org>
Subject Build failed in Jenkins: ActiveMQ-Java8-5.14.x #47
Date Thu, 06 Apr 2017 17:07:48 GMT
See <https://builds.apache.org/job/ActiveMQ-Java8-5.14.x/47/display/redirect?page=changes>

Changes:

[tabish121] https://issues.apache.org/jira/browse/AMQ-6638

------------------------------------------
[...truncated 852.88 KB...]
[INFO] Surefire report directory: <https://builds.apache.org/job/ActiveMQ-Java8-5.14.x/ws/activemq-itests-spring31/target/surefire-reports>

-------------------------------------------------------
 T E S T S
-------------------------------------------------------
Running org.apache.activemq.itest.spring31.ActiveMQSpringProfile31Test
Tests run: 1, Failures: 0, Errors: 0, Skipped: 1, Time elapsed: 0.016 sec - in org.apache.activemq.itest.spring31.ActiveMQSpringProfile31Test
Running org.apache.activemq.itest.spring31.ActiveMQSpring31Test
Tests run: 1, Failures: 0, Errors: 0, Skipped: 0, Time elapsed: 1.097 sec - in org.apache.activemq.itest.spring31.ActiveMQSpring31Test

Results :

Tests run: 2, Failures: 0, Errors: 0, Skipped: 1

[JENKINS] Recording test results
[INFO] 
[INFO] --- maven-jar-plugin:2.4:jar (default-jar) @ activemq-itests-spring31 ---
[INFO] Building jar: <https://builds.apache.org/job/ActiveMQ-Java8-5.14.x/ws/activemq-itests-spring31/target/activemq-itests-spring31-5.14.5-SNAPSHOT.jar>
[INFO] 
[INFO] --- maven-site-plugin:3.4:attach-descriptor (attach-descriptor) @ activemq-itests-spring31
---
[INFO] 
[INFO] --- ianal-maven-plugin:1.0-alpha-1:verify-legal-files (default) @ activemq-itests-spring31
---
[INFO] Checking legal files in: activemq-itests-spring31-5.14.5-SNAPSHOT.jar
[INFO] 
[INFO] --- maven-install-plugin:2.5.2:install (default-install) @ activemq-itests-spring31
---
[INFO] Installing <https://builds.apache.org/job/ActiveMQ-Java8-5.14.x/ws/activemq-itests-spring31/target/activemq-itests-spring31-5.14.5-SNAPSHOT.jar>
to /home/jenkins/jenkins-slave/maven-repositories/1/org/apache/activemq/activemq-itests-spring31/5.14.5-SNAPSHOT/activemq-itests-spring31-5.14.5-SNAPSHOT.jar
[INFO] Installing <https://builds.apache.org/job/ActiveMQ-Java8-5.14.x/ws/activemq-itests-spring31/pom.xml>
to /home/jenkins/jenkins-slave/maven-repositories/1/org/apache/activemq/activemq-itests-spring31/5.14.5-SNAPSHOT/activemq-itests-spring31-5.14.5-SNAPSHOT.pom
[INFO] 
[INFO] >>> maven-source-plugin:2.4:jar (default-cli) > generate-sources @ activemq-itests-spring31
>>>
[INFO] 
[INFO] --- maven-enforcer-plugin:1.3.1:enforce (default) @ activemq-itests-spring31 ---
[INFO] 
[INFO] --- maven-bundle-plugin:2.3.7:cleanVersions (cleanVersions) @ activemq-itests-spring31
---
[WARNING] Failed to getClass for org.apache.maven.plugin.source.SourceJarMojo
[INFO] 
[INFO] <<< maven-source-plugin:2.4:jar (default-cli) < generate-sources @ activemq-itests-spring31
<<<
[INFO] 
[INFO] --- maven-source-plugin:2.4:jar (default-cli) @ activemq-itests-spring31 ---
[INFO] Building jar: <https://builds.apache.org/job/ActiveMQ-Java8-5.14.x/ws/activemq-itests-spring31/target/activemq-itests-spring31-5.14.5-SNAPSHOT-sources.jar>
[INFO]                                                                         
[INFO] ------------------------------------------------------------------------
[INFO] Building ActiveMQ :: Assembly 5.14.5-SNAPSHOT
[INFO] ------------------------------------------------------------------------
[INFO] 
[INFO] --- maven-clean-plugin:2.5:clean (default-clean) @ apache-activemq ---
[INFO] 
[INFO] --- maven-enforcer-plugin:1.3.1:enforce (default) @ apache-activemq ---
[INFO] 
[INFO] --- maven-bundle-plugin:2.3.7:cleanVersions (cleanVersions) @ apache-activemq ---
[INFO] 
[INFO] --- maven-remote-resources-plugin:1.5:process (default) @ apache-activemq ---
[INFO] 
[INFO] --- maven-resources-plugin:2.7:copy-resources (copy-conf) @ apache-activemq ---
[INFO] Using 'UTF-8' encoding to copy filtered resources.
[INFO] Copying 18 resources
[INFO] Copying 20 resources
[INFO] 
[INFO] --- maven-compiler-plugin:3.3:testCompile (validate-config) @ apache-activemq ---
[INFO] Changes detected - recompiling the module!
[INFO] Compiling 7 source files to <https://builds.apache.org/job/ActiveMQ-Java8-5.14.x/ws/assembly/target/test-classes>
[WARNING] bootstrap class path not set in conjunction with -source 1.7
[INFO] 
[INFO] --- maven-surefire-plugin:2.16:test (validate-config) @ apache-activemq ---
[INFO] Surefire report directory: <https://builds.apache.org/job/ActiveMQ-Java8-5.14.x/ws/assembly/target/surefire-reports>

-------------------------------------------------------
 T E S T S
-------------------------------------------------------

-------------------------------------------------------
 T E S T S
-------------------------------------------------------
Running org.apache.activemq.config.ValidateXMLConfigTest
Tests run: 2, Failures: 0, Errors: 0, Skipped: 0, Time elapsed: 2.996 sec - in org.apache.activemq.config.ValidateXMLConfigTest
Running org.apache.activemq.config.BrokerXmlConfigStartTest
Tests run: 15, Failures: 0, Errors: 0, Skipped: 0, Time elapsed: 74.565 sec - in org.apache.activemq.config.BrokerXmlConfigStartTest

Results :

Tests run: 17, Failures: 0, Errors: 0, Skipped: 0

[JENKINS] Recording test results
[INFO] 
[INFO] --- maven-site-plugin:3.4:attach-descriptor (attach-descriptor) @ apache-activemq ---
[INFO] 
[INFO] --- maven-dependency-plugin:2.8:unpack-dependencies (unpack) @ apache-activemq ---
[INFO] Unpacking <https://builds.apache.org/job/ActiveMQ-Java8-5.14.x/ws/activemq-console/target/activemq-console-5.14.5-SNAPSHOT.jar>
to <https://builds.apache.org/job/ActiveMQ-Java8-5.14.x/ws/assembly/target/classes>
with includes "" and excludes ""
[INFO] 
[INFO] --- maven-assembly-plugin:2.4:attached (unix-bin) @ apache-activemq ---
[INFO] Reading assembly descriptor: src/main/descriptors/unix-bin.xml
[WARNING] Cannot include project artifact: org.apache.activemq:apache-activemq:pom:5.14.5-SNAPSHOT;
it doesn't have an associated file or directory.
[WARNING] Cannot include project artifact: org.apache.activemq:apache-activemq:pom:5.14.5-SNAPSHOT;
it doesn't have an associated file or directory.
[WARNING] Cannot include project artifact: org.apache.activemq:apache-activemq:pom:5.14.5-SNAPSHOT;
it doesn't have an associated file or directory.
[WARNING] Cannot include project artifact: org.apache.activemq:apache-activemq:pom:5.14.5-SNAPSHOT;
it doesn't have an associated file or directory.
[WARNING] Cannot include project artifact: org.apache.activemq:apache-activemq:pom:5.14.5-SNAPSHOT;
it doesn't have an associated file or directory.
[WARNING] The following patterns were never triggered in this artifact inclusion filter:
o  'org.apache.qpid:proton-jms'

[WARNING] Cannot include project artifact: org.apache.activemq:apache-activemq:pom:5.14.5-SNAPSHOT;
it doesn't have an associated file or directory.
[WARNING] The following patterns were never triggered in this artifact inclusion filter:
o  'org.apache.activemq.tooling:activemq-junit'

[WARNING] Cannot include project artifact: org.apache.activemq:apache-activemq:pom:5.14.5-SNAPSHOT;
it doesn't have an associated file or directory.
[INFO] Building tar: <https://builds.apache.org/job/ActiveMQ-Java8-5.14.x/ws/assembly/target/apache-activemq-5.14.5-SNAPSHOT-bin.tar.gz>
[INFO] 
[INFO] --- maven-assembly-plugin:2.4:attached (windows-bin) @ apache-activemq ---
[INFO] Reading assembly descriptor: src/main/descriptors/windows-bin.xml
[WARNING] Cannot include project artifact: org.apache.activemq:apache-activemq:pom:5.14.5-SNAPSHOT;
it doesn't have an associated file or directory.
[WARNING] Cannot include project artifact: org.apache.activemq:apache-activemq:pom:5.14.5-SNAPSHOT;
it doesn't have an associated file or directory.
[WARNING] Cannot include project artifact: org.apache.activemq:apache-activemq:pom:5.14.5-SNAPSHOT;
it doesn't have an associated file or directory.
[WARNING] Cannot include project artifact: org.apache.activemq:apache-activemq:pom:5.14.5-SNAPSHOT;
it doesn't have an associated file or directory.
[WARNING] Cannot include project artifact: org.apache.activemq:apache-activemq:pom:5.14.5-SNAPSHOT;
it doesn't have an associated file or directory.
[WARNING] The following patterns were never triggered in this artifact inclusion filter:
o  'org.apache.qpid:proton-jms'

[WARNING] Cannot include project artifact: org.apache.activemq:apache-activemq:pom:5.14.5-SNAPSHOT;
it doesn't have an associated file or directory.
[WARNING] The following patterns were never triggered in this artifact inclusion filter:
o  'org.apache.activemq.tooling:activemq-junit'

[WARNING] Cannot include project artifact: org.apache.activemq:apache-activemq:pom:5.14.5-SNAPSHOT;
it doesn't have an associated file or directory.
[INFO] Building zip: <https://builds.apache.org/job/ActiveMQ-Java8-5.14.x/ws/assembly/target/apache-activemq-5.14.5-SNAPSHOT-bin.zip>
[INFO] 
[INFO] --- ianal-maven-plugin:1.0-alpha-1:verify-legal-files (default) @ apache-activemq ---
[INFO] Checking legal files in: apache-activemq-5.14.5-SNAPSHOT-bin.zip
[INFO] 
[INFO] --- maven-install-plugin:2.5.2:install (default-install) @ apache-activemq ---
[INFO] Installing <https://builds.apache.org/job/ActiveMQ-Java8-5.14.x/ws/assembly/pom.xml>
to /home/jenkins/jenkins-slave/maven-repositories/1/org/apache/activemq/apache-activemq/5.14.5-SNAPSHOT/apache-activemq-5.14.5-SNAPSHOT.pom
[INFO] Installing <https://builds.apache.org/job/ActiveMQ-Java8-5.14.x/ws/assembly/target/apache-activemq-5.14.5-SNAPSHOT-bin.tar.gz>
to /home/jenkins/jenkins-slave/maven-repositories/1/org/apache/activemq/apache-activemq/5.14.5-SNAPSHOT/apache-activemq-5.14.5-SNAPSHOT-bin.tar.gz
[INFO] Installing <https://builds.apache.org/job/ActiveMQ-Java8-5.14.x/ws/assembly/target/apache-activemq-5.14.5-SNAPSHOT-bin.zip>
to /home/jenkins/jenkins-slave/maven-repositories/1/org/apache/activemq/apache-activemq/5.14.5-SNAPSHOT/apache-activemq-5.14.5-SNAPSHOT-bin.zip
[INFO] 
[INFO] >>> maven-source-plugin:2.4:jar (default-cli) > generate-sources @ apache-activemq
>>>
[INFO] 
[INFO] --- maven-enforcer-plugin:1.3.1:enforce (default) @ apache-activemq ---
[INFO] 
[INFO] --- maven-bundle-plugin:2.3.7:cleanVersions (cleanVersions) @ apache-activemq ---
[WARNING] Failed to getClass for org.apache.maven.plugin.source.SourceJarMojo
[INFO] 
[INFO] <<< maven-source-plugin:2.4:jar (default-cli) < generate-sources @ apache-activemq
<<<
[INFO] 
[INFO] --- maven-source-plugin:2.4:jar (default-cli) @ apache-activemq ---
[INFO] ------------------------------------------------------------------------
[INFO] Reactor Summary:
[INFO] 
[INFO] ActiveMQ ........................................... SUCCESS [  2.856 s]
[INFO] ActiveMQ :: Openwire Generator ..................... SUCCESS [  4.095 s]
[INFO] ActiveMQ :: Client ................................. SUCCESS [01:39 min]
[INFO] ActiveMQ :: Openwire Legacy Support ................ SUCCESS [  3.241 s]
[INFO] ActiveMQ :: JAAS ................................... SUCCESS [ 31.302 s]
[INFO] ActiveMQ :: Broker ................................. SUCCESS [01:18 min]
[INFO] ActiveMQ :: KahaDB Store ........................... SUCCESS [02:09 min]
[INFO] ActiveMQ :: STOMP Protocol ......................... SUCCESS [11:40 min]
[INFO] ActiveMQ :: MQTT Protocol .......................... SUCCESS [21:03 min]
[INFO] ActiveMQ :: JDBC Store ............................. SUCCESS [  3.713 s]
[INFO] ActiveMQ :: LevelDB Store .......................... SUCCESS [04:56 min]
[INFO] ActiveMQ :: Generic JMS Pool ....................... SUCCESS [ 46.000 s]
[INFO] ActiveMQ :: Pool ................................... SUCCESS [  9.332 s]
[INFO] ActiveMQ :: RA ..................................... SUCCESS [02:28 min]
[INFO] ActiveMQ :: Spring ................................. SUCCESS [01:02 min]
[INFO] ActiveMQ :: Console ................................ SUCCESS [  5.166 s]
[INFO] ActiveMQ :: Partition Management ................... SUCCESS [ 18.282 s]
[INFO] ActiveMQ :: Runtime Configuration .................. SUCCESS [08:05 min]
[INFO] ActiveMQ :: Tooling ................................ SUCCESS [  0.921 s]
[INFO] ActiveMQ :: JUnit Rule ............................. SUCCESS [  4.933 s]
[INFO] ActiveMQ :: Unit Tests ............................. SUCCESS [  02:16 h]
[INFO] ActiveMQ :: HTTP Protocol Support .................. SUCCESS [09:38 min]
[INFO] ActiveMQ :: AMQP ................................... SUCCESS [09:45 min]
[INFO] ActiveMQ :: Camel .................................. SUCCESS [04:41 min]
[INFO] ActiveMQ :: All JAR bundle ......................... SUCCESS [  5.589 s]
[INFO] ActiveMQ :: Log4j Appender ......................... SUCCESS [  4.248 s]
[INFO] ActiveMQ :: Apache Karaf ........................... SUCCESS [  5.259 s]
[INFO] ActiveMQ :: ConnectionFactory ...................... SUCCESS [  6.137 s]
[INFO] ActiveMQ :: RAR .................................... SUCCESS [  4.783 s]
[INFO] ActiveMQ :: Run Jar ................................ SUCCESS [  1.422 s]
[INFO] ActiveMQ :: Shiro .................................. SUCCESS [  6.290 s]
[INFO] ActiveMQ :: Memory Usage Test Plugin ............... SUCCESS [  3.349 s]
[INFO] ActiveMQ :: Performance Test Plugin ................ SUCCESS [  7.599 s]
[INFO] ActiveMQ :: StartUp/Stop Plugin .................... SUCCESS [  5.742 s]
[INFO] ActiveMQ :: Web .................................... SUCCESS [ 15.278 s]
[INFO] ActiveMQ :: OSGi bundle ............................ SUCCESS [ 11.863 s]
[INFO] ActiveMQ :: Blueprint .............................. SUCCESS [  3.756 s]
[INFO] ActiveMQ :: Web Demo ............................... SUCCESS [ 26.725 s]
[INFO] ActiveMQ :: Web Console ............................ SUCCESS [  5.549 s]
[INFO] ActiveMQ :: Karaf Integration Tests ................ SUCCESS [06:03 min]
[INFO] ActiveMQ :: Integration Test :: Spring 3.1 ......... SUCCESS [  3.253 s]
[INFO] ActiveMQ :: Assembly ............................... SUCCESS [01:32 min]
[INFO] ------------------------------------------------------------------------
[INFO] BUILD SUCCESS
[INFO] ------------------------------------------------------------------------
[INFO] Total time: 03:47 h
[INFO] Finished at: 2017-04-06T17:00:39+00:00
[INFO] Final Memory: 193M/1844M
[INFO] ------------------------------------------------------------------------
Waiting for Jenkins to finish collecting data
[JENKINS] Archiving <https://builds.apache.org/job/ActiveMQ-Java8-5.14.x/ws/activemq-kahadb-store/pom.xml>
to org.apache.activemq/activemq-kahadb-store/5.14.5-SNAPSHOT/activemq-kahadb-store-5.14.5-SNAPSHOT.pom
[JENKINS] Archiving <https://builds.apache.org/job/ActiveMQ-Java8-5.14.x/ws/activemq-kahadb-store/target/activemq-kahadb-store-5.14.5-SNAPSHOT.jar>
to org.apache.activemq/activemq-kahadb-store/5.14.5-SNAPSHOT/activemq-kahadb-store-5.14.5-SNAPSHOT.jar
[JENKINS] Archiving <https://builds.apache.org/job/ActiveMQ-Java8-5.14.x/ws/activemq-kahadb-store/target/activemq-kahadb-store-5.14.5-SNAPSHOT-sources.jar>
to org.apache.activemq/activemq-kahadb-store/5.14.5-SNAPSHOT/activemq-kahadb-store-5.14.5-SNAPSHOT-sources.jar
[JENKINS] Archiving <https://builds.apache.org/job/ActiveMQ-Java8-5.14.x/ws/activemq-osgi/pom.xml>
to org.apache.activemq/activemq-osgi/5.14.5-SNAPSHOT/activemq-osgi-5.14.5-SNAPSHOT.pom
[JENKINS] Archiving <https://builds.apache.org/job/ActiveMQ-Java8-5.14.x/ws/activemq-osgi/target/activemq-osgi-5.14.5-SNAPSHOT.jar>
to org.apache.activemq/activemq-osgi/5.14.5-SNAPSHOT/activemq-osgi-5.14.5-SNAPSHOT.jar
[JENKINS] Archiving <https://builds.apache.org/job/ActiveMQ-Java8-5.14.x/ws/activemq-osgi/target/activemq-osgi-5.14.5-SNAPSHOT-sources.jar>
to org.apache.activemq/activemq-osgi/5.14.5-SNAPSHOT/activemq-osgi-5.14.5-SNAPSHOT-sources.jar
ERROR: Failed to archive {org.apache.activemq/activemq-osgi/5.14.5-SNAPSHOT/activemq-osgi-5.14.5-SNAPSHOT.pom=pom.xml,
org.apache.activemq/activemq-osgi/5.14.5-SNAPSHOT/activemq-osgi-5.14.5-SNAPSHOT.jar=target/activemq-osgi-5.14.5-SNAPSHOT.jar,
org.apache.activemq/activemq-osgi/5.14.5-SNAPSHOT/activemq-osgi-5.14.5-SNAPSHOT-sources.jar=target/activemq-osgi-5.14.5-SNAPSHOT-sources.jar}
due to internal error; falling back to full archiving
java.lang.IllegalStateException: End of stream while reading number
	at jsync.protocol.BaseReader.readLong(BaseReader.java:40)
	at jsync.protocol.BaseReader.readInt(BaseReader.java:26)
	at jsync.protocol.ChangeStreamReader.next(ChangeStreamReader.java:54)
	at jsync.protocol.ChangeInputStream.next(ChangeInputStream.java:27)
	at jsync.protocol.ChangeInputStream.read(ChangeInputStream.java:71)
	at com.cloudbees.jenkins.plugins.jsync.archiver.MD5DigestingInputStream.read(MD5DigestingInputStream.java:39)
	at com.google.common.io.LimitInputStream.read(LimitInputStream.java:79)
	at java.io.FilterInputStream.read(FilterInputStream.java:107)
	at com.google.common.io.ByteStreams.copy(ByteStreams.java:193)
	at jsync.protocol.FileSequenceReader.read(FileSequenceReader.java:35)
	at com.cloudbees.jenkins.plugins.jsync.archiver.JSyncArtifactManager.remoteSync(JSyncArtifactManager.java:158)
	at com.cloudbees.jenkins.plugins.jsync.archiver.JSyncArtifactManager.archive(JSyncArtifactManager.java:76)
	at hudson.maven.MavenBuild$ProxyImpl.performArchiving(MavenBuild.java:486)
	at hudson.maven.MavenModuleSetBuild$MavenModuleSetBuildExecution.doRun(MavenModuleSetBuild.java:875)
	at hudson.model.AbstractBuild$AbstractBuildExecution.run(AbstractBuild.java:534)
	at hudson.model.Run.execute(Run.java:1728)
	at hudson.maven.MavenModuleSetBuild.run(MavenModuleSetBuild.java:544)
	at hudson.model.ResourceController.execute(ResourceController.java:98)
	at hudson.model.Executor.run(Executor.java:404)
Sending e-mails to: commits@activemq.apache.org
Sending e-mails to: commits@activemq.apache.org
Sending e-mails to: commits@activemq.apache.org
[locks-and-latches] Releasing all the locks
[locks-and-latches] All the locks released
ERROR: Failed to parse POMs
java.io.IOException: Failed to extract <https://builds.apache.org/job/ActiveMQ-Java8-5.14.x/ws/activemq-osgi/transfer>
of 3 files
	at hudson.FilePath.readFromTar(FilePath.java:2289)
	at hudson.FilePath.copyRecursiveTo(FilePath.java:2199)
	at jenkins.model.StandardArtifactManager.archive(StandardArtifactManager.java:61)
	at com.cloudbees.jenkins.plugins.jsync.archiver.JSyncArtifactManager.archive(JSyncArtifactManager.java:80)
	at hudson.maven.MavenBuild$ProxyImpl.performArchiving(MavenBuild.java:486)
	at hudson.maven.MavenModuleSetBuild$MavenModuleSetBuildExecution.doRun(MavenModuleSetBuild.java:875)
	at hudson.model.AbstractBuild$AbstractBuildExecution.run(AbstractBuild.java:534)
	at hudson.model.Run.execute(Run.java:1728)
	at hudson.maven.MavenModuleSetBuild.run(MavenModuleSetBuild.java:544)
	at hudson.model.ResourceController.execute(ResourceController.java:98)
	at hudson.model.Executor.run(Executor.java:404)
Caused by: java.io.EOFException: Unexpected end of ZLIB input stream
	at com.jcraft.jzlib.InflaterInputStream.fill(InflaterInputStream.java:186)
	at com.jcraft.jzlib.InflaterInputStream.read(InflaterInputStream.java:106)
	at org.apache.commons.compress.utils.IOUtils.readFully(IOUtils.java:160)
	at org.apache.commons.compress.utils.IOUtils.readFully(IOUtils.java:134)
	at org.apache.commons.compress.archivers.tar.TarArchiveInputStream.readRecord(TarArchiveInputStream.java:419)
	at org.apache.commons.compress.archivers.tar.TarArchiveInputStream.getRecord(TarArchiveInputStream.java:388)
	at org.apache.commons.compress.archivers.tar.TarArchiveInputStream.getNextTarEntry(TarArchiveInputStream.java:269)
	at hudson.FilePath.readFromTar(FilePath.java:2267)
	... 10 more
channel stopped

Mime
View raw message