activemq-commits mailing list archives

Site index · List index
Message view « Date » · « Thread »
Top « Date » · « Thread »
From Apache Jenkins Server <jenk...@builds.apache.org>
Subject Build failed in Jenkins: ActiveMQ-Artemis-Master #1027
Date Fri, 28 Apr 2017 09:35:13 GMT
See <https://builds.apache.org/job/ActiveMQ-Artemis-Master/1027/display/redirect?page=changes>

Changes:

[mtaylor] ARTEMIS-1102 cert-based auth impl for OpenWire

[mtaylor] ARTEMIS-590 connector option to use default SSL context

[mtaylor] ARTEMIS-457 upgrade JGroups

[mtaylor] ARTEMIS-1130 log disallowed SSL protocols once

[mtaylor] ARTEMIS-1123 Major AMQP Test Suite refactoring

------------------------------------------
[...truncated 3.17 MB...]
[INFO] Exclude: artemis-native/src/main/c/org_apache_activemq_artemis_jlibaio_LibaioContext.h
[INFO] 3 resources included (use -debug for more details)
[INFO] Rat check: Summary over all files. Unapproved: 0, unknown: 0, generated: 0, approved:
3 licenses.
[INFO] 
[INFO] --- maven-site-plugin:3.3:attach-descriptor (attach-descriptor) @ artemis-features
---
[INFO] 
[INFO] >>> maven-source-plugin:2.2.1:jar (attach-sources) > generate-sources @
artemis-features >>>
[INFO] 
[INFO] --- maven-enforcer-plugin:1.4:enforce (enforce-maven) @ artemis-features ---
[INFO] 
[INFO] --- maven-enforcer-plugin:1.4:enforce (enforce-java) @ artemis-features ---
[INFO] 
[INFO] <<< maven-source-plugin:2.2.1:jar (attach-sources) < generate-sources @
artemis-features <<<
[INFO] 
[INFO] --- maven-source-plugin:2.2.1:jar (attach-sources) @ artemis-features ---
[INFO] 
[INFO] --- build-helper-maven-plugin:1.8:attach-artifact (attach-artifacts) @ artemis-features
---
[INFO] 
[INFO] >>> maven-source-plugin:2.2.1:jar (default) > generate-sources @ artemis-features
>>>
[INFO] 
[INFO] --- maven-enforcer-plugin:1.4:enforce (enforce-maven) @ artemis-features ---
[INFO] 
[INFO] --- maven-enforcer-plugin:1.4:enforce (enforce-java) @ artemis-features ---
[INFO] 
[INFO] <<< maven-source-plugin:2.2.1:jar (default) < generate-sources @ artemis-features
<<<
[INFO] 
[INFO] --- maven-source-plugin:2.2.1:jar (default) @ artemis-features ---
[INFO] 
[INFO] --- dependency-check-maven:1.4.3:check (default) @ artemis-features ---
[INFO] Skipping dependency-check
[INFO] 
[INFO] --- maven-install-plugin:2.4:install (default-install) @ artemis-features ---
[INFO] Installing <https://builds.apache.org/job/ActiveMQ-Artemis-Master/ws/artemis-features/pom.xml>
to /home/jenkins/.m2/repository/org/apache/activemq/artemis-features/2.1.0-SNAPSHOT/artemis-features-2.1.0-SNAPSHOT.pom
[INFO] Installing <https://builds.apache.org/job/ActiveMQ-Artemis-Master/ws/artemis-features/target/classes/features.xml>
to /home/jenkins/.m2/repository/org/apache/activemq/artemis-features/2.1.0-SNAPSHOT/artemis-features-2.1.0-SNAPSHOT-features.xml
[INFO] Installing <https://builds.apache.org/job/ActiveMQ-Artemis-Master/ws/artemis-features/target/classes/artemis.xml>
to /home/jenkins/.m2/repository/org/apache/activemq/artemis-features/2.1.0-SNAPSHOT/artemis-features-2.1.0-SNAPSHOT-artemis.xml
[INFO] Installing <https://builds.apache.org/job/ActiveMQ-Artemis-Master/ws/artemis-features/target/classes/org.apache.activemq.artemis.cfg>
to /home/jenkins/.m2/repository/org/apache/activemq/artemis-features/2.1.0-SNAPSHOT/artemis-features-2.1.0-SNAPSHOT.cfg
[INFO]                                                                         
[INFO] ------------------------------------------------------------------------
[INFO] Building ActiveMQ Artemis Test Support 2.1.0-SNAPSHOT
[INFO] ------------------------------------------------------------------------
[INFO] 
[INFO] --- maven-enforcer-plugin:1.4:enforce (enforce-maven) @ artemis-test-support ---
[INFO] 
[INFO] --- maven-enforcer-plugin:1.4:enforce (enforce-java) @ artemis-test-support ---
[INFO] 
[INFO] --- maven-remote-resources-plugin:1.5:process (process-resource-bundles) @ artemis-test-support
---
[INFO] 
[INFO] --- maven-resources-plugin:2.6:resources (default-resources) @ artemis-test-support
---
[INFO] Using 'UTF-8' encoding to copy filtered resources.
[INFO] skip non existing resourceDirectory <https://builds.apache.org/job/ActiveMQ-Artemis-Master/ws/tests/artemis-test-support/src/main/resources>
[INFO] Copying 3 resources
[INFO] 
[INFO] --- maven-compiler-plugin:3.1:compile (default-compile) @ artemis-test-support ---
[INFO] Changes detected - recompiling the module!
[INFO] Compiling 57 source files to <https://builds.apache.org/job/ActiveMQ-Artemis-Master/ws/tests/artemis-test-support/target/classes>
Note: Some input files use or override a deprecated API.
Note: Recompile with -Xlint:deprecation for details.
[INFO] 
[INFO] --- maven-checkstyle-plugin:2.17:check (default) @ artemis-test-support ---
[INFO] Starting audit...
Audit done.
[INFO] 
[INFO] --- apache-rat-plugin:0.12:check (default) @ artemis-test-support ---
[INFO] Enabled default license matchers.
[INFO] Will parse SCM ignores for exclusions...
[INFO] Finished adding exclusions from SCM ignore files.
[INFO] 61 implicit excludes (use -debug for more details).
[INFO] Exclude: **/*.txt
[INFO] Exclude: **/*.md
[INFO] Exclude: etc/ide-settings/**
[INFO] Exclude: docs/**/*.json
[INFO] Exclude: docs/**/_book/
[INFO] Exclude: **/target/
[INFO] Exclude: **/META-INF/services/*
[INFO] Exclude: **/META-INF/MANIFEST.MF
[INFO] Exclude: **/*.iml
[INFO] Exclude: **/*.jceks
[INFO] Exclude: **/*.jks
[INFO] Exclude: **/org/apache/activemq/artemis/utils/json/**
[INFO] Exclude: **/org/apache/activemq/artemis/utils/Base64.java
[INFO] Exclude: **/.settings/**
[INFO] Exclude: **/.project
[INFO] Exclude: **/.classpath
[INFO] Exclude: **/.editorconfig
[INFO] Exclude: **/.checkstyle
[INFO] Exclude: **/.factorypath
[INFO] Exclude: **/org.apache.activemq.artemis.cfg
[INFO] Exclude: **/nb-configuration.xml
[INFO] Exclude: **/*.data
[INFO] Exclude: **/*.bin
[INFO] Exclude: **/src/test/resources/keystore
[INFO] Exclude: **/*.log
[INFO] Exclude: **/*.redo
[INFO] Exclude: **/node/**
[INFO] Exclude: **/node_modules/**
[INFO] Exclude: **/package.json
[INFO] Exclude: **/npm-shrinkwrap.json
[INFO] Exclude: **/CMakeFiles/
[INFO] Exclude: **/Makefile
[INFO] Exclude: **/cmake_install.cmake
[INFO] Exclude: artemis-native/src/main/c/org_apache_activemq_artemis_jlibaio_LibaioContext.h
[INFO] 58 resources included (use -debug for more details)
[INFO] Rat check: Summary over all files. Unapproved: 0, unknown: 0, generated: 0, approved:
58 licenses.
[INFO] 
[INFO] --- maven-resources-plugin:2.6:testResources (default-testResources) @ artemis-test-support
---
[INFO] Using 'UTF-8' encoding to copy filtered resources.
[INFO] skip non existing resourceDirectory <https://builds.apache.org/job/ActiveMQ-Artemis-Master/ws/tests/artemis-test-support/src/test/resources>
[INFO] Copying 3 resources
[INFO] 
[INFO] --- maven-compiler-plugin:3.1:testCompile (default-testCompile) @ artemis-test-support
---
[INFO] No sources to compile
[INFO] 
[INFO] --- maven-surefire-plugin:2.18.1:test (default-test) @ artemis-test-support ---
[INFO] 
[INFO] --- maven-jar-plugin:2.4:jar (default-jar) @ artemis-test-support ---
[INFO] Building jar: <https://builds.apache.org/job/ActiveMQ-Artemis-Master/ws/tests/artemis-test-support/target/artemis-test-support-2.1.0-SNAPSHOT.jar>
[INFO] 
[INFO] --- maven-site-plugin:3.3:attach-descriptor (attach-descriptor) @ artemis-test-support
---
[INFO] 
[INFO] >>> maven-source-plugin:2.2.1:jar (attach-sources) > generate-sources @
artemis-test-support >>>
[INFO] 
[INFO] --- maven-enforcer-plugin:1.4:enforce (enforce-maven) @ artemis-test-support ---
[INFO] 
[INFO] --- maven-enforcer-plugin:1.4:enforce (enforce-java) @ artemis-test-support ---
[INFO] 
[INFO] <<< maven-source-plugin:2.2.1:jar (attach-sources) < generate-sources @
artemis-test-support <<<
[INFO] 
[INFO] --- maven-source-plugin:2.2.1:jar (attach-sources) @ artemis-test-support ---
[INFO] Building jar: <https://builds.apache.org/job/ActiveMQ-Artemis-Master/ws/tests/artemis-test-support/target/artemis-test-support-2.1.0-SNAPSHOT-sources.jar>
[INFO] 
[INFO] >>> maven-source-plugin:2.2.1:jar (default) > generate-sources @ artemis-test-support
>>>
[INFO] 
[INFO] --- maven-enforcer-plugin:1.4:enforce (enforce-maven) @ artemis-test-support ---
[INFO] 
[INFO] --- maven-enforcer-plugin:1.4:enforce (enforce-java) @ artemis-test-support ---
[INFO] 
[INFO] <<< maven-source-plugin:2.2.1:jar (default) < generate-sources @ artemis-test-support
<<<
[INFO] 
[INFO] --- maven-source-plugin:2.2.1:jar (default) @ artemis-test-support ---
[INFO] 
[INFO] --- dependency-check-maven:1.4.3:check (default) @ artemis-test-support ---
[INFO] Skipping dependency-check
[INFO] 
[INFO] --- maven-install-plugin:2.4:install (default-install) @ artemis-test-support ---
[INFO] Installing <https://builds.apache.org/job/ActiveMQ-Artemis-Master/ws/tests/artemis-test-support/target/artemis-test-support-2.1.0-SNAPSHOT.jar>
to /home/jenkins/.m2/repository/org/apache/activemq/tests/artemis-test-support/2.1.0-SNAPSHOT/artemis-test-support-2.1.0-SNAPSHOT.jar
[INFO] Installing <https://builds.apache.org/job/ActiveMQ-Artemis-Master/ws/tests/artemis-test-support/pom.xml>
to /home/jenkins/.m2/repository/org/apache/activemq/tests/artemis-test-support/2.1.0-SNAPSHOT/artemis-test-support-2.1.0-SNAPSHOT.pom
[INFO] Installing <https://builds.apache.org/job/ActiveMQ-Artemis-Master/ws/tests/artemis-test-support/target/artemis-test-support-2.1.0-SNAPSHOT-sources.jar>
to /home/jenkins/.m2/repository/org/apache/activemq/tests/artemis-test-support/2.1.0-SNAPSHOT/artemis-test-support-2.1.0-SNAPSHOT-sources.jar
[INFO] Installing <https://builds.apache.org/job/ActiveMQ-Artemis-Master/ws/tests/artemis-test-support/target/artemis-test-support-2.1.0-SNAPSHOT-sources.jar>
to /home/jenkins/.m2/repository/org/apache/activemq/tests/artemis-test-support/2.1.0-SNAPSHOT/artemis-test-support-2.1.0-SNAPSHOT-sources.jar
[INFO]                                                                         
[INFO] ------------------------------------------------------------------------
[INFO] Building ActiveMQ Artemis Integration Tests 2.1.0-SNAPSHOT
[INFO] ------------------------------------------------------------------------
[INFO] 
[INFO] --- maven-enforcer-plugin:1.4:enforce (enforce-maven) @ integration-tests ---
[INFO] 
[INFO] --- maven-enforcer-plugin:1.4:enforce (enforce-java) @ integration-tests ---
[INFO] 
[INFO] --- maven-remote-resources-plugin:1.5:process (process-resource-bundles) @ integration-tests
---
[INFO] 
[INFO] --- depends-maven-plugin:1.2:generate-depends-file (generate-depends-file) @ integration-tests
---
[INFO] Created: <https://builds.apache.org/job/ActiveMQ-Artemis-Master/ws/tests/integration-tests/target/classes/META-INF/maven/dependencies.properties>
[INFO] 
[INFO] --- maven-resources-plugin:2.6:resources (default-resources) @ integration-tests ---
[INFO] Using 'UTF-8' encoding to copy filtered resources.
[INFO] skip non existing resourceDirectory <https://builds.apache.org/job/ActiveMQ-Artemis-Master/ws/tests/integration-tests/src/main/resources>
[INFO] Copying 3 resources
[INFO] 
[INFO] --- maven-compiler-plugin:3.1:compile (default-compile) @ integration-tests ---
[INFO] No sources to compile
[INFO] 
[INFO] --- maven-checkstyle-plugin:2.17:check (default) @ integration-tests ---
[INFO] Starting audit...
<https://builds.apache.org/job/ActiveMQ-Artemis-Master/ws/tests/integration-tests/src/test/java/org/apache/activemq/artemis/tests/integration/security/SecurityTest.java>:19:8:
error: Unused import - javax.jms.MessageProducer.
Audit done.
[INFO] There is 1 error reported by Checkstyle 6.11.2 with <https://builds.apache.org/job/ActiveMQ-Artemis-Master/ws/tests/integration-tests/../../etc/checkstyle.xml>
ruleset.
[ERROR] src/test/java/org/apache/activemq/artemis/tests/integration/security/SecurityTest.java:[19,8]
(imports) UnusedImports: Unused import - javax.jms.MessageProducer.
[INFO] ------------------------------------------------------------------------
[INFO] Reactor Summary:
[INFO] 
[INFO] ActiveMQ Artemis Parent ............................ SUCCESS [  6.056 s]
[INFO] ActiveMQ Artemis Commons ........................... SUCCESS [ 11.178 s]
[INFO] ActiveMQ Artemis Core Client ....................... SUCCESS [  9.815 s]
[INFO] ActiveMQ Artemis Selector Implementation ........... SUCCESS [  2.842 s]
[INFO] ActiveMQ Artemis JMS Client ........................ SUCCESS [  2.954 s]
[INFO] ActiveMQ Artemis Native POM ........................ SUCCESS [  5.311 s]
[INFO] ActiveMQ Artemis Journal ........................... SUCCESS [  2.613 s]
[INFO] ActiveMQ Artemis JDBC Store ........................ SUCCESS [  4.330 s]
[INFO] ActiveMQ Artemis Server ............................ SUCCESS [ 40.417 s]
[INFO] ActiveMQ Artemis Protocols ......................... SUCCESS [  0.294 s]
[INFO] ActiveMQ Artemis AMQP Protocol ..................... SUCCESS [  3.561 s]
[INFO] ActiveMQ Artemis STOMP Protocol .................... SUCCESS [  1.743 s]
[INFO] ActiveMQ Artemis OpenWire Protocol ................. SUCCESS [  1.943 s]
[INFO] ActiveMQ Artemis HQClient Protocol ................. SUCCESS [  0.788 s]
[INFO] ActiveMQ Artemis HornetQ Protocol .................. SUCCESS [  0.706 s]
[INFO] ActiveMQ Artemis MQTT Protocol ..................... SUCCESS [  1.035 s]
[INFO] ActiveMQ Artemis DTO ............................... SUCCESS [  1.888 s]
[INFO] ActiveMQ Artemis Service Extensions ................ SUCCESS [  1.533 s]
[INFO] ActiveMQ Artemis JMS Server ........................ SUCCESS [  1.399 s]
[INFO] ActiveMQ Artemis CDI Integration ................... SUCCESS [  4.045 s]
[INFO] ActiveMQ Artemis Boot .............................. SUCCESS [  0.532 s]
[INFO] ActiveMQ Artemis Tools ............................. SUCCESS [  1.037 s]
[INFO] ActiveMQ Artemis CLI ............................... SUCCESS [ 21.604 s]
[INFO] ActiveMQ Artemis Web ............................... SUCCESS [  4.025 s]
[INFO] ActiveMQ Artemis Web ............................... SUCCESS [ 57.735 s]
[INFO] ActiveMQ Artemis JUnit Rules ....................... SUCCESS [  5.876 s]
[INFO] ActiveMQ Artemis RAR POM ........................... SUCCESS [  1.883 s]
[INFO] ActiveMQ Artemis REST Interface Implementation ..... SUCCESS [01:23 min]
[INFO] ActiveMQ Artemis Maven Plugin ...................... SUCCESS [  2.925 s]
[INFO] ActiveMQ Artemis Server OSGi ....................... SUCCESS [  3.508 s]
[INFO] ActiveMQ Artemis Spring Integration ................ SUCCESS [  0.611 s]
[INFO] Apache ActiveMQ Artemis Distribution ............... SUCCESS [ 17.986 s]
[INFO] ActiveMQ Artemis Tests POM ......................... SUCCESS [  0.549 s]
[INFO] ActiveMQ Artemis Unit Tests ........................ SUCCESS [02:27 min]
[INFO] ActiveMQ Artemis Joram Tests ....................... SUCCESS [ 34.699 s]
[INFO] ActiveMQ Artemis timing Tests ...................... SUCCESS [  0.897 s]
[INFO] ActiveMQ Artemis JMS Tests ......................... SUCCESS [03:16 min]
[INFO] ActiveMQ Artemis Features .......................... SUCCESS [  0.058 s]
[INFO] ActiveMQ Artemis Test Support ...................... SUCCESS [  1.423 s]
[INFO] ActiveMQ Artemis Integration Tests ................. FAILURE [  7.634 s]
[INFO] ActiveMQ Artemis soak Tests ........................ SKIPPED
[INFO] ActiveMQ Artemis stress Tests ...................... SKIPPED
[INFO] ActiveMQ Artemis performance Tests ................. SKIPPED
[INFO] Smoke Tests ........................................ SKIPPED
[INFO] ActiveMQ Artemis Extra Tests ....................... SKIPPED
[INFO] ------------------------------------------------------------------------
[INFO] BUILD FAILURE
[INFO] ------------------------------------------------------------------------
[INFO] Total time: 11:37 min
[INFO] Finished at: 2017-04-28T09:35:06+00:00
[INFO] Final Memory: 251M/4267M
[INFO] ------------------------------------------------------------------------
[ERROR] Failed to execute goal org.apache.maven.plugins:maven-checkstyle-plugin:2.17:check
(default) on project integration-tests: You have 1 Checkstyle violation. -> [Help 1]
[ERROR] 
[ERROR] To see the full stack trace of the errors, re-run Maven with the -e switch.
[ERROR] Re-run Maven using the -X switch to enable full debug logging.
[ERROR] 
[ERROR] For more information about the errors and possible solutions, please read the following
articles:
[ERROR] [Help 1] http://cwiki.apache.org/confluence/display/MAVEN/MojoFailureException
[ERROR] 
[ERROR] After correcting the problems, you can resume the build with the command
[ERROR]   mvn <goals> -rf :integration-tests
Build step 'Invoke top-level Maven targets' marked build as failure
Performing Post build task...
Could not match :Too many files with unapproved license  : False
Logical operation result is FALSE
Skipping script  : cat ratReport.txt
END OF POST BUILD TASK 	: 0
Recording test results
Not sending mail to unregistered user mtaylor@redhat.com

Mime
View raw message