activemq-commits mailing list archives

Site index · List index
Message view « Date » · « Thread »
Top « Date » · « Thread »
From Apache Jenkins Server <jenk...@builds.apache.org>
Subject Build failed in Jenkins: ActiveMQ-Artemis-Master #1029
Date Fri, 28 Apr 2017 16:04:09 GMT
See <https://builds.apache.org/job/ActiveMQ-Artemis-Master/1029/display/redirect?page=changes>

Changes:

[jbertram] ARTEMIS-1102 fix checkstyle

------------------------------------------
[...truncated 253.54 KB...]
[main] 16:03:31,533 INFO  [org.apache.activemq.artemis.core.server] #*#*# Finished test: ReplicaTest3()...
[main] 16:03:31,534 INFO  [org.apache.activemq.artemis.core.server] #*#*# Starting test: colocatedTestNullBackup()...
#test colocatedTestNullBackup
[main] 16:03:31,566 INFO  [org.apache.activemq.artemis.core.server] AMQ221000: live Message
Broker is starting with configuration Broker Configuration (clustered=false,journalDirectory=<https://builds.apache.org/job/ActiveMQ-Artemis-Master/ws/artemis-server/./target/tmp/junit430417293927695752/data/journal,bindingsDirectory=/home/jenkins/jenkins-slave/workspace/ActiveMQ-Artemis-Master/artemis-server/./target/tmp/junit430417293927695752/data/bindings,largeMessagesDirectory=/home/jenkins/jenkins-slave/workspace/ActiveMQ-Artemis-Master/artemis-server/./target/tmp/junit430417293927695752/data/largemessages,pagingDirectory=/home/jenkins/jenkins-slave/workspace/ActiveMQ-Artemis-Master/artemis-server/./target/tmp/junit430417293927695752/data/paging)>
[main] 16:03:31,567 INFO  [org.apache.activemq.artemis.core.server] AMQ221012: Using AIO Journal
[main] 16:03:31,569 INFO  [org.apache.activemq.artemis.core.server] AMQ221043: Protocol module
found: [artemis-server]. Adding protocol support for: CORE
[main] 16:03:31,890 INFO  [org.apache.activemq.artemis.core.server] AMQ221007: Server is now
live
[main] 16:03:31,890 INFO  [org.apache.activemq.artemis.core.server] AMQ221001: Apache ActiveMQ
Artemis Message Broker version 2.1.0-SNAPSHOT [localhost, nodeID=39a88cde-2c2c-11e7-8f16-02424ee64064]

[main] 16:03:31,932 INFO  [org.apache.activemq.artemis.core.server] AMQ221002: Apache ActiveMQ
Artemis Message Broker version 2.1.0-SNAPSHOT [39a88cde-2c2c-11e7-8f16-02424ee64064] stopped,
uptime 0.379 seconds
[main] 16:03:31,936 INFO  [org.apache.activemq.artemis.core.server] #*#*# Finished test: colocatedTestNullBackup()...
Tests run: 17, Failures: 0, Errors: 0, Skipped: 0, Time elapsed: 5.414 sec - in org.apache.activemq.artemis.core.config.impl.HAPolicyConfigurationTest
Running org.apache.activemq.artemis.core.config.impl.ValidatorsTest
Tests run: 8, Failures: 0, Errors: 0, Skipped: 0, Time elapsed: 0.012 sec - in org.apache.activemq.artemis.core.config.impl.ValidatorsTest
Running org.apache.activemq.artemis.core.config.impl.WrongRoleFileConfigurationParserTest
[main] 16:03:31,954 INFO  [org.apache.activemq.artemis.core.server] #*#*# Starting test: testParsingDefaultServerConfig()...
#test testParsingDefaultServerConfig
[main] 16:03:31,962 WARN  [org.apache.activemq.artemis.core.server] AMQ222177: Wrong configuration
for role, create-durable-queue is not a valid permission
[main] 16:03:31,962 WARN  [org.apache.activemq.artemis.core.server] AMQ222177: Wrong configuration
for role, delete-durable-queue is not a valid permission
[main] 16:03:31,973 INFO  [org.apache.activemq.artemis.core.server] #*#*# Finished test: testParsingDefaultServerConfig()...
Tests run: 1, Failures: 0, Errors: 0, Skipped: 0, Time elapsed: 0.02 sec - in org.apache.activemq.artemis.core.config.impl.WrongRoleFileConfigurationParserTest
Running org.apache.activemq.artemis.core.filter.impl.FilterTest
[main] 16:03:32,054 ERROR [org.apache.activemq.artemis.core.server] AMQ224006: Invalid filter:
color = 'red: org.apache.activemq.artemis.selector.filter.FilterException: color = 'red
	at org.apache.activemq.artemis.selector.impl.SelectorParser.parse(SelectorParser.java:86)
[artemis-selector-2.1.0-SNAPSHOT.jar:2.1.0-SNAPSHOT]
	at org.apache.activemq.artemis.core.filter.impl.FilterImpl.createFilter(FilterImpl.java:80)
[:]
	at org.apache.activemq.artemis.core.filter.impl.FilterImpl.createFilter(FilterImpl.java:66)
[:]
	at org.apache.activemq.artemis.core.filter.impl.FilterTest.testInvalidFilter(FilterTest.java:705)
[:]
	at org.apache.activemq.artemis.core.filter.impl.FilterTest.testInvalidString(FilterTest.java:68)
[:]
	at sun.reflect.NativeMethodAccessorImpl.invoke0(Native Method) [rt.jar:1.8.0_121]
	at sun.reflect.NativeMethodAccessorImpl.invoke(NativeMethodAccessorImpl.java:62) [rt.jar:1.8.0_121]
	at sun.reflect.DelegatingMethodAccessorImpl.invoke(DelegatingMethodAccessorImpl.java:43)
[rt.jar:1.8.0_121]
	at java.lang.reflect.Method.invoke(Method.java:498) [rt.jar:1.8.0_121]
	at org.junit.runners.model.FrameworkMethod$1.runReflectiveCall(FrameworkMethod.java:47) [junit-4.11.jar:]
	at org.junit.internal.runners.model.ReflectiveCallable.run(ReflectiveCallable.java:12) [junit-4.11.jar:]
	at org.junit.runners.model.FrameworkMethod.invokeExplosively(FrameworkMethod.java:44) [junit-4.11.jar:]
	at org.junit.internal.runners.statements.InvokeMethod.evaluate(InvokeMethod.java:17) [junit-4.11.jar:]
	at org.junit.internal.runners.statements.RunBefores.evaluate(RunBefores.java:26) [junit-4.11.jar:]
	at org.junit.internal.runners.statements.RunAfters.evaluate(RunAfters.java:27) [junit-4.11.jar:]
	at org.junit.runners.ParentRunner.runLeaf(ParentRunner.java:271) [junit-4.11.jar:]
	at org.junit.runners.BlockJUnit4ClassRunner.runChild(BlockJUnit4ClassRunner.java:70) [junit-4.11.jar:]
	at org.junit.runners.BlockJUnit4ClassRunner.runChild(BlockJUnit4ClassRunner.java:50) [junit-4.11.jar:]
	at org.junit.runners.ParentRunner$3.run(ParentRunner.java:238) [junit-4.11.jar:]
	at org.junit.runners.ParentRunner$1.schedule(ParentRunner.java:63) [junit-4.11.jar:]
	at org.junit.runners.ParentRunner.runChildren(ParentRunner.java:236) [junit-4.11.jar:]
	at org.junit.runners.ParentRunner.access$000(ParentRunner.java:53) [junit-4.11.jar:]
	at org.junit.runners.ParentRunner$2.evaluate(ParentRunner.java:229) [junit-4.11.jar:]
	at org.junit.runners.ParentRunner.run(ParentRunner.java:309) [junit-4.11.jar:]
	at org.apache.maven.surefire.junit4.JUnit4Provider.execute(JUnit4Provider.java:283) [surefire-junit4-2.18.1.jar:2.18.1]
	at org.apache.maven.surefire.junit4.JUnit4Provider.executeWithRerun(JUnit4Provider.java:173)
[surefire-junit4-2.18.1.jar:2.18.1]
	at org.apache.maven.surefire.junit4.JUnit4Provider.executeTestSet(JUnit4Provider.java:153)
[surefire-junit4-2.18.1.jar:2.18.1]
	at org.apache.maven.surefire.junit4.JUnit4Provider.invoke(JUnit4Provider.java:128) [surefire-junit4-2.18.1.jar:2.18.1]
	at org.apache.maven.surefire.booter.ForkedBooter.invokeProviderInSameClassLoader(ForkedBooter.java:203)
[surefire-booter-2.18.1.jar:2.18.1]
	at org.apache.maven.surefire.booter.ForkedBooter.runSuitesInProcess(ForkedBooter.java:155)
[surefire-booter-2.18.1.jar:2.18.1]
	at org.apache.maven.surefire.booter.ForkedBooter.main(ForkedBooter.java:103) [surefire-booter-2.18.1.jar:2.18.1]
Caused by: org.apache.activemq.artemis.selector.strict.TokenMgrError: Lexical error at line
1, column 13.  Encountered: <EOF> after : "\'red"
	at org.apache.activemq.artemis.selector.strict.StrictParserTokenManager.getNextToken(StrictParserTokenManager.java:1050)
[artemis-selector-2.1.0-SNAPSHOT.jar:2.1.0-SNAPSHOT]
	at org.apache.activemq.artemis.selector.strict.StrictParser.jj_scan_token(StrictParser.java:1130)
[artemis-selector-2.1.0-SNAPSHOT.jar:2.1.0-SNAPSHOT]
	at org.apache.activemq.artemis.selector.strict.StrictParser.jj_3_6(StrictParser.java:803)
[artemis-selector-2.1.0-SNAPSHOT.jar:2.1.0-SNAPSHOT]
	at org.apache.activemq.artemis.selector.strict.StrictParser.jj_2_6(StrictParser.java:550)
[artemis-selector-2.1.0-SNAPSHOT.jar:2.1.0-SNAPSHOT]
	at org.apache.activemq.artemis.selector.strict.StrictParser.unaryExpr(StrictParser.java:372)
[artemis-selector-2.1.0-SNAPSHOT.jar:2.1.0-SNAPSHOT]
	at org.apache.activemq.artemis.selector.strict.StrictParser.multExpr(StrictParser.java:332)
[artemis-selector-2.1.0-SNAPSHOT.jar:2.1.0-SNAPSHOT]
	at org.apache.activemq.artemis.selector.strict.StrictParser.addExpression(StrictParser.java:301)
[artemis-selector-2.1.0-SNAPSHOT.jar:2.1.0-SNAPSHOT]
	at org.apache.activemq.artemis.selector.strict.StrictParser.comparisonExpression(StrictParser.java:153)
[artemis-selector-2.1.0-SNAPSHOT.jar:2.1.0-SNAPSHOT]
	at org.apache.activemq.artemis.selector.strict.StrictParser.equalityExpression(StrictParser.java:113)
[artemis-selector-2.1.0-SNAPSHOT.jar:2.1.0-SNAPSHOT]
	at org.apache.activemq.artemis.selector.strict.StrictParser.andExpression(StrictParser.java:77)
[artemis-selector-2.1.0-SNAPSHOT.jar:2.1.0-SNAPSHOT]
	at org.apache.activemq.artemis.selector.strict.StrictParser.orExpression(StrictParser.java:56)
[artemis-selector-2.1.0-SNAPSHOT.jar:2.1.0-SNAPSHOT]
	at org.apache.activemq.artemis.selector.strict.StrictParser.JmsSelector(StrictParser.java:47)
[artemis-selector-2.1.0-SNAPSHOT.jar:2.1.0-SNAPSHOT]
	at org.apache.activemq.artemis.selector.impl.SelectorParser.parse(SelectorParser.java:81)
[artemis-selector-2.1.0-SNAPSHOT.jar:2.1.0-SNAPSHOT]
	... 30 more

[main] 16:03:32,057 ERROR [org.apache.activemq.artemis.core.server] AMQ224006: Invalid filter:
color = 'red: org.apache.activemq.artemis.selector.filter.FilterException: color = 'red
	at org.apache.activemq.artemis.selector.impl.SelectorParser.parse(SelectorParser.java:86)
[artemis-selector-2.1.0-SNAPSHOT.jar:2.1.0-SNAPSHOT]
	at org.apache.activemq.artemis.core.filter.impl.FilterImpl.createFilter(FilterImpl.java:80)
[:]
	at org.apache.activemq.artemis.core.filter.impl.FilterImpl.createFilter(FilterImpl.java:66)
[:]
	at org.apache.activemq.artemis.core.filter.impl.FilterTest.testInvalidFilter(FilterTest.java:705)
[:]
	at org.apache.activemq.artemis.core.filter.impl.FilterTest.testInvalidString(FilterTest.java:68)
[:]
	at sun.reflect.NativeMethodAccessorImpl.invoke0(Native Method) [rt.jar:1.8.0_121]
	at sun.reflect.NativeMethodAccessorImpl.invoke(NativeMethodAccessorImpl.java:62) [rt.jar:1.8.0_121]
	at sun.reflect.DelegatingMethodAccessorImpl.invoke(DelegatingMethodAccessorImpl.java:43)
[rt.jar:1.8.0_121]
	at java.lang.reflect.Method.invoke(Method.java:498) [rt.jar:1.8.0_121]
	at org.junit.runners.model.FrameworkMethod$1.runReflectiveCall(FrameworkMethod.java:47) [junit-4.11.jar:]
	at org.junit.internal.runners.model.ReflectiveCallable.run(ReflectiveCallable.java:12) [junit-4.11.jar:]
	at org.junit.runners.model.FrameworkMethod.invokeExplosively(FrameworkMethod.java:44) [junit-4.11.jar:]
	at org.junit.internal.runners.statements.InvokeMethod.evaluate(InvokeMethod.java:17) [junit-4.11.jar:]
	at org.junit.internal.runners.statements.RunBefores.evaluate(RunBefores.java:26) [junit-4.11.jar:]
	at org.junit.internal.runners.statements.RunAfters.evaluate(RunAfters.java:27) [junit-4.11.jar:]
	at org.junit.runners.ParentRunner.runLeaf(ParentRunner.java:271) [junit-4.11.jar:]
	at org.junit.runners.BlockJUnit4ClassRunner.runChild(BlockJUnit4ClassRunner.java:70) [junit-4.11.jar:]
	at org.junit.runners.BlockJUnit4ClassRunner.runChild(BlockJUnit4ClassRunner.java:50) [junit-4.11.jar:]
	at org.junit.runners.ParentRunner$3.run(ParentRunner.java:238) [junit-4.11.jar:]
	at org.junit.runners.ParentRunner$1.schedule(ParentRunner.java:63) [junit-4.11.jar:]
	at org.junit.runners.ParentRunner.runChildren(ParentRunner.java:236) [junit-4.11.jar:]
	at org.junit.runners.ParentRunner.access$000(ParentRunner.java:53) [junit-4.11.jar:]
	at org.junit.runners.ParentRunner$2.evaluate(ParentRunner.java:229) [junit-4.11.jar:]
	at org.junit.runners.ParentRunner.run(ParentRunner.java:309) [junit-4.11.jar:]
	at org.apache.maven.surefire.junit4.JUnit4Provider.execute(JUnit4Provider.java:283) [surefire-junit4-2.18.1.jar:2.18.1]
	at org.apache.maven.surefire.junit4.JUnit4Provider.executeWithRerun(JUnit4Provider.java:173)
[surefire-junit4-2.18.1.jar:2.18.1]
	at org.apache.maven.surefire.junit4.JUnit4Provider.executeTestSet(JUnit4Provider.java:153)
[surefire-junit4-2.18.1.jar:2.18.1]
	at org.apache.maven.surefire.junit4.JUnit4Provider.invoke(JUnit4Provider.java:128) [surefire-junit4-2.18.1.jar:2.18.1]
	at org.apache.maven.surefire.booter.ForkedBooter.invokeProviderInSameClassLoader(ForkedBooter.java:203)
[surefire-booter-2.18.1.jar:2.18.1]
	at org.apache.maven.surefire.booter.ForkedBooter.runSuitesInProcess(ForkedBooter.java:155)
[surefire-booter-2.18.1.jar:2.18.1]
	at org.apache.maven.surefire.booter.ForkedBooter.main(ForkedBooter.java:103) [surefire-booter-2.18.1.jar:2.18.1]
Caused by: org.apache.activemq.artemis.selector.strict.TokenMgrError: Lexical error at line
1, column 13.  Encountered: <EOF> after : "\'red"
	at org.apache.activemq.artemis.selector.strict.StrictParserTokenManager.getNextToken(StrictParserTokenManager.java:1050)
[artemis-selector-2.1.0-SNAPSHOT.jar:2.1.0-SNAPSHOT]
	at org.apache.activemq.artemis.selector.strict.StrictParser.jj_scan_token(StrictParser.java:1130)
[artemis-selector-2.1.0-SNAPSHOT.jar:2.1.0-SNAPSHOT]
	at org.apache.activemq.artemis.selector.strict.StrictParser.jj_3_6(StrictParser.java:803)
[artemis-selector-2.1.0-SNAPSHOT.jar:2.1.0-SNAPSHOT]
	at org.apache.activemq.artemis.selector.strict.StrictParser.jj_2_6(StrictParser.java:550)
[artemis-selector-2.1.0-SNAPSHOT.jar:2.1.0-SNAPSHOT]
	at org.apache.activemq.artemis.selector.strict.StrictParser.unaryExpr(StrictParser.java:372)
[artemis-selector-2.1.0-SNAPSHOT.jar:2.1.0-SNAPSHOT]
	at org.apache.activemq.artemis.selector.strict.StrictParser.multExpr(StrictParser.java:332)
[artemis-selector-2.1.0-SNAPSHOT.jar:2.1.0-SNAPSHOT]
	at org.apache.activemq.artemis.selector.strict.StrictParser.addExpression(StrictParser.java:301)
[artemis-selector-2.1.0-SNAPSHOT.jar:2.1.0-SNAPSHOT]
	at org.apache.activemq.artemis.selector.strict.StrictParser.comparisonExpression(StrictParser.java:153)
[artemis-selector-2.1.0-SNAPSHOT.jar:2.1.0-SNAPSHOT]
	at org.apache.activemq.artemis.selector.strict.StrictParser.equalityExpression(StrictParser.java:113)
[artemis-selector-2.1.0-SNAPSHOT.jar:2.1.0-SNAPSHOT]
	at org.apache.activemq.artemis.selector.strict.StrictParser.andExpression(StrictParser.java:77)
[artemis-selector-2.1.0-SNAPSHOT.jar:2.1.0-SNAPSHOT]
	at org.apache.activemq.artemis.selector.strict.StrictParser.orExpression(StrictParser.java:56)
[artemis-selector-2.1.0-SNAPSHOT.jar:2.1.0-SNAPSHOT]
	at org.apache.activemq.artemis.selector.strict.StrictParser.JmsSelector(StrictParser.java:47)
[artemis-selector-2.1.0-SNAPSHOT.jar:2.1.0-SNAPSHOT]
	at org.apache.activemq.artemis.selector.impl.SelectorParser.parse(SelectorParser.java:81)
[artemis-selector-2.1.0-SNAPSHOT.jar:2.1.0-SNAPSHOT]
	... 30 more

[main] 16:03:32,059 ERROR [org.apache.activemq.artemis.core.server] AMQ224006: Invalid filter:
3: org.apache.activemq.artemis.selector.filter.FilterException: 3
	at org.apache.activemq.artemis.selector.impl.SelectorParser.parse(SelectorParser.java:86)
[artemis-selector-2.1.0-SNAPSHOT.jar:2.1.0-SNAPSHOT]
	at org.apache.activemq.artemis.core.filter.impl.FilterImpl.createFilter(FilterImpl.java:80)
[:]
	at org.apache.activemq.artemis.core.filter.impl.FilterImpl.createFilter(FilterImpl.java:66)
[:]
	at org.apache.activemq.artemis.core.filter.impl.FilterTest.testInvalidFilter(FilterTest.java:705)
[:]
	at org.apache.activemq.artemis.core.filter.impl.FilterTest.testInvalidString(FilterTest.java:71)
[:]
	at sun.reflect.NativeMethodAccessorImpl.invoke0(Native Method) [rt.jar:1.8.0_121]
	at sun.reflect.NativeMethodAccessorImpl.invoke(NativeMethodAccessorImpl.java:62) [rt.jar:1.8.0_121]
	at sun.reflect.DelegatingMethodAccessorImpl.invoke(DelegatingMethodAccessorImpl.java:43)
[rt.jar:1.8.0_121]
	at java.lang.reflect.Method.invoke(Method.java:498) [rt.jar:1.8.0_121]
	at org.junit.runners.model.FrameworkMethod$1.runReflectiveCall(FrameworkMethod.java:47) [junit-4.11.jar:]
	at org.junit.internal.runners.model.ReflectiveCallable.run(ReflectiveCallable.java:12) [junit-4.11.jar:]
	at org.junit.runners.model.FrameworkMethod.invokeExplosively(FrameworkMethod.java:44) [junit-4.11.jar:]
	at org.junit.internal.runners.statements.InvokeMethod.evaluate(InvokeMethod.java:17) [junit-4.11.jar:]
	at org.junit.internal.runners.statements.RunBefores.evaluate(RunBefores.java:26) [junit-4.11.jar:]
	at org.junit.internal.runners.statements.RunAfters.evaluate(RunAfters.java:27) [junit-4.11.jar:]
	at org.junit.runners.ParentRunner.runLeaf(ParentRunner.java:271) [junit-4.11.jar:]
	at org.junit.runners.BlockJUnit4ClassRunner.runChild(BlockJUnit4ClassRunner.java:70) [junit-4.11.jar:]
	at org.junit.runners.BlockJUnit4ClassRunner.runChild(BlockJUnit4ClassRunner.java:50) [junit-4.11.jar:]
	at org.junit.runners.ParentRunner$3.run(ParentRunner.java:238) [junit-4.11.jar:]
	at org.junit.runners.ParentRunner$1.schedule(ParentRunner.java:63) [junit-4.11.jar:]
	at org.junit.runners.ParentRunner.runChildren(ParentRunner.java:236) [junit-4.11.jar:]
	at org.junit.runners.ParentRunner.access$000(ParentRunner.java:53) [junit-4.11.jar:]
	at org.junit.runners.ParentRunner$2.evaluate(ParentRunner.java:229) [junit-4.11.jar:]
	at org.junit.runners.ParentRunner.run(ParentRunner.java:309) [junit-4.11.jar:]
	at org.apache.maven.surefire.junit4.JUnit4Provider.execute(JUnit4Provider.java:283) [surefire-junit4-2.18.1.jar:2.18.1]
	at org.apache.maven.surefire.junit4.JUnit4Provider.executeWithRerun(JUnit4Provider.java:173)
[surefire-junit4-2.18.1.jar:2.18.1]
	at org.apache.maven.surefire.junit4.JUnit4Provider.executeTestSet(JUnit4Provider.java:153)
[surefire-junit4-2.18.1.jar:2.18.1]
	at org.apache.maven.surefire.junit4.JUnit4Provider.invoke(JUnit4Provider.java:128) [surefire-junit4-2.18.1.jar:2.18.1]
	at org.apache.maven.surefire.booter.ForkedBooter.invokeProviderInSameClassLoader(ForkedBooter.java:203)
[surefire-booter-2.18.1.jar:2.18.1]
	at org.apache.maven.surefire.booter.ForkedBooter.runSuitesInProcess(ForkedBooter.java:155)
[surefire-booter-2.18.1.jar:2.18.1]
	at org.apache.maven.surefire.booter.ForkedBooter.main(ForkedBooter.java:103) [surefire-booter-2.18.1.jar:2.18.1]
Caused by: org.apache.activemq.artemis.selector.strict.ParseException: Expression will not
result in a boolean value: 3
	at org.apache.activemq.artemis.selector.strict.StrictParser.asBooleanExpression(StrictParser.java:39)
[artemis-selector-2.1.0-SNAPSHOT.jar:2.1.0-SNAPSHOT]
	at org.apache.activemq.artemis.selector.strict.StrictParser.JmsSelector(StrictParser.java:49)
[artemis-selector-2.1.0-SNAPSHOT.jar:2.1.0-SNAPSHOT]
	at org.apache.activemq.artemis.selector.impl.SelectorParser.parse(SelectorParser.java:81)
[artemis-selector-2.1.0-SNAPSHOT.jar:2.1.0-SNAPSHOT]
	... 30 more

[main] 16:03:32,061 ERROR [org.apache.activemq.artemis.core.server] AMQ224006: Invalid filter:
3: org.apache.activemq.artemis.selector.filter.FilterException: 3
	at org.apache.activemq.artemis.selector.impl.SelectorParser.parse(SelectorParser.java:86)
[artemis-selector-2.1.0-SNAPSHOT.jar:2.1.0-SNAPSHOT]
	at org.apache.activemq.artemis.core.filter.impl.FilterImpl.createFilter(FilterImpl.java:80)
[:]
	at org.apache.activemq.artemis.core.filter.impl.FilterImpl.createFilter(FilterImpl.java:66)
[:]
	at org.apache.activemq.artemis.core.filter.impl.FilterTest.testInvalidFilter(FilterTest.java:705)
[:]
	at org.apache.activemq.artemis.core.filter.impl.FilterTest.testInvalidString(FilterTest.java:71)
[:]
	at sun.reflect.NativeMethodAccessorImpl.invoke0(Native Method) [rt.jar:1.8.0_121]
	at sun.reflect.NativeMethodAccessorImpl.invoke(NativeMethodAccessorImpl.java:62) [rt.jar:1.8.0_121]
	at sun.reflect.DelegatingMethodAccessorImpl.invoke(DelegatingMethodAccessorImpl.java:43)
[rt.jar:1.8.0_121]
	at java.lang.reflect.Method.invoke(Method.java:498) [rt.jar:1.8.0_121]
	at org.junit.runners.model.FrameworkMethod$1.runReflectiveCall(FrameworkMethod.java:47) [junit-4.11.jar:]
	at org.junit.internal.runners.model.ReflectiveCallable.run(ReflectiveCallable.java:12) [junit-4.11.jar:]
	at org.junit.runners.model.FrameworkMethod.invokeExplosively(FrameworkMethod.java:44) [junit-4.11.jar:]
	at org.junit.internal.runners.statements.InvokeMethod.evaluate(InvokeMethod.java:17) [junit-4.11.jar:]
	at org.junit.internal.runners.statements.RunBefores.evaluate(RunBefores.java:26) [junit-4.11.jar:]
	at org.junit.internal.runners.statements.RunAfters.evaluate(RunAfters.java:27) [junit-4.11.jar:]
	at org.junit.runners.ParentRunner.runLeaf(ParentRunner.java:271) [junit-4.11.jar:]
	at org.junit.runners.BlockJUnit4ClassRunner.runChild(BlockJUnit4ClassRunner.java:70) [junit-4.11.jar:]
	at org.junit.runners.BlockJUnit4ClassRunner.runChild(BlockJUnit4ClassRunner.java:50) [junit-4.11.jar:]
	at org.junit.runners.ParentRunner$3.run(ParentRunner.java:238) [junit-4.11.jar:]
	at org.junit.runners.ParentRunner$1.schedule(ParentRunner.java:63) [junit-4.11.jar:]
	at org.junit.runners.ParentRunner.runChildren(ParentRunner.java:236) [junit-4.11.jar:]
	at org.junit.runners.ParentRunner.access$000(ParentRunner.java:53) [junit-4.11.jar:]
	at org.junit.runners.ParentRunner$2.evaluate(ParentRunner.java:229) [junit-4.11.jar:]
	at org.junit.runners.ParentRunner.run(ParentRunner.java:309) [junit-4.11.jar:]
	at org.apache.maven.surefire.junit4.JUnit4Provider.execute(JUnit4Provider.java:283) [surefire-junit4-2.18.1.jar:2.18.1]
	at org.apache.maven.surefire.junit4.JUnit4Provider.executeWithRerun(JUnit4Provider.java:173)
[surefire-junit4-2.18.1.jar:2.18.1]
	at org.apache.maven.surefire.junit4.JUnit4Provider.executeTestSet(JUnit4Provider.java:153)
[surefire-junit4-2.18.1.jar:2.18.1]
	at org.apache.maven.surefire.junit4.JUnit4Provider.invoke(JUnit4Provider.java:128) [surefire-junit4-2.18.1.jar:2.18.1]
	at org.apache.maven.surefire.booter.ForkedBooter.invokeProviderInSameClassLoader(ForkedBooter.java:203)
[surefire-booter-2.18.1.jar:2.18.1]
	at org.apache.maven.surefire.booter.ForkedBooter.runSuitesInProcess(ForkedBooter.java:155)
[surefire-booter-2.18.1.jar:2.18.1]
	at org.apache.maven.surefire.booter.ForkedBooter.main(ForkedBooter.java:103) [surefire-booter-2.18.1.jar:2.18.1]
Caused by: org.apache.activemq.artemis.selector.strict.ParseException: Expression will not
result in a boolean value: 3
	at org.apache.activemq.artemis.selector.strict.StrictParser.asBooleanExpression(StrictParser.java:39)
[artemis-selector-2.1.0-SNAPSHOT.jar:2.1.0-SNAPSHOT]
	at org.apache.activemq.artemis.selector.strict.StrictParser.JmsSelector(StrictParser.java:49)
[artemis-selector-2.1.0-SNAPSHOT.jar:2.1.0-SNAPSHOT]
	at org.apache.activemq.artemis.selector.impl.SelectorParser.parse(SelectorParser.java:81)
[artemis-selector-2.1.0-SNAPSHOT.jar:2.1.0-SNAPSHOT]
	... 30 more

Tests run: 21, Failures: 0, Errors: 0, Skipped: 0, Time elapsed: 0.106 sec - in org.apache.activemq.artemis.core.filter.impl.FilterTest
Running org.apache.activemq.artemis.core.list.PriorityLinkedListTest
Tests run: 11, Failures: 0, Errors: 0, Skipped: 0, Time elapsed: 0.017 sec - in org.apache.activemq.artemis.core.list.PriorityLinkedListTest
Running org.apache.activemq.artemis.core.message.impl.MessagePropertyTest
[main] 16:03:32,103 INFO  [org.apache.activemq.artemis.core.server] #*#*# Starting test: testProperties()...
#test testProperties
[main] 16:03:32,128 INFO  [org.apache.activemq.artemis.core.server] AMQ221000: live Message
Broker is starting with configuration Broker Configuration (clustered=false,journalDirectory=<https://builds.apache.org/job/ActiveMQ-Artemis-Master/ws/artemis-server/./target/tmp/junit1997996201652871378/journal0-L,bindingsDirectory=/home/jenkins/jenkins-slave/workspace/ActiveMQ-Artemis-Master/artemis-server/./target/tmp/junit1997996201652871378/bindings0-L,largeMessagesDirectory=/home/jenkins/jenkins-slave/workspace/ActiveMQ-Artemis-Master/artemis-server/./target/tmp/junit1997996201652871378/large-msg0-L,pagingDirectory=/home/jenkins/jenkins-slave/workspace/ActiveMQ-Artemis-Master/artemis-server/./target/tmp/junit1997996201652871378/page0-L)>
[main] 16:03:32,129 INFO  [org.apache.activemq.artemis.core.server] AMQ221012: Using AIO Journal
[main] 16:03:32,130 INFO  [org.apache.activemq.artemis.core.server] AMQ221043: Protocol module
found: [artemis-server]. Adding protocol support for: CORE
[main] 16:03:32,137 INFO  [org.apache.activemq.artemis.core.server] AMQ221034: Waiting indefinitely
to obtain live lock
[main] 16:03:32,138 INFO  [org.apache.activemq.artemis.core.server] AMQ221035: Live Server
Obtained live lock
[main] 16:03:32,218 INFO  [org.apache.activemq.artemis.core.server] AMQ221007: Server is now
live
[main] 16:03:32,218 INFO  [org.apache.activemq.artemis.core.server] AMQ221001: Apache ActiveMQ
Artemis Message Broker version 2.1.0-SNAPSHOT [localhost, nodeID=39fe26ef-2c2c-11e7-8f16-02424ee64064]

[Finalizer] 16:03:32,394 WARN  [org.apache.activemq.artemis.core.server] AMQ222000: ActiveMQServer
is being finalized and has not been stopped. Please remember to stop the server before letting
it go out of scope
[Finalizer] 16:03:32,398 INFO  [org.apache.activemq.artemis.core.server] AMQ221002: Apache
ActiveMQ Artemis Message Broker version 2.1.0-SNAPSHOT [null] stopped, uptime 3.674 seconds
[Finalizer] 16:03:32,401 WARN  [org.apache.activemq.artemis.core.server] AMQ222000: ActiveMQServer
is being finalized and has not been stopped. Please remember to stop the server before letting
it go out of scope
[Finalizer] 16:03:32,402 INFO  [org.apache.activemq.artemis.core.server] AMQ221002: Apache
ActiveMQ Artemis Message Broker version 2.1.0-SNAPSHOT [null] stopped, uptime 0.891 seconds
[Finalizer] 16:03:32,409 WARN  [org.apache.activemq.artemis.core.server] AMQ222000: ActiveMQServer
is being finalized and has not been stopped. Please remember to stop the server before letting
it go out of scope
[Finalizer] 16:03:32,410 INFO  [org.apache.activemq.artemis.core.server] AMQ221002: Apache
ActiveMQ Artemis Message Broker version 2.1.0-SNAPSHOT [null] stopped, uptime 0.945 seconds
[main] 16:03:33,080 INFO  [org.apache.activemq.artemis.core.server] AMQ221002: Apache ActiveMQ
Artemis Message Broker version 2.1.0-SNAPSHOT [39fe26ef-2c2c-11e7-8f16-02424ee64064] stopped,
uptime 0.965 seconds
[main] 16:03:33,087 INFO  [org.apache.activemq.artemis.core.server] #*#*# Finished test: testProperties()...
Tests run: 1, Failures: 0, Errors: 0, Skipped: 0, Time elapsed: 0.987 sec - in org.apache.activemq.artemis.core.message.impl.MessagePropertyTest
Running org.apache.activemq.artemis.core.reload.ReloadManagerTest
[main] 16:03:33,089 INFO  [org.apache.activemq.artemis.core.server] #*#*# Starting test: testUpdate()...
#test testUpdate
[main] 16:03:34,102 INFO  [org.apache.activemq.artemis.core.server] #*#*# Finished test: testUpdate()...
[main] 16:03:34,103 INFO  [org.apache.activemq.artemis.core.server] #*#*# Starting test: testUpdateWithSpace()...
#test testUpdateWithSpace
[main] 16:03:35,115 INFO  [org.apache.activemq.artemis.core.server] #*#*# Finished test: testUpdateWithSpace()...
Tests run: 2, Failures: 0, Errors: 0, Skipped: 0, Time elapsed: 2.028 sec - in org.apache.activemq.artemis.core.reload.ReloadManagerTest
Running org.apache.activemq.artemis.core.security.RoleTest
Tests run: 5, Failures: 0, Errors: 0, Skipped: 0, Time elapsed: 0.009 sec - in org.apache.activemq.artemis.core.security.RoleTest
Running org.apache.activemq.artemis.core.security.jaas.CertificateLoginModuleTest
Tests run: 3, Failures: 0, Errors: 0, Skipped: 0, Time elapsed: 0.023 sec - in org.apache.activemq.artemis.core.security.jaas.CertificateLoginModuleTest
Running org.apache.activemq.artemis.core.security.jaas.GuestLoginModuleTest
Tests run: 2, Failures: 0, Errors: 0, Skipped: 0, Time elapsed: 0.049 sec - in org.apache.activemq.artemis.core.security.jaas.GuestLoginModuleTest
Running org.apache.activemq.artemis.core.security.jaas.JAASSecurityManagerTest
loader: sun.misc.Launcher$AppClassLoader@4aa298b7
loader: sun.misc.Launcher$AppClassLoader@4aa298b7
Tests run: 2, Failures: 0, Errors: 0, Skipped: 0, Time elapsed: 0.103 sec - in org.apache.activemq.artemis.core.security.jaas.JAASSecurityManagerTest
Running org.apache.activemq.artemis.core.security.jaas.LDAPLoginModuleTest
Using partition factory JdbmPartitionFactory
[main] 16:03:41,287 ERROR [org.apache.activemq.artemis.core.server] javax.naming.NamingException:
Empty password is not allowed
Tests run: 3, Failures: 0, Errors: 0, Skipped: 0, Time elapsed: 6.784 sec - in org.apache.activemq.artemis.core.security.jaas.LDAPLoginModuleTest
Running org.apache.activemq.artemis.core.security.jaas.LDAPModuleRoleExpansionTest
Using partition factory JdbmPartitionFactory
Tests run: 2, Failures: 0, Errors: 0, Skipped: 0, Time elapsed: 2.549 sec - in org.apache.activemq.artemis.core.security.jaas.LDAPModuleRoleExpansionTest
Running org.apache.activemq.artemis.core.security.jaas.PropertiesLoginModuleRaceConditionTest
Build step 'Invoke top-level Maven targets' marked build as failure
Performing Post build task...
Could not match :Too many files with unapproved license  : False
Logical operation result is FALSE
Skipping script  : cat ratReport.txt
END OF POST BUILD TASK 	: 0
Recording test results
Not sending mail to unregistered user mtaylor@redhat.com

Mime
View raw message