activemq-commits mailing list archives

Site index · List index
Message view « Date » · « Thread »
Top « Date » · « Thread »
From Apache Jenkins Server <jenk...@builds.apache.org>
Subject Build failed in Jenkins: ActiveMQ-Artemis-Master #982
Date Thu, 06 Apr 2017 15:48:19 GMT
See <https://builds.apache.org/job/ActiveMQ-Artemis-Master/982/display/redirect?page=changes>

Changes:

[nigro.fra] ARTEMIS-1025 Improve flow control on NettyConnection

------------------------------------------
[...truncated 3.37 MB...]
[INFO] Exclude: **/*.data
[INFO] Exclude: **/*.bin
[INFO] Exclude: **/src/test/resources/keystore
[INFO] Exclude: **/*.log
[INFO] Exclude: **/*.redo
[INFO] Exclude: **/node/**
[INFO] Exclude: **/node_modules/**
[INFO] Exclude: **/package.json
[INFO] Exclude: **/npm-shrinkwrap.json
[INFO] Exclude: **/CMakeFiles/
[INFO] Exclude: **/Makefile
[INFO] Exclude: **/cmake_install.cmake
[INFO] Exclude: artemis-native/src/main/c/org_apache_activemq_artemis_jlibaio_LibaioContext.h
[INFO] 12 resources included (use -debug for more details)
[INFO] Rat check: Summary over all files. Unapproved: 0, unknown: 0, generated: 0, approved:
12 licenses.
[INFO] 
[INFO] --- maven-resources-plugin:2.6:testResources (default-testResources) @ performance-tests
---
[INFO] Using 'UTF-8' encoding to copy filtered resources.
[INFO] skip non existing resourceDirectory <https://builds.apache.org/job/ActiveMQ-Artemis-Master/ws/tests/performance-tests/src/test/resources>
[INFO] Copying 3 resources
[INFO] Copying 3 resources
[INFO] Copying 3 resources
[INFO] 
[INFO] --- maven-compiler-plugin:3.1:testCompile (default-testCompile) @ performance-tests
---
[INFO] Nothing to compile - all classes are up to date
[INFO] 
[INFO] --- maven-surefire-plugin:2.18.1:test (default-test) @ performance-tests ---
[INFO] Tests are skipped.
[INFO]                                                                         
[INFO] ------------------------------------------------------------------------
[INFO] Building Smoke Tests 2.1.0-SNAPSHOT
[INFO] ------------------------------------------------------------------------
[INFO] 
[INFO] --- maven-enforcer-plugin:1.4:enforce (enforce-maven) @ smoke-tests ---
[INFO] 
[INFO] --- maven-enforcer-plugin:1.4:enforce (enforce-java) @ smoke-tests ---
[INFO] 
[INFO] --- maven-remote-resources-plugin:1.5:process (process-resource-bundles) @ smoke-tests
---
[INFO] 
[INFO] --- maven-resources-plugin:2.6:resources (default-resources) @ smoke-tests ---
[INFO] Using 'UTF-8' encoding to copy filtered resources.
[INFO] Copying 2 resources
[INFO] Copying 3 resources
[INFO] 
[INFO] --- maven-compiler-plugin:3.1:compile (default-compile) @ smoke-tests ---
[INFO] No sources to compile
[INFO] 
[INFO] --- maven-checkstyle-plugin:2.17:check (default) @ smoke-tests ---
[INFO] Starting audit...
Audit done.
[INFO] 
[INFO] --- apache-rat-plugin:0.12:check (default) @ smoke-tests ---
[INFO] Enabled default license matchers.
[INFO] Will parse SCM ignores for exclusions...
[INFO] Finished adding exclusions from SCM ignore files.
[INFO] 61 implicit excludes (use -debug for more details).
[INFO] Exclude: **/*.txt
[INFO] Exclude: **/*.md
[INFO] Exclude: etc/ide-settings/**
[INFO] Exclude: docs/**/*.json
[INFO] Exclude: docs/**/_book/
[INFO] Exclude: **/target/
[INFO] Exclude: **/META-INF/services/*
[INFO] Exclude: **/META-INF/MANIFEST.MF
[INFO] Exclude: **/*.iml
[INFO] Exclude: **/*.jceks
[INFO] Exclude: **/*.jks
[INFO] Exclude: **/org/apache/activemq/artemis/utils/json/**
[INFO] Exclude: **/org/apache/activemq/artemis/utils/Base64.java
[INFO] Exclude: **/.settings/**
[INFO] Exclude: **/.project
[INFO] Exclude: **/.classpath
[INFO] Exclude: **/.editorconfig
[INFO] Exclude: **/.checkstyle
[INFO] Exclude: **/.factorypath
[INFO] Exclude: **/org.apache.activemq.artemis.cfg
[INFO] Exclude: **/nb-configuration.xml
[INFO] Exclude: **/*.data
[INFO] Exclude: **/*.bin
[INFO] Exclude: **/src/test/resources/keystore
[INFO] Exclude: **/*.log
[INFO] Exclude: **/*.redo
[INFO] Exclude: **/node/**
[INFO] Exclude: **/node_modules/**
[INFO] Exclude: **/package.json
[INFO] Exclude: **/npm-shrinkwrap.json
[INFO] Exclude: **/CMakeFiles/
[INFO] Exclude: **/Makefile
[INFO] Exclude: **/cmake_install.cmake
[INFO] Exclude: artemis-native/src/main/c/org_apache_activemq_artemis_jlibaio_LibaioContext.h
[INFO] 5 resources included (use -debug for more details)
[INFO] Rat check: Summary over all files. Unapproved: 0, unknown: 0, generated: 0, approved:
5 licenses.
[INFO] 
[INFO] --- maven-enforcer-plugin:1.4:enforce (enforce-maven) @ smoke-tests ---
[INFO] 
[INFO] --- maven-enforcer-plugin:1.4:enforce (enforce-java) @ smoke-tests ---
[INFO] 
[INFO] --- maven-remote-resources-plugin:1.5:process (process-resource-bundles) @ smoke-tests
---
[INFO] 
[INFO] --- maven-resources-plugin:2.6:resources (default-resources) @ smoke-tests ---
[INFO] Using 'UTF-8' encoding to copy filtered resources.
[INFO] Copying 2 resources
[INFO] Copying 3 resources
[INFO] Copying 3 resources
[INFO] 
[INFO] --- maven-compiler-plugin:3.1:compile (default-compile) @ smoke-tests ---
[INFO] No sources to compile
[INFO] 
[INFO] --- maven-checkstyle-plugin:2.17:check (default) @ smoke-tests ---
[INFO] Starting audit...
Audit done.
[INFO] 
[INFO] --- apache-rat-plugin:0.12:check (default) @ smoke-tests ---
[INFO] Enabled default license matchers.
[INFO] Will parse SCM ignores for exclusions...
[INFO] Finished adding exclusions from SCM ignore files.
[INFO] 61 implicit excludes (use -debug for more details).
[INFO] Exclude: **/*.txt
[INFO] Exclude: **/*.md
[INFO] Exclude: etc/ide-settings/**
[INFO] Exclude: docs/**/*.json
[INFO] Exclude: docs/**/_book/
[INFO] Exclude: **/target/
[INFO] Exclude: **/META-INF/services/*
[INFO] Exclude: **/META-INF/MANIFEST.MF
[INFO] Exclude: **/*.iml
[INFO] Exclude: **/*.jceks
[INFO] Exclude: **/*.jks
[INFO] Exclude: **/org/apache/activemq/artemis/utils/json/**
[INFO] Exclude: **/org/apache/activemq/artemis/utils/Base64.java
[INFO] Exclude: **/.settings/**
[INFO] Exclude: **/.project
[INFO] Exclude: **/.classpath
[INFO] Exclude: **/.editorconfig
[INFO] Exclude: **/.checkstyle
[INFO] Exclude: **/.factorypath
[INFO] Exclude: **/org.apache.activemq.artemis.cfg
[INFO] Exclude: **/nb-configuration.xml
[INFO] Exclude: **/*.data
[INFO] Exclude: **/*.bin
[INFO] Exclude: **/src/test/resources/keystore
[INFO] Exclude: **/*.log
[INFO] Exclude: **/*.redo
[INFO] Exclude: **/node/**
[INFO] Exclude: **/node_modules/**
[INFO] Exclude: **/package.json
[INFO] Exclude: **/npm-shrinkwrap.json
[INFO] Exclude: **/CMakeFiles/
[INFO] Exclude: **/Makefile
[INFO] Exclude: **/cmake_install.cmake
[INFO] Exclude: artemis-native/src/main/c/org_apache_activemq_artemis_jlibaio_LibaioContext.h
[INFO] 5 resources included (use -debug for more details)
[INFO] Rat check: Summary over all files. Unapproved: 0, unknown: 0, generated: 0, approved:
5 licenses.
[INFO] 
[INFO] --- maven-resources-plugin:2.6:testResources (default-testResources) @ smoke-tests
---
[INFO] Using 'UTF-8' encoding to copy filtered resources.
[INFO] skip non existing resourceDirectory <https://builds.apache.org/job/ActiveMQ-Artemis-Master/ws/tests/smoke-tests/src/test/resources>
[INFO] Copying 3 resources
[INFO] Copying 3 resources
[INFO] 
[INFO] --- maven-compiler-plugin:3.1:testCompile (default-testCompile) @ smoke-tests ---
[INFO] Changes detected - recompiling the module!
[INFO] Compiling 2 source files to <https://builds.apache.org/job/ActiveMQ-Artemis-Master/ws/tests/smoke-tests/target/test-classes>
Note: <https://builds.apache.org/job/ActiveMQ-Artemis-Master/ws/tests/smoke-tests/src/test/java/org/apache/activemq/artemis/tests/smoke/common/SmokeTestBase.java>
uses unchecked or unsafe operations.
Note: Recompile with -Xlint:unchecked for details.
[INFO] 
[INFO] --- artemis-maven-plugin:2.1.0-SNAPSHOT:create (create0) @ smoke-tests ---
[INFO] Local       id: local
      url: file:///home/jenkins/.m2/repository/
   layout: default
snapshots: [enabled => true, update => always]
 releases: [enabled => true, update => always]

[ERROR] ********************************************************************************************
[ERROR] Could not locate suitable Artemis.home on either <https://builds.apache.org/job/ActiveMQ-Artemis-Master/ws/tests/smoke-tests/../..>
or <https://builds.apache.org/job/ActiveMQ-Artemis-Master/ws/tests/smoke-tests/../../artemis-distribution/target/apache-artemis-2.1.0-SNAPSHOT-bin/apache-artemis-2.1.0-SNAPSHOT>
[ERROR] Use the binary distribution or build the distribution before running the examples
[ERROR] ********************************************************************************************
[INFO] ------------------------------------------------------------------------
[INFO] Reactor Summary:
[INFO] 
[INFO] ActiveMQ Artemis Parent ............................ SUCCESS [  8.036 s]
[INFO] ActiveMQ Artemis Commons ........................... SUCCESS [ 42.770 s]
[INFO] ActiveMQ Artemis Core Client ....................... SUCCESS [ 25.814 s]
[INFO] ActiveMQ Artemis Selector Implementation ........... SUCCESS [  7.769 s]
[INFO] ActiveMQ Artemis JMS Client ........................ SUCCESS [ 10.816 s]
[INFO] ActiveMQ Artemis Native POM ........................ SUCCESS [ 10.029 s]
[INFO] ActiveMQ Artemis Journal ........................... SUCCESS [  8.157 s]
[INFO] ActiveMQ Artemis JDBC Store ........................ SUCCESS [ 10.414 s]
[INFO] ActiveMQ Artemis Server ............................ SUCCESS [01:19 min]
[INFO] ActiveMQ Artemis Protocols ......................... SUCCESS [  1.791 s]
[INFO] ActiveMQ Artemis AMQP Protocol ..................... SUCCESS [ 13.396 s]
[INFO] ActiveMQ Artemis STOMP Protocol .................... SUCCESS [  4.882 s]
[INFO] ActiveMQ Artemis OpenWire Protocol ................. SUCCESS [  5.154 s]
[INFO] ActiveMQ Artemis HQClient Protocol ................. SUCCESS [  2.627 s]
[INFO] ActiveMQ Artemis HornetQ Protocol .................. SUCCESS [  3.025 s]
[INFO] ActiveMQ Artemis MQTT Protocol ..................... SUCCESS [  3.919 s]
[INFO] ActiveMQ Artemis DTO ............................... SUCCESS [  6.038 s]
[INFO] ActiveMQ Artemis Service Extensions ................ SUCCESS [  4.946 s]
[INFO] ActiveMQ Artemis JMS Server ........................ SUCCESS [  5.794 s]
[INFO] ActiveMQ Artemis CDI Integration ................... SUCCESS [ 10.935 s]
[INFO] ActiveMQ Artemis Boot .............................. SUCCESS [  1.955 s]
[INFO] ActiveMQ Artemis Tools ............................. SUCCESS [  2.864 s]
[INFO] ActiveMQ Artemis CLI ............................... SUCCESS [ 35.846 s]
[INFO] ActiveMQ Artemis Web ............................... SUCCESS [ 10.968 s]
[INFO] ActiveMQ Artemis Web ............................... SUCCESS [  3.196 s]
[INFO] ActiveMQ Artemis JUnit Rules ....................... SUCCESS [ 14.216 s]
[INFO] ActiveMQ Artemis RAR POM ........................... SUCCESS [  6.533 s]
[INFO] ActiveMQ Artemis REST Interface Implementation ..... SUCCESS [01:40 min]
[INFO] ActiveMQ Artemis Maven Plugin ...................... SUCCESS [ 11.290 s]
[INFO] ActiveMQ Artemis Server OSGi ....................... SUCCESS [  4.688 s]
[INFO] ActiveMQ Artemis Spring Integration ................ SUCCESS [  3.362 s]
[INFO] Apache ActiveMQ Artemis Distribution ............... SUCCESS [  7.274 s]
[INFO] ActiveMQ Artemis Tests POM ......................... SUCCESS [  3.292 s]
[INFO] ActiveMQ Artemis Unit Tests ........................ SUCCESS [03:04 min]
[INFO] ActiveMQ Artemis Joram Tests ....................... SUCCESS [01:52 min]
[INFO] ActiveMQ Artemis timing Tests ...................... SUCCESS [  4.346 s]
[INFO] ActiveMQ Artemis JMS Tests ......................... SUCCESS [03:34 min]
[INFO] ActiveMQ Artemis Features .......................... SUCCESS [  0.188 s]
[INFO] ActiveMQ Artemis Test Support ...................... SUCCESS [  5.503 s]
[INFO] ActiveMQ Artemis Integration Tests ................. SUCCESS [01:14 min]
[INFO] ActiveMQ Artemis soak Tests ........................ SUCCESS [  6.807 s]
[INFO] ActiveMQ Artemis stress Tests ...................... SUCCESS [  6.054 s]
[INFO] ActiveMQ Artemis performance Tests ................. SUCCESS [  4.710 s]
[INFO] Smoke Tests ........................................ FAILURE [  5.964 s]
[INFO] ActiveMQ Artemis Extra Tests ....................... SKIPPED
[INFO] ------------------------------------------------------------------------
[INFO] BUILD FAILURE
[INFO] ------------------------------------------------------------------------
[INFO] Total time: 18:13 min
[INFO] Finished at: 2017-04-06T15:47:27+00:00
[INFO] Final Memory: 348M/3175M
[INFO] ------------------------------------------------------------------------
[ERROR] Failed to execute goal org.apache.activemq:artemis-maven-plugin:2.1.0-SNAPSHOT:create
(create0) on project smoke-tests: Couldn't find artemis.home -> [Help 1]
[ERROR] 
[ERROR] To see the full stack trace of the errors, re-run Maven with the -e switch.
[ERROR] Re-run Maven using the -X switch to enable full debug logging.
[ERROR] 
[ERROR] For more information about the errors and possible solutions, please read the following
articles:
[ERROR] [Help 1] http://cwiki.apache.org/confluence/display/MAVEN/MojoExecutionException
[ERROR] 
[ERROR] After correcting the problems, you can resume the build with the command
[ERROR]   mvn <goals> -rf :smoke-tests
Build step 'Invoke top-level Maven targets' marked build as failure
Performing Post build task...
Could not match :Too many files with unapproved license  : False
Logical operation result is FALSE
Skipping script  : cat ratReport.txt
END OF POST BUILD TASK 	: 0
Recording test results

Mime
View raw message