activemq-commits mailing list archives

Site index · List index
Message view « Date » · « Thread »
Top « Date » · « Thread »
From Apache Jenkins Server <jenk...@builds.apache.org>
Subject Build failed in Jenkins: ActiveMQ-Artemis-Master #985
Date Thu, 06 Apr 2017 17:48:57 GMT
See <https://builds.apache.org/job/ActiveMQ-Artemis-Master/985/display/redirect?page=changes>

Changes:

[clebertsuconic] NO-JIRA Fixed log level test on NettyConnection

------------------------------------------
[...truncated 3.22 MB...]
[INFO] Exclude: **/*.data
[INFO] Exclude: **/*.bin
[INFO] Exclude: **/src/test/resources/keystore
[INFO] Exclude: **/*.log
[INFO] Exclude: **/*.redo
[INFO] Exclude: **/node/**
[INFO] Exclude: **/node_modules/**
[INFO] Exclude: **/package.json
[INFO] Exclude: **/npm-shrinkwrap.json
[INFO] Exclude: **/CMakeFiles/
[INFO] Exclude: **/Makefile
[INFO] Exclude: **/cmake_install.cmake
[INFO] Exclude: artemis-native/src/main/c/org_apache_activemq_artemis_jlibaio_LibaioContext.h
[INFO] 12 resources included (use -debug for more details)
[INFO] Rat check: Summary over all files. Unapproved: 0, unknown: 0, generated: 0, approved:
12 licenses.
[INFO] 
[INFO] --- maven-resources-plugin:2.6:testResources (default-testResources) @ performance-tests
---
[INFO] Using 'UTF-8' encoding to copy filtered resources.
[INFO] skip non existing resourceDirectory <https://builds.apache.org/job/ActiveMQ-Artemis-Master/ws/tests/performance-tests/src/test/resources>
[INFO] Copying 3 resources
[INFO] Copying 3 resources
[INFO] Copying 3 resources
[INFO] 
[INFO] --- maven-compiler-plugin:3.1:testCompile (default-testCompile) @ performance-tests
---
[INFO] Nothing to compile - all classes are up to date
[INFO] 
[INFO] --- maven-surefire-plugin:2.18.1:test (default-test) @ performance-tests ---
[INFO] Tests are skipped.
[INFO]                                                                         
[INFO] ------------------------------------------------------------------------
[INFO] Building Smoke Tests 2.1.0-SNAPSHOT
[INFO] ------------------------------------------------------------------------
[INFO] 
[INFO] --- maven-enforcer-plugin:1.4:enforce (enforce-maven) @ smoke-tests ---
[INFO] 
[INFO] --- maven-enforcer-plugin:1.4:enforce (enforce-java) @ smoke-tests ---
[INFO] 
[INFO] --- maven-remote-resources-plugin:1.5:process (process-resource-bundles) @ smoke-tests
---
[INFO] 
[INFO] --- maven-resources-plugin:2.6:resources (default-resources) @ smoke-tests ---
[INFO] Using 'UTF-8' encoding to copy filtered resources.
[INFO] Copying 2 resources
[INFO] Copying 3 resources
[INFO] 
[INFO] --- maven-compiler-plugin:3.1:compile (default-compile) @ smoke-tests ---
[INFO] No sources to compile
[INFO] 
[INFO] --- maven-checkstyle-plugin:2.17:check (default) @ smoke-tests ---
[INFO] Starting audit...
Audit done.
[INFO] 
[INFO] --- apache-rat-plugin:0.12:check (default) @ smoke-tests ---
[INFO] Enabled default license matchers.
[INFO] Will parse SCM ignores for exclusions...
[INFO] Finished adding exclusions from SCM ignore files.
[INFO] 61 implicit excludes (use -debug for more details).
[INFO] Exclude: **/*.txt
[INFO] Exclude: **/*.md
[INFO] Exclude: etc/ide-settings/**
[INFO] Exclude: docs/**/*.json
[INFO] Exclude: docs/**/_book/
[INFO] Exclude: **/target/
[INFO] Exclude: **/META-INF/services/*
[INFO] Exclude: **/META-INF/MANIFEST.MF
[INFO] Exclude: **/*.iml
[INFO] Exclude: **/*.jceks
[INFO] Exclude: **/*.jks
[INFO] Exclude: **/org/apache/activemq/artemis/utils/json/**
[INFO] Exclude: **/org/apache/activemq/artemis/utils/Base64.java
[INFO] Exclude: **/.settings/**
[INFO] Exclude: **/.project
[INFO] Exclude: **/.classpath
[INFO] Exclude: **/.editorconfig
[INFO] Exclude: **/.checkstyle
[INFO] Exclude: **/.factorypath
[INFO] Exclude: **/org.apache.activemq.artemis.cfg
[INFO] Exclude: **/nb-configuration.xml
[INFO] Exclude: **/*.data
[INFO] Exclude: **/*.bin
[INFO] Exclude: **/src/test/resources/keystore
[INFO] Exclude: **/*.log
[INFO] Exclude: **/*.redo
[INFO] Exclude: **/node/**
[INFO] Exclude: **/node_modules/**
[INFO] Exclude: **/package.json
[INFO] Exclude: **/npm-shrinkwrap.json
[INFO] Exclude: **/CMakeFiles/
[INFO] Exclude: **/Makefile
[INFO] Exclude: **/cmake_install.cmake
[INFO] Exclude: artemis-native/src/main/c/org_apache_activemq_artemis_jlibaio_LibaioContext.h
[INFO] 5 resources included (use -debug for more details)
[INFO] Rat check: Summary over all files. Unapproved: 0, unknown: 0, generated: 0, approved:
5 licenses.
[INFO] 
[INFO] --- maven-enforcer-plugin:1.4:enforce (enforce-maven) @ smoke-tests ---
[INFO] 
[INFO] --- maven-enforcer-plugin:1.4:enforce (enforce-java) @ smoke-tests ---
[INFO] 
[INFO] --- maven-remote-resources-plugin:1.5:process (process-resource-bundles) @ smoke-tests
---
[INFO] 
[INFO] --- maven-resources-plugin:2.6:resources (default-resources) @ smoke-tests ---
[INFO] Using 'UTF-8' encoding to copy filtered resources.
[INFO] Copying 2 resources
[INFO] Copying 3 resources
[INFO] Copying 3 resources
[INFO] 
[INFO] --- maven-compiler-plugin:3.1:compile (default-compile) @ smoke-tests ---
[INFO] No sources to compile
[INFO] 
[INFO] --- maven-checkstyle-plugin:2.17:check (default) @ smoke-tests ---
[INFO] Starting audit...
Audit done.
[INFO] 
[INFO] --- apache-rat-plugin:0.12:check (default) @ smoke-tests ---
[INFO] Enabled default license matchers.
[INFO] Will parse SCM ignores for exclusions...
[INFO] Finished adding exclusions from SCM ignore files.
[INFO] 61 implicit excludes (use -debug for more details).
[INFO] Exclude: **/*.txt
[INFO] Exclude: **/*.md
[INFO] Exclude: etc/ide-settings/**
[INFO] Exclude: docs/**/*.json
[INFO] Exclude: docs/**/_book/
[INFO] Exclude: **/target/
[INFO] Exclude: **/META-INF/services/*
[INFO] Exclude: **/META-INF/MANIFEST.MF
[INFO] Exclude: **/*.iml
[INFO] Exclude: **/*.jceks
[INFO] Exclude: **/*.jks
[INFO] Exclude: **/org/apache/activemq/artemis/utils/json/**
[INFO] Exclude: **/org/apache/activemq/artemis/utils/Base64.java
[INFO] Exclude: **/.settings/**
[INFO] Exclude: **/.project
[INFO] Exclude: **/.classpath
[INFO] Exclude: **/.editorconfig
[INFO] Exclude: **/.checkstyle
[INFO] Exclude: **/.factorypath
[INFO] Exclude: **/org.apache.activemq.artemis.cfg
[INFO] Exclude: **/nb-configuration.xml
[INFO] Exclude: **/*.data
[INFO] Exclude: **/*.bin
[INFO] Exclude: **/src/test/resources/keystore
[INFO] Exclude: **/*.log
[INFO] Exclude: **/*.redo
[INFO] Exclude: **/node/**
[INFO] Exclude: **/node_modules/**
[INFO] Exclude: **/package.json
[INFO] Exclude: **/npm-shrinkwrap.json
[INFO] Exclude: **/CMakeFiles/
[INFO] Exclude: **/Makefile
[INFO] Exclude: **/cmake_install.cmake
[INFO] Exclude: artemis-native/src/main/c/org_apache_activemq_artemis_jlibaio_LibaioContext.h
[INFO] 5 resources included (use -debug for more details)
[INFO] Rat check: Summary over all files. Unapproved: 0, unknown: 0, generated: 0, approved:
5 licenses.
[INFO] 
[INFO] --- maven-resources-plugin:2.6:testResources (default-testResources) @ smoke-tests
---
[INFO] Using 'UTF-8' encoding to copy filtered resources.
[INFO] skip non existing resourceDirectory <https://builds.apache.org/job/ActiveMQ-Artemis-Master/ws/tests/smoke-tests/src/test/resources>
[INFO] Copying 3 resources
[INFO] Copying 3 resources
[INFO] 
[INFO] --- maven-compiler-plugin:3.1:testCompile (default-testCompile) @ smoke-tests ---
[INFO] Changes detected - recompiling the module!
[INFO] Compiling 2 source files to <https://builds.apache.org/job/ActiveMQ-Artemis-Master/ws/tests/smoke-tests/target/test-classes>
Note: <https://builds.apache.org/job/ActiveMQ-Artemis-Master/ws/tests/smoke-tests/src/test/java/org/apache/activemq/artemis/tests/smoke/common/SmokeTestBase.java>
uses unchecked or unsafe operations.
Note: Recompile with -Xlint:unchecked for details.
[INFO] 
[INFO] --- artemis-maven-plugin:2.1.0-SNAPSHOT:create (create0) @ smoke-tests ---
[INFO] Local       id: local
      url: file:///home/jenkins/.m2/repository/
   layout: default
snapshots: [enabled => true, update => always]
 releases: [enabled => true, update => always]

[ERROR] ********************************************************************************************
[ERROR] Could not locate suitable Artemis.home on either <https://builds.apache.org/job/ActiveMQ-Artemis-Master/ws/tests/smoke-tests/../..>
or <https://builds.apache.org/job/ActiveMQ-Artemis-Master/ws/tests/smoke-tests/../../artemis-distribution/target/apache-artemis-2.1.0-SNAPSHOT-bin/apache-artemis-2.1.0-SNAPSHOT>
[ERROR] Use the binary distribution or build the distribution before running the examples
[ERROR] ********************************************************************************************
[INFO] ------------------------------------------------------------------------
[INFO] Reactor Summary:
[INFO] 
[INFO] ActiveMQ Artemis Parent ............................ SUCCESS [  4.213 s]
[INFO] ActiveMQ Artemis Commons ........................... SUCCESS [ 13.104 s]
[INFO] ActiveMQ Artemis Core Client ....................... SUCCESS [ 10.663 s]
[INFO] ActiveMQ Artemis Selector Implementation ........... SUCCESS [  4.324 s]
[INFO] ActiveMQ Artemis JMS Client ........................ SUCCESS [  4.218 s]
[INFO] ActiveMQ Artemis Native POM ........................ SUCCESS [  4.581 s]
[INFO] ActiveMQ Artemis Journal ........................... SUCCESS [  3.675 s]
[INFO] ActiveMQ Artemis JDBC Store ........................ SUCCESS [  5.260 s]
[INFO] ActiveMQ Artemis Server ............................ SUCCESS [ 47.480 s]
[INFO] ActiveMQ Artemis Protocols ......................... SUCCESS [  0.969 s]
[INFO] ActiveMQ Artemis AMQP Protocol ..................... SUCCESS [  6.224 s]
[INFO] ActiveMQ Artemis STOMP Protocol .................... SUCCESS [  2.203 s]
[INFO] ActiveMQ Artemis OpenWire Protocol ................. SUCCESS [  2.233 s]
[INFO] ActiveMQ Artemis HQClient Protocol ................. SUCCESS [  1.088 s]
[INFO] ActiveMQ Artemis HornetQ Protocol .................. SUCCESS [  1.381 s]
[INFO] ActiveMQ Artemis MQTT Protocol ..................... SUCCESS [  1.896 s]
[INFO] ActiveMQ Artemis DTO ............................... SUCCESS [  2.791 s]
[INFO] ActiveMQ Artemis Service Extensions ................ SUCCESS [  2.634 s]
[INFO] ActiveMQ Artemis JMS Server ........................ SUCCESS [  2.511 s]
[INFO] ActiveMQ Artemis CDI Integration ................... SUCCESS [  4.935 s]
[INFO] ActiveMQ Artemis Boot .............................. SUCCESS [  1.025 s]
[INFO] ActiveMQ Artemis Tools ............................. SUCCESS [  1.605 s]
[INFO] ActiveMQ Artemis CLI ............................... SUCCESS [ 24.547 s]
[INFO] ActiveMQ Artemis Web ............................... SUCCESS [  6.199 s]
[INFO] ActiveMQ Artemis Web ............................... SUCCESS [  1.437 s]
[INFO] ActiveMQ Artemis JUnit Rules ....................... SUCCESS [  6.578 s]
[INFO] ActiveMQ Artemis RAR POM ........................... SUCCESS [  3.051 s]
[INFO] ActiveMQ Artemis REST Interface Implementation ..... SUCCESS [01:25 min]
[INFO] ActiveMQ Artemis Maven Plugin ...................... SUCCESS [  4.936 s]
[INFO] ActiveMQ Artemis Server OSGi ....................... SUCCESS [  2.219 s]
[INFO] ActiveMQ Artemis Spring Integration ................ SUCCESS [  1.614 s]
[INFO] Apache ActiveMQ Artemis Distribution ............... SUCCESS [  3.182 s]
[INFO] ActiveMQ Artemis Tests POM ......................... SUCCESS [  1.764 s]
[INFO] ActiveMQ Artemis Unit Tests ........................ SUCCESS [02:44 min]
[INFO] ActiveMQ Artemis Joram Tests ....................... SUCCESS [ 35.057 s]
[INFO] ActiveMQ Artemis timing Tests ...................... SUCCESS [  2.129 s]
[INFO] ActiveMQ Artemis JMS Tests ......................... SUCCESS [03:12 min]
[INFO] ActiveMQ Artemis Features .......................... SUCCESS [  0.105 s]
[INFO] ActiveMQ Artemis Test Support ...................... SUCCESS [  2.430 s]
[INFO] ActiveMQ Artemis Integration Tests ................. SUCCESS [ 30.108 s]
[INFO] ActiveMQ Artemis soak Tests ........................ SUCCESS [  3.086 s]
[INFO] ActiveMQ Artemis stress Tests ...................... SUCCESS [  3.095 s]
[INFO] ActiveMQ Artemis performance Tests ................. SUCCESS [  1.978 s]
[INFO] Smoke Tests ........................................ FAILURE [  2.807 s]
[INFO] ActiveMQ Artemis Extra Tests ....................... SKIPPED
[INFO] ------------------------------------------------------------------------
[INFO] BUILD FAILURE
[INFO] ------------------------------------------------------------------------
[INFO] Total time: 11:49 min
[INFO] Finished at: 2017-04-06T17:48:48+00:00
[INFO] Final Memory: 389M/6056M
[INFO] ------------------------------------------------------------------------
[ERROR] Failed to execute goal org.apache.activemq:artemis-maven-plugin:2.1.0-SNAPSHOT:create
(create0) on project smoke-tests: Couldn't find artemis.home -> [Help 1]
[ERROR] 
[ERROR] To see the full stack trace of the errors, re-run Maven with the -e switch.
[ERROR] Re-run Maven using the -X switch to enable full debug logging.
[ERROR] 
[ERROR] For more information about the errors and possible solutions, please read the following
articles:
[ERROR] [Help 1] http://cwiki.apache.org/confluence/display/MAVEN/MojoExecutionException
[ERROR] 
[ERROR] After correcting the problems, you can resume the build with the command
[ERROR]   mvn <goals> -rf :smoke-tests
Build step 'Invoke top-level Maven targets' marked build as failure
Performing Post build task...
Could not match :Too many files with unapproved license  : False
Logical operation result is FALSE
Skipping script  : cat ratReport.txt
END OF POST BUILD TASK 	: 0
Recording test results

Mime
View raw message