activemq-commits mailing list archives

Site index · List index
Message view « Date » · « Thread »
Top « Date » · « Thread »
From Apache Jenkins Server <jenk...@builds.apache.org>
Subject Build failed in Jenkins: ActiveMQ-Artemis-Master #958
Date Wed, 29 Mar 2017 17:20:52 GMT
See <https://builds.apache.org/job/ActiveMQ-Artemis-Master/958/display/redirect?page=changes>

Changes:

[mtaylor] ARTEMIS-1084 Throw RunTime on bad Oracle table size

------------------------------------------
[...truncated 1.60 MB...]
	at org.junit.runners.ParentRunner.runLeaf(ParentRunner.java:271) [junit-4.11.jar:]
	at org.junit.runners.BlockJUnit4ClassRunner.runChild(BlockJUnit4ClassRunner.java:70) [junit-4.11.jar:]
	at org.junit.runners.BlockJUnit4ClassRunner.runChild(BlockJUnit4ClassRunner.java:50) [junit-4.11.jar:]
	at org.junit.runners.ParentRunner$3.run(ParentRunner.java:238) [junit-4.11.jar:]
	at org.junit.runners.ParentRunner$1.schedule(ParentRunner.java:63) [junit-4.11.jar:]
	at org.junit.runners.ParentRunner.runChildren(ParentRunner.java:236) [junit-4.11.jar:]
	at org.junit.runners.ParentRunner.access$000(ParentRunner.java:53) [junit-4.11.jar:]
	at org.junit.runners.ParentRunner$2.evaluate(ParentRunner.java:229) [junit-4.11.jar:]
	at org.junit.runners.ParentRunner.run(ParentRunner.java:309) [junit-4.11.jar:]
	at org.apache.maven.surefire.junit4.JUnit4Provider.execute(JUnit4Provider.java:367) [surefire-junit4-2.19.1.jar:2.19.1]
	at org.apache.maven.surefire.junit4.JUnit4Provider.executeWithRerun(JUnit4Provider.java:274)
[surefire-junit4-2.19.1.jar:2.19.1]
	at org.apache.maven.surefire.junit4.JUnit4Provider.executeTestSet(JUnit4Provider.java:238)
[surefire-junit4-2.19.1.jar:2.19.1]
	at org.apache.maven.surefire.junit4.JUnit4Provider.invoke(JUnit4Provider.java:161) [surefire-junit4-2.19.1.jar:2.19.1]
	at org.apache.maven.surefire.booter.ForkedBooter.invokeProviderInSameClassLoader(ForkedBooter.java:290)
[surefire-booter-2.19.1.jar:2.19.1]
	at org.apache.maven.surefire.booter.ForkedBooter.runSuitesInProcess(ForkedBooter.java:242)
[surefire-booter-2.19.1.jar:2.19.1]
	at org.apache.maven.surefire.booter.ForkedBooter.main(ForkedBooter.java:121) [surefire-booter-2.19.1.jar:2.19.1]

[main] 17:19:47,844 INFO  [org.apache.activemq.artemis.ra] AMQ151001: Attempting to reconnect
org.apache.activemq.artemis.ra.inflow.ActiveMQActivationSpec(ra=org.apache.activemq.artemis.ra.ActiveMQResourceAdapter@3c4bef00
destination=test destinationType=javax.jms.Topic ack=Auto-acknowledge durable=false clientID=null
user=user password=**** maxSession=1)
[main] 17:19:47,845 INFO  [org.apache.activemq.artemis.ra] AMQ151004: Instantiating javax.jms.Topic
"test" directly since UseJNDI=false.
[Thread-0 (ActiveMQ-remoting-threads-ActiveMQServerImpl::serverUUID=e7b93a44-14a3-11e7-9e26-90b11c419d9b-923013679-827579900)]
17:19:47,849 WARN  [org.apache.activemq.artemis.core.server] AMQ222216: Security problem while
creating session: AMQ119031: Unable to validate user
[main] 17:19:47,851 ERROR [org.apache.activemq.artemis.ra] AMQ154003: Unable to reconnect
org.apache.activemq.artemis.ra.inflow.ActiveMQActivationSpec(ra=org.apache.activemq.artemis.ra.ActiveMQResourceAdapter@3c4bef00
destination=test destinationType=javax.jms.Topic ack=Auto-acknowledge durable=false clientID=null
user=user password=**** maxSession=1): ActiveMQSecurityException[errorType=SECURITY_EXCEPTION
message=AMQ119031: Unable to validate user]
	at org.apache.activemq.artemis.core.protocol.core.impl.ChannelImpl.sendBlocking(ChannelImpl.java:409)
[:]
	at org.apache.activemq.artemis.core.protocol.core.impl.ChannelImpl.sendBlocking(ChannelImpl.java:319)
[:]
	at org.apache.activemq.artemis.core.protocol.core.impl.ActiveMQClientProtocolManager.createSessionContext(ActiveMQClientProtocolManager.java:288)
[:]
	at org.apache.activemq.artemis.core.protocol.core.impl.ActiveMQClientProtocolManager.createSessionContext(ActiveMQClientProtocolManager.java:237)
[:]
	at org.apache.activemq.artemis.core.client.impl.ClientSessionFactoryImpl.createSessionChannel(ClientSessionFactoryImpl.java:1284)
[:]
	at org.apache.activemq.artemis.core.client.impl.ClientSessionFactoryImpl.createSessionInternal(ClientSessionFactoryImpl.java:670)
[:]
	at org.apache.activemq.artemis.core.client.impl.ClientSessionFactoryImpl.createSession(ClientSessionFactoryImpl.java:295)
[:]
	at org.apache.activemq.artemis.ra.ActiveMQResourceAdapter.createSession(ActiveMQResourceAdapter.java:1557)
[:]
	at org.apache.activemq.artemis.ra.inflow.ActiveMQActivation.setupSession(ActiveMQActivation.java:482)
[:]
	at org.apache.activemq.artemis.ra.inflow.ActiveMQActivation.setup(ActiveMQActivation.java:314)
[:]
	at org.apache.activemq.artemis.ra.inflow.ActiveMQActivation.reconnect(ActiveMQActivation.java:659)
[:]
	at org.apache.activemq.artemis.ra.inflow.ActiveMQActivation$SetupActivation.run(ActiveMQActivation.java:699)
[:]
	at org.apache.activemq.artemis.tests.unit.ra.BootstrapContext$1.scheduleWork(BootstrapContext.java:64)
[:]
	at org.apache.activemq.artemis.ra.inflow.ActiveMQActivation.start(ActiveMQActivation.java:251)
[:]
	at org.apache.activemq.artemis.tests.unit.ra.ResourceAdapterTest.testForConnectionLeakDuringActivationWhenSessionCreationFails(ResourceAdapterTest.java:547)
[:]
	at sun.reflect.NativeMethodAccessorImpl.invoke0(Native Method) [rt.jar:1.8.0_121]
	at sun.reflect.NativeMethodAccessorImpl.invoke(NativeMethodAccessorImpl.java:62) [rt.jar:1.8.0_121]
	at sun.reflect.DelegatingMethodAccessorImpl.invoke(DelegatingMethodAccessorImpl.java:43)
[rt.jar:1.8.0_121]
	at java.lang.reflect.Method.invoke(Method.java:498) [rt.jar:1.8.0_121]
	at org.junit.runners.model.FrameworkMethod$1.runReflectiveCall(FrameworkMethod.java:47) [junit-4.11.jar:]
	at org.junit.internal.runners.model.ReflectiveCallable.run(ReflectiveCallable.java:12) [junit-4.11.jar:]
	at org.junit.runners.model.FrameworkMethod.invokeExplosively(FrameworkMethod.java:44) [junit-4.11.jar:]
	at org.junit.internal.runners.statements.InvokeMethod.evaluate(InvokeMethod.java:17) [junit-4.11.jar:]
	at org.junit.internal.runners.statements.RunBefores.evaluate(RunBefores.java:26) [junit-4.11.jar:]
	at org.junit.internal.runners.statements.RunAfters.evaluate(RunAfters.java:27) [junit-4.11.jar:]
	at org.junit.rules.ExternalResource$1.evaluate(ExternalResource.java:48) [junit-4.11.jar:]
	at org.junit.rules.TestWatcher$1.evaluate(TestWatcher.java:55) [junit-4.11.jar:]
	at org.junit.rules.ExternalResource$1.evaluate(ExternalResource.java:48) [junit-4.11.jar:]
	at org.junit.rules.ExternalResource$1.evaluate(ExternalResource.java:48) [junit-4.11.jar:]
	at org.junit.rules.TestWatcher$1.evaluate(TestWatcher.java:55) [junit-4.11.jar:]
	at org.junit.rules.RunRules.evaluate(RunRules.java:20) [junit-4.11.jar:]
	at org.junit.runners.ParentRunner.runLeaf(ParentRunner.java:271) [junit-4.11.jar:]
	at org.junit.runners.BlockJUnit4ClassRunner.runChild(BlockJUnit4ClassRunner.java:70) [junit-4.11.jar:]
	at org.junit.runners.BlockJUnit4ClassRunner.runChild(BlockJUnit4ClassRunner.java:50) [junit-4.11.jar:]
	at org.junit.runners.ParentRunner$3.run(ParentRunner.java:238) [junit-4.11.jar:]
	at org.junit.runners.ParentRunner$1.schedule(ParentRunner.java:63) [junit-4.11.jar:]
	at org.junit.runners.ParentRunner.runChildren(ParentRunner.java:236) [junit-4.11.jar:]
	at org.junit.runners.ParentRunner.access$000(ParentRunner.java:53) [junit-4.11.jar:]
	at org.junit.runners.ParentRunner$2.evaluate(ParentRunner.java:229) [junit-4.11.jar:]
	at org.junit.runners.ParentRunner.run(ParentRunner.java:309) [junit-4.11.jar:]
	at org.apache.maven.surefire.junit4.JUnit4Provider.execute(JUnit4Provider.java:367) [surefire-junit4-2.19.1.jar:2.19.1]
	at org.apache.maven.surefire.junit4.JUnit4Provider.executeWithRerun(JUnit4Provider.java:274)
[surefire-junit4-2.19.1.jar:2.19.1]
	at org.apache.maven.surefire.junit4.JUnit4Provider.executeTestSet(JUnit4Provider.java:238)
[surefire-junit4-2.19.1.jar:2.19.1]
	at org.apache.maven.surefire.junit4.JUnit4Provider.invoke(JUnit4Provider.java:161) [surefire-junit4-2.19.1.jar:2.19.1]
	at org.apache.maven.surefire.booter.ForkedBooter.invokeProviderInSameClassLoader(ForkedBooter.java:290)
[surefire-booter-2.19.1.jar:2.19.1]
	at org.apache.maven.surefire.booter.ForkedBooter.runSuitesInProcess(ForkedBooter.java:242)
[surefire-booter-2.19.1.jar:2.19.1]
	at org.apache.maven.surefire.booter.ForkedBooter.main(ForkedBooter.java:121) [surefire-booter-2.19.1.jar:2.19.1]

[main] 17:19:47,854 INFO  [org.apache.activemq.artemis.ra] AMQ151003: resource adaptor stopped
[main] 17:19:47,856 INFO  [org.apache.activemq.artemis.core.server] AMQ221002: Apache ActiveMQ
Artemis Message Broker version 2.1.0-SNAPSHOT [e7b93a44-14a3-11e7-9e26-90b11c419d9b] stopped,
uptime 2.058 seconds
[main] 17:19:47,862 INFO  [org.apache.activemq.artemis.core.server] #*#*# Finished test: testForConnectionLeakDuringActivationWhenSessionCreationFails()...
[main] 17:19:47,863 INFO  [org.apache.activemq.artemis.core.server] #*#*# Starting test: testCreateConnectionFactoryThrowsException()...
#test testCreateConnectionFactoryThrowsException
[main] 17:19:47,878 INFO  [org.apache.activemq.artemis.core.server] #*#*# Finished test: testCreateConnectionFactoryThrowsException()...
[main] 17:19:47,878 INFO  [org.apache.activemq.artemis.core.server] #*#*# Starting test: testCreateConnectionFactoryMultipleConnectorsOverrideAndParams()...
#test testCreateConnectionFactoryMultipleConnectorsOverrideAndParams
[main] 17:19:47,886 INFO  [org.apache.activemq.artemis.core.server] #*#*# Finished test: testCreateConnectionFactoryMultipleConnectorsOverrideAndParams()...
[main] 17:19:47,887 INFO  [org.apache.activemq.artemis.core.server] #*#*# Starting test: test2DefaultConnectionFactorySame()...
#test test2DefaultConnectionFactorySame
[main] 17:19:47,894 INFO  [org.apache.activemq.artemis.core.server] #*#*# Finished test: test2DefaultConnectionFactorySame()...
Tests run: 16, Failures: 0, Errors: 0, Skipped: 0, Time elapsed: 2.337 sec - in org.apache.activemq.artemis.tests.unit.ra.ResourceAdapterTest
Running org.apache.activemq.artemis.tests.unit.util.ActiveMQBufferInputStreamTest
[main] 17:19:47,903 INFO  [org.apache.activemq.artemis.core.server] #*#*# Starting test: testReadBytes()...
#test testReadBytes
[main] 17:19:47,914 INFO  [org.apache.activemq.artemis.core.server] #*#*# Finished test: testReadBytes()...
Tests run: 1, Failures: 0, Errors: 0, Skipped: 0, Time elapsed: 0.018 sec - in org.apache.activemq.artemis.tests.unit.util.ActiveMQBufferInputStreamTest
Running org.apache.activemq.artemis.tests.unit.util.LinkedListTest
[main] 17:19:47,918 INFO  [org.apache.activemq.artemis.core.server] #*#*# Starting test: testAddHead()...
#test testAddHead
[main] 17:19:47,925 INFO  [org.apache.activemq.artemis.core.server] #*#*# Finished test: testAddHead()...
[main] 17:19:47,925 INFO  [org.apache.activemq.artemis.core.server] #*#*# Starting test: testAddTail()...
#test testAddTail
[main] 17:19:47,931 INFO  [org.apache.activemq.artemis.core.server] #*#*# Finished test: testAddTail()...
[main] 17:19:47,932 INFO  [org.apache.activemq.artemis.core.server] #*#*# Starting test: testAddHeadAndTail()...
#test testAddHeadAndTail
[main] 17:19:47,940 INFO  [org.apache.activemq.artemis.core.server] #*#*# Finished test: testAddHeadAndTail()...
[main] 17:19:47,940 INFO  [org.apache.activemq.artemis.core.server] #*#*# Starting test: testCreateIteratorAfterAddElements()...
#test testCreateIteratorAfterAddElements
[main] 17:19:47,947 INFO  [org.apache.activemq.artemis.core.server] #*#*# Finished test: testCreateIteratorAfterAddElements()...
[main] 17:19:47,948 INFO  [org.apache.activemq.artemis.core.server] #*#*# Starting test: testClear()...
#test testClear
[main] 17:19:47,954 INFO  [org.apache.activemq.artemis.core.server] #*#*# Finished test: testClear()...
[main] 17:19:47,955 INFO  [org.apache.activemq.artemis.core.server] #*#*# Starting test: testPoll()...
#test testPoll
[main] 17:19:47,961 INFO  [org.apache.activemq.artemis.core.server] #*#*# Finished test: testPoll()...
[main] 17:19:47,962 INFO  [org.apache.activemq.artemis.core.server] #*#*# Starting test: testRemoveHead1()...
#test testRemoveHead1
[main] 17:19:47,969 INFO  [org.apache.activemq.artemis.core.server] #*#*# Finished test: testRemoveHead1()...
[main] 17:19:47,970 INFO  [org.apache.activemq.artemis.core.server] #*#*# Starting test: testRemoveHead2()...
#test testRemoveHead2
[main] 17:19:47,977 INFO  [org.apache.activemq.artemis.core.server] #*#*# Finished test: testRemoveHead2()...
[main] 17:19:47,984 INFO  [org.apache.activemq.artemis.core.server] #*#*# Starting test: testRemoveHead3()...
#test testRemoveHead3
[main] 17:19:47,991 INFO  [org.apache.activemq.artemis.core.server] #*#*# Finished test: testRemoveHead3()...
[main] 17:19:47,991 INFO  [org.apache.activemq.artemis.core.server] #*#*# Starting test: testRemoveTail1()...
#test testRemoveTail1
[main] 17:19:47,997 INFO  [org.apache.activemq.artemis.core.server] #*#*# Finished test: testRemoveTail1()...
[main] 17:19:47,998 INFO  [org.apache.activemq.artemis.core.server] #*#*# Starting test: testRemoveTail2()...
#test testRemoveTail2
[main] 17:19:48,003 INFO  [org.apache.activemq.artemis.core.server] #*#*# Finished test: testRemoveTail2()...
[main] 17:19:48,004 INFO  [org.apache.activemq.artemis.core.server] #*#*# Starting test: testRemoveTail3()...
#test testRemoveTail3
[main] 17:19:48,009 INFO  [org.apache.activemq.artemis.core.server] #*#*# Finished test: testRemoveTail3()...
[main] 17:19:48,010 INFO  [org.apache.activemq.artemis.core.server] #*#*# Starting test: testRemoveInTurn()...
#test testRemoveInTurn
[main] 17:19:48,015 INFO  [org.apache.activemq.artemis.core.server] #*#*# Finished test: testRemoveInTurn()...
[main] 17:19:48,015 INFO  [org.apache.activemq.artemis.core.server] #*#*# Starting test: testRemoveMiddle()...
#test testRemoveMiddle
[main] 17:19:48,021 INFO  [org.apache.activemq.artemis.core.server] #*#*# Finished test: testRemoveMiddle()...
[main] 17:19:48,021 INFO  [org.apache.activemq.artemis.core.server] #*#*# Starting test: testAddHeadAndRemove()...
#test testAddHeadAndRemove
Jumping 500
[main] 17:19:48,025 INFO  [org.apache.activemq.artemis.utils.ThreadLeakCheckRule] #test forceGC
[main] 17:19:48,279 INFO  [org.apache.activemq.artemis.utils.ThreadLeakCheckRule] #test forceGC
Done 
[main] 17:19:48,283 INFO  [org.apache.activemq.artemis.core.server] #*#*# Finished test: testAddHeadAndRemove()...
[main] 17:19:48,284 INFO  [org.apache.activemq.artemis.core.server] #*#*# Starting test: testMultipleIterators1()...
#test testMultipleIterators1
[main] 17:19:48,290 INFO  [org.apache.activemq.artemis.core.server] #*#*# Finished test: testMultipleIterators1()...
[main] 17:19:48,290 INFO  [org.apache.activemq.artemis.core.server] #*#*# Starting test: testMultipleIterators2()...
#test testMultipleIterators2
[main] 17:19:48,295 INFO  [org.apache.activemq.artemis.core.server] #*#*# Finished test: testMultipleIterators2()...
[main] 17:19:48,295 INFO  [org.apache.activemq.artemis.core.server] #*#*# Starting test: testResizing()...
#test testResizing
[main] 17:19:48,303 INFO  [org.apache.activemq.artemis.core.server] #*#*# Finished test: testResizing()...
[main] 17:19:48,303 INFO  [org.apache.activemq.artemis.core.server] #*#*# Starting test: testRepeatAndRemove()...
#test testRepeatAndRemove
[main] 17:19:48,308 INFO  [org.apache.activemq.artemis.core.server] #*#*# Finished test: testRepeatAndRemove()...
[main] 17:19:48,309 INFO  [org.apache.activemq.artemis.core.server] #*#*# Starting test: testIterateNoElements()...
#test testIterateNoElements
[main] 17:19:48,313 INFO  [org.apache.activemq.artemis.core.server] #*#*# Finished test: testIterateNoElements()...
[main] 17:19:48,314 INFO  [org.apache.activemq.artemis.core.server] #*#*# Starting test: testAddAndRemove()...
#test testAddAndRemove
[main] 17:19:48,321 INFO  [org.apache.activemq.artemis.utils.ThreadLeakCheckRule] #test forceGC
[main] 17:19:48,420 INFO  [org.apache.activemq.artemis.utils.ThreadLeakCheckRule] #test forceGC
Done 
[main] 17:19:48,996 INFO  [org.apache.activemq.artemis.utils.ThreadLeakCheckRule] #test forceGC
[main] 17:19:52,590 INFO  [org.apache.activemq.artemis.utils.ThreadLeakCheckRule] #test forceGC
Done 
[main] 17:19:52,590 INFO  [org.apache.activemq.artemis.utils.ThreadLeakCheckRule] #test forceGC
[main] 17:19:52,786 INFO  [org.apache.activemq.artemis.utils.ThreadLeakCheckRule] #test forceGC
Done 
[main] 17:19:53,448 INFO  [org.apache.activemq.artemis.utils.ThreadLeakCheckRule] #test forceGC
[main] 17:19:54,220 INFO  [org.apache.activemq.artemis.utils.ThreadLeakCheckRule] #test forceGC
Done 
[main] 17:19:54,475 INFO  [org.apache.activemq.artemis.utils.ThreadLeakCheckRule] #test forceGC
[main] 17:19:54,900 INFO  [org.apache.activemq.artemis.utils.ThreadLeakCheckRule] #test forceGC
Done 
[main] 17:19:54,900 INFO  [org.apache.activemq.artemis.utils.ThreadLeakCheckRule] #test forceGC
[main] 17:19:54,993 INFO  [org.apache.activemq.artemis.utils.ThreadLeakCheckRule] #test forceGC
Done 
[main] 17:19:54,993 INFO  [org.apache.activemq.artemis.utils.ThreadLeakCheckRule] #test forceGC
[main] 17:19:55,083 INFO  [org.apache.activemq.artemis.utils.ThreadLeakCheckRule] #test forceGC
Done 
[main] 17:19:55,083 INFO  [org.apache.activemq.artemis.utils.ThreadLeakCheckRule] #test forceGC
[main] 17:19:55,150 INFO  [org.apache.activemq.artemis.utils.ThreadLeakCheckRule] #test forceGC
Done 
[main] 17:19:55,150 INFO  [org.apache.activemq.artemis.utils.ThreadLeakCheckRule] #test forceGC
[main] 17:19:55,217 INFO  [org.apache.activemq.artemis.utils.ThreadLeakCheckRule] #test forceGC
Done 

Results :

Tests run: 558, Failures: 0, Errors: 0, Skipped: 0

[INFO] ------------------------------------------------------------------------
[INFO] Reactor Summary:
[INFO] 
[INFO] ActiveMQ Artemis Parent ............................ SUCCESS [  3.975 s]
[INFO] ActiveMQ Artemis Commons ........................... SUCCESS [ 13.358 s]
[INFO] ActiveMQ Artemis Core Client ....................... SUCCESS [ 12.494 s]
[INFO] ActiveMQ Artemis Selector Implementation ........... SUCCESS [  4.310 s]
[INFO] ActiveMQ Artemis JMS Client ........................ SUCCESS [  4.764 s]
[INFO] ActiveMQ Artemis Native POM ........................ SUCCESS [  6.356 s]
[INFO] ActiveMQ Artemis Journal ........................... SUCCESS [  4.425 s]
[INFO] ActiveMQ Artemis JDBC Store ........................ SUCCESS [  6.323 s]
[INFO] ActiveMQ Artemis Server ............................ SUCCESS [ 51.132 s]
[INFO] ActiveMQ Artemis Protocols ......................... SUCCESS [  0.871 s]
[INFO] ActiveMQ Artemis AMQP Protocol ..................... SUCCESS [  6.758 s]
[INFO] ActiveMQ Artemis STOMP Protocol .................... SUCCESS [  2.213 s]
[INFO] ActiveMQ Artemis OpenWire Protocol ................. SUCCESS [  2.253 s]
[INFO] ActiveMQ Artemis HQClient Protocol ................. SUCCESS [  1.380 s]
[INFO] ActiveMQ Artemis HornetQ Protocol .................. SUCCESS [  1.560 s]
[INFO] ActiveMQ Artemis MQTT Protocol ..................... SUCCESS [  2.052 s]
[INFO] ActiveMQ Artemis DTO ............................... SUCCESS [  3.059 s]
[INFO] ActiveMQ Artemis Service Extensions ................ SUCCESS [  2.760 s]
[INFO] ActiveMQ Artemis JMS Server ........................ SUCCESS [  2.401 s]
[INFO] ActiveMQ Artemis CDI Integration ................... SUCCESS [  7.259 s]
[INFO] ActiveMQ Artemis Boot .............................. SUCCESS [  1.072 s]
[INFO] ActiveMQ Artemis Tools ............................. SUCCESS [  2.264 s]
[INFO] ActiveMQ Artemis CLI ............................... SUCCESS [ 28.248 s]
[INFO] ActiveMQ Artemis Web ............................... SUCCESS [  6.272 s]
[INFO] ActiveMQ Artemis Web ............................... SUCCESS [  1.406 s]
[INFO] ActiveMQ Artemis JUnit Rules ....................... SUCCESS [  8.874 s]
[INFO] ActiveMQ Artemis RAR POM ........................... SUCCESS [  4.057 s]
[INFO] ActiveMQ Artemis REST Interface Implementation ..... SUCCESS [01:28 min]
[INFO] ActiveMQ Artemis Maven Plugin ...................... SUCCESS [  5.820 s]
[INFO] ActiveMQ Artemis Server OSGi ....................... SUCCESS [  2.696 s]
[INFO] ActiveMQ Artemis Spring Integration ................ SUCCESS [  1.833 s]
[INFO] Apache ActiveMQ Artemis Distribution ............... SUCCESS [  3.098 s]
[INFO] ActiveMQ Artemis Tests POM ......................... SUCCESS [  2.227 s]
[INFO] ActiveMQ Artemis Unit Tests ........................ FAILURE [02:37 min]
[INFO] ActiveMQ Artemis Joram Tests ....................... SKIPPED
[INFO] ActiveMQ Artemis timing Tests ...................... SKIPPED
[INFO] ActiveMQ Artemis JMS Tests ......................... SKIPPED
[INFO] ActiveMQ Artemis Features .......................... SKIPPED
[INFO] ActiveMQ Artemis Test Support ...................... SKIPPED
[INFO] ActiveMQ Artemis Integration Tests ................. SKIPPED
[INFO] ActiveMQ Artemis soak Tests ........................ SKIPPED
[INFO] ActiveMQ Artemis stress Tests ...................... SKIPPED
[INFO] ActiveMQ Artemis performance Tests ................. SKIPPED
[INFO] ActiveMQ Artemis Extra Tests ....................... SKIPPED
[INFO] ------------------------------------------------------------------------
[INFO] BUILD FAILURE
[INFO] ------------------------------------------------------------------------
[INFO] Total time: 07:35 min
[INFO] Finished at: 2017-03-29T17:20:47+00:00
[INFO] Final Memory: 308M/7253M
[INFO] ------------------------------------------------------------------------
[ERROR] Failed to execute goal org.apache.maven.plugins:maven-surefire-plugin:2.19.1:test
(default-test) on project unit-tests: Execution default-test of goal org.apache.maven.plugins:maven-surefire-plugin:2.19.1:test
failed: The forked VM terminated without properly saying goodbye. VM crash or System.exit
called?
[ERROR] Command was /bin/sh -c cd <https://builds.apache.org/job/ActiveMQ-Artemis-Master/ws/tests/unit-tests>
&& /usr/local/asfpackages/java/jdk1.8.0_121/jre/bin/java -Djava.util.logging.manager=org.jboss.logmanager.LogManager
-Dlogging.configuration=<https://builds.apache.org/job/ActiveMQ-Artemis-Master/ws/tests/unit-tests/../../tests/config/logging.properties>
-Djava.library.path=<https://builds.apache.org/job/ActiveMQ-Artemis-Master/ws/tests/unit-tests/../../artemis-native/bin>
-Djgroups.bind_addr=localhost -Dorg.apache.activemq.artemis.api.core.UDPBroadcastEndpointFactory.localBindAddress=localhost
-Djava.net.preferIPv4Stack=true -jar <https://builds.apache.org/job/ActiveMQ-Artemis-Master/ws/tests/unit-tests/target/surefire/surefirebooter6928275268479647029.jar>
<https://builds.apache.org/job/ActiveMQ-Artemis-Master/ws/tests/unit-tests/target/surefire/surefire240734308781983646tmp>
<https://builds.apache.org/job/ActiveMQ-Artemis-Master/ws/tests/unit-tests/target/surefire/surefire_175816851996469219778tmp>
[ERROR] -> [Help 1]
[ERROR] 
[ERROR] To see the full stack trace of the errors, re-run Maven with the -e switch.
[ERROR] Re-run Maven using the -X switch to enable full debug logging.
[ERROR] 
[ERROR] For more information about the errors and possible solutions, please read the following
articles:
[ERROR] [Help 1] http://cwiki.apache.org/confluence/display/MAVEN/PluginExecutionException
[ERROR] 
[ERROR] After correcting the problems, you can resume the build with the command
[ERROR]   mvn <goals> -rf :unit-tests
Build step 'Invoke top-level Maven targets' marked build as failure
Performing Post build task...
Could not match :Too many files with unapproved license  : False
Logical operation result is FALSE
Skipping script  : cat ratReport.txt
END OF POST BUILD TASK 	: 0
Recording test results

Mime
View raw message