activemq-commits mailing list archives

Site index · List index
Message view « Date » · « Thread »
Top « Date » · « Thread »
From Apache Jenkins Server <jenk...@builds.apache.org>
Subject Build failed in Jenkins: ActiveMQ-Java8-5.14.x » ActiveMQ :: Pool #39
Date Wed, 01 Mar 2017 10:24:28 GMT
See <https://builds.apache.org/job/ActiveMQ-Java8-5.14.x/org.apache.activemq$activemq-pool/39/display/redirect?page=changes>

Changes:

[tabish121] [AMQ-6603] ensure failover does not track consumer creation that fails

------------------------------------------
[INFO]                                                                         
[INFO] ------------------------------------------------------------------------
[INFO] Building ActiveMQ :: Pool 5.14.5-SNAPSHOT
[INFO] ------------------------------------------------------------------------
[INFO] 
[INFO] --- maven-clean-plugin:2.5:clean (default-clean) @ activemq-pool ---
[INFO] 
[INFO] --- maven-enforcer-plugin:1.3.1:enforce (default) @ activemq-pool ---
[INFO] 
[INFO] --- maven-bundle-plugin:2.3.7:cleanVersions (cleanVersions) @ activemq-pool ---
[INFO] 
[INFO] --- maven-remote-resources-plugin:1.5:process (default) @ activemq-pool ---
[INFO] 
[INFO] --- maven-resources-plugin:2.7:resources (default-resources) @ activemq-pool ---
[INFO] Using 'UTF-8' encoding to copy filtered resources.
[INFO] skip non existing resourceDirectory <https://builds.apache.org/job/ActiveMQ-Java8-5.14.x/org.apache.activemq$activemq-pool/ws/src/main/resources>
[INFO] Copying 3 resources
[INFO] 
[INFO] --- maven-compiler-plugin:3.3:compile (default-compile) @ activemq-pool ---
[INFO] Changes detected - recompiling the module!
[INFO] Compiling 5 source files to <https://builds.apache.org/job/ActiveMQ-Java8-5.14.x/org.apache.activemq$activemq-pool/ws/target/classes>
[WARNING] bootstrap class path not set in conjunction with -source 1.7
[INFO] <https://builds.apache.org/job/ActiveMQ-Java8-5.14.x/org.apache.activemq$activemq-pool/ws/src/main/java/org/apache/activemq/pool/XaPooledConnectionFactory.java>:
<https://builds.apache.org/job/ActiveMQ-Java8-5.14.x/org.apache.activemq$activemq-pool/ws/src/main/java/org/apache/activemq/pool/XaPooledConnectionFactory.java>
uses unchecked or unsafe operations.
[INFO] <https://builds.apache.org/job/ActiveMQ-Java8-5.14.x/org.apache.activemq$activemq-pool/ws/src/main/java/org/apache/activemq/pool/XaPooledConnectionFactory.java>:
Recompile with -Xlint:unchecked for details.
[INFO] 
[INFO] --- maven-resources-plugin:2.7:testResources (default-testResources) @ activemq-pool
---
[INFO] Using 'UTF-8' encoding to copy filtered resources.
[INFO] skip non existing resourceDirectory <https://builds.apache.org/job/ActiveMQ-Java8-5.14.x/org.apache.activemq$activemq-pool/ws/src/test/resources>
[INFO] Copying 3 resources
[INFO] 
[INFO] --- maven-compiler-plugin:3.3:testCompile (default-testCompile) @ activemq-pool ---
[INFO] Changes detected - recompiling the module!
[INFO] Compiling 5 source files to <https://builds.apache.org/job/ActiveMQ-Java8-5.14.x/org.apache.activemq$activemq-pool/ws/target/test-classes>
[INFO] -------------------------------------------------------------
[WARNING] COMPILATION WARNING : 
[INFO] -------------------------------------------------------------
[WARNING] bootstrap class path not set in conjunction with -source 1.7
[WARNING] <https://builds.apache.org/job/ActiveMQ-Java8-5.14.x/org.apache.activemq$activemq-pool/ws/src/test/java/org/apache/activemq/pool/ConfigFromPropsTest.java>:[23,30]
junit.framework.Assert in junit.framework has been deprecated
[INFO] 2 warnings 
[INFO] -------------------------------------------------------------
[INFO] -------------------------------------------------------------
[ERROR] COMPILATION ERROR : 
[INFO] -------------------------------------------------------------
[ERROR] <https://builds.apache.org/job/ActiveMQ-Java8-5.14.x/org.apache.activemq$activemq-pool/ws/src/test/java/org/apache/activemq/pool/PooledConsumerTest.java>:[19,30]
package com.google.common.base does not exist
[ERROR] <https://builds.apache.org/job/ActiveMQ-Java8-5.14.x/org.apache.activemq$activemq-pool/ws/src/test/java/org/apache/activemq/pool/PooledConsumerTest.java>:[125,33]
cannot find symbol
  symbol:   variable Strings
  location: class org.apache.activemq.pool.PooledConsumerTest.PooledConsumer
[ERROR] <https://builds.apache.org/job/ActiveMQ-Java8-5.14.x/org.apache.activemq$activemq-pool/ws/src/test/java/org/apache/activemq/pool/PooledConsumerTest.java>:[127,33]
cannot find symbol
  symbol:   variable Strings
  location: class org.apache.activemq.pool.PooledConsumerTest.PooledConsumer
[INFO] 3 errors 
[INFO] -------------------------------------------------------------

Mime
View raw message