activemq-commits mailing list archives

Site index · List index
Message view « Date » · « Thread »
Top « Date » · « Thread »
From Apache Jenkins Server <jenk...@builds.apache.org>
Subject Build failed in Jenkins: ActiveMQ-Artemis-Master #866
Date Fri, 17 Feb 2017 21:28:59 GMT
See <https://builds.apache.org/job/ActiveMQ-Artemis-Master/866/changes>

Changes:

[jbertram] ARTEMIS-978 replicating live restarts as backup

------------------------------------------
[...truncated 17901 lines...]
[main] 21:28:06,159 INFO  [org.apache.activemq.artemis.core.server] #*#*# Finished test: testAddHeadAndTail()...
[main] 21:28:06,159 INFO  [org.apache.activemq.artemis.core.server] #*#*# Starting test: testCreateIteratorAfterAddElements()...
#test testCreateIteratorAfterAddElements
[main] 21:28:06,169 INFO  [org.apache.activemq.artemis.core.server] #*#*# Finished test: testCreateIteratorAfterAddElements()...
[main] 21:28:06,171 INFO  [org.apache.activemq.artemis.core.server] #*#*# Starting test: testClear()...
#test testClear
[main] 21:28:06,181 INFO  [org.apache.activemq.artemis.core.server] #*#*# Finished test: testClear()...
[main] 21:28:06,181 INFO  [org.apache.activemq.artemis.core.server] #*#*# Starting test: testPoll()...
#test testPoll
[main] 21:28:06,191 INFO  [org.apache.activemq.artemis.core.server] #*#*# Finished test: testPoll()...
[main] 21:28:06,192 INFO  [org.apache.activemq.artemis.core.server] #*#*# Starting test: testRemoveHead1()...
#test testRemoveHead1
[main] 21:28:06,202 INFO  [org.apache.activemq.artemis.core.server] #*#*# Finished test: testRemoveHead1()...
[main] 21:28:06,204 INFO  [org.apache.activemq.artemis.core.server] #*#*# Starting test: testRemoveHead2()...
#test testRemoveHead2
[main] 21:28:06,218 INFO  [org.apache.activemq.artemis.core.server] #*#*# Finished test: testRemoveHead2()...
[main] 21:28:06,220 INFO  [org.apache.activemq.artemis.core.server] #*#*# Starting test: testRemoveHead3()...
#test testRemoveHead3
[main] 21:28:06,230 INFO  [org.apache.activemq.artemis.core.server] #*#*# Finished test: testRemoveHead3()...
[main] 21:28:06,231 INFO  [org.apache.activemq.artemis.core.server] #*#*# Starting test: testRemoveTail1()...
#test testRemoveTail1
[main] 21:28:06,241 INFO  [org.apache.activemq.artemis.core.server] #*#*# Finished test: testRemoveTail1()...
[main] 21:28:06,242 INFO  [org.apache.activemq.artemis.core.server] #*#*# Starting test: testRemoveTail2()...
#test testRemoveTail2
[main] 21:28:06,251 INFO  [org.apache.activemq.artemis.core.server] #*#*# Finished test: testRemoveTail2()...
[main] 21:28:06,251 INFO  [org.apache.activemq.artemis.core.server] #*#*# Starting test: testRemoveTail3()...
#test testRemoveTail3
[main] 21:28:06,259 INFO  [org.apache.activemq.artemis.core.server] #*#*# Finished test: testRemoveTail3()...
[main] 21:28:06,260 INFO  [org.apache.activemq.artemis.core.server] #*#*# Starting test: testRemoveInTurn()...
#test testRemoveInTurn
[main] 21:28:06,269 INFO  [org.apache.activemq.artemis.core.server] #*#*# Finished test: testRemoveInTurn()...
[main] 21:28:06,269 INFO  [org.apache.activemq.artemis.core.server] #*#*# Starting test: testRemoveMiddle()...
#test testRemoveMiddle
[main] 21:28:06,278 INFO  [org.apache.activemq.artemis.core.server] #*#*# Finished test: testRemoveMiddle()...
[main] 21:28:06,278 INFO  [org.apache.activemq.artemis.core.server] #*#*# Starting test: testAddHeadAndRemove()...
#test testAddHeadAndRemove
Jumping 500
[main] 21:28:06,286 INFO  [org.apache.activemq.artemis.utils.ThreadLeakCheckRule] #test forceGC
[main] 21:28:07,433 INFO  [org.apache.activemq.artemis.utils.ThreadLeakCheckRule] #test forceGC
Done 
[main] 21:28:07,444 INFO  [org.apache.activemq.artemis.core.server] #*#*# Finished test: testAddHeadAndRemove()...
[main] 21:28:07,445 INFO  [org.apache.activemq.artemis.core.server] #*#*# Starting test: testMultipleIterators1()...
#test testMultipleIterators1
[main] 21:28:07,449 INFO  [org.apache.activemq.artemis.core.server] #*#*# Finished test: testMultipleIterators1()...
[main] 21:28:07,449 INFO  [org.apache.activemq.artemis.core.server] #*#*# Starting test: testMultipleIterators2()...
#test testMultipleIterators2
[main] 21:28:07,452 INFO  [org.apache.activemq.artemis.core.server] #*#*# Finished test: testMultipleIterators2()...
[main] 21:28:07,452 INFO  [org.apache.activemq.artemis.core.server] #*#*# Starting test: testResizing()...
#test testResizing
[main] 21:28:07,459 INFO  [org.apache.activemq.artemis.core.server] #*#*# Finished test: testResizing()...
[main] 21:28:07,459 INFO  [org.apache.activemq.artemis.core.server] #*#*# Starting test: testRepeatAndRemove()...
#test testRepeatAndRemove
[main] 21:28:07,465 INFO  [org.apache.activemq.artemis.core.server] #*#*# Finished test: testRepeatAndRemove()...
[main] 21:28:07,465 INFO  [org.apache.activemq.artemis.core.server] #*#*# Starting test: testIterateNoElements()...
#test testIterateNoElements
[main] 21:28:07,469 INFO  [org.apache.activemq.artemis.core.server] #*#*# Finished test: testIterateNoElements()...
[main] 21:28:07,469 INFO  [org.apache.activemq.artemis.core.server] #*#*# Starting test: testAddAndRemove()...
#test testAddAndRemove
[main] 21:28:07,473 INFO  [org.apache.activemq.artemis.utils.ThreadLeakCheckRule] #test forceGC
[main] 21:28:07,524 INFO  [org.apache.activemq.artemis.utils.ThreadLeakCheckRule] #test forceGC
Done 
[main] 21:28:07,779 INFO  [org.apache.activemq.artemis.utils.ThreadLeakCheckRule] #test forceGC
[main] 21:28:09,343 INFO  [org.apache.activemq.artemis.utils.ThreadLeakCheckRule] #test forceGC
Done 
[main] 21:28:09,344 INFO  [org.apache.activemq.artemis.utils.ThreadLeakCheckRule] #test forceGC
[main] 21:28:09,427 INFO  [org.apache.activemq.artemis.utils.ThreadLeakCheckRule] #test forceGC
Done 
[main] 21:28:09,672 INFO  [org.apache.activemq.artemis.utils.ThreadLeakCheckRule] #test forceGC
[main] 21:28:10,438 INFO  [org.apache.activemq.artemis.utils.ThreadLeakCheckRule] #test forceGC
Done 
[main] 21:28:11,340 INFO  [org.apache.activemq.artemis.utils.ThreadLeakCheckRule] #test forceGC
[main] 21:28:11,662 INFO  [org.apache.activemq.artemis.utils.ThreadLeakCheckRule] #test forceGC
Done 
[main] 21:28:12,533 INFO  [org.apache.activemq.artemis.utils.ThreadLeakCheckRule] #test forceGC
[main] 21:28:12,712 INFO  [org.apache.activemq.artemis.utils.ThreadLeakCheckRule] #test forceGC
Done 
[main] 21:28:12,712 INFO  [org.apache.activemq.artemis.utils.ThreadLeakCheckRule] #test forceGC
[main] 21:28:12,795 INFO  [org.apache.activemq.artemis.utils.ThreadLeakCheckRule] #test forceGC
Done 
[main] 21:28:13,704 INFO  [org.apache.activemq.artemis.utils.ThreadLeakCheckRule] #test forceGC
[main] 21:28:13,973 INFO  [org.apache.activemq.artemis.utils.ThreadLeakCheckRule] #test forceGC
Done 
[main] 21:28:13,974 INFO  [org.apache.activemq.artemis.utils.ThreadLeakCheckRule] #test forceGC
[main] 21:28:14,050 INFO  [org.apache.activemq.artemis.utils.ThreadLeakCheckRule] #test forceGC
Done 
[main] 21:28:14,057 INFO  [org.apache.activemq.artemis.core.server] #*#*# Finished test: testAddAndRemove()...
[main] 21:28:14,058 INFO  [org.apache.activemq.artemis.core.server] #*#*# Starting test: testRemoveHeadAndTail1()...
#test testRemoveHeadAndTail1
[main] 21:28:14,068 INFO  [org.apache.activemq.artemis.core.server] #*#*# Finished test: testRemoveHeadAndTail1()...
[main] 21:28:14,069 INFO  [org.apache.activemq.artemis.core.server] #*#*# Starting test: testRemoveHeadAndTail2()...
#test testRemoveHeadAndTail2
[main] 21:28:14,079 INFO  [org.apache.activemq.artemis.core.server] #*#*# Finished test: testRemoveHeadAndTail2()...
[main] 21:28:14,080 INFO  [org.apache.activemq.artemis.core.server] #*#*# Starting test: testRemoveHeadAndTail3()...
#test testRemoveHeadAndTail3
[main] 21:28:14,090 INFO  [org.apache.activemq.artemis.core.server] #*#*# Finished test: testRemoveHeadAndTail3()...
[main] 21:28:14,091 INFO  [org.apache.activemq.artemis.core.server] #*#*# Starting test: testRepeat()...
#test testRepeat
[main] 21:28:14,102 INFO  [org.apache.activemq.artemis.core.server] #*#*# Finished test: testRepeat()...
[main] 21:28:14,103 INFO  [org.apache.activemq.artemis.core.server] #*#*# Starting test: testCreateIteratorBeforeAddElements()...
#test testCreateIteratorBeforeAddElements
[main] 21:28:14,113 INFO  [org.apache.activemq.artemis.core.server] #*#*# Finished test: testCreateIteratorBeforeAddElements()...
[main] 21:28:14,113 INFO  [org.apache.activemq.artemis.core.server] #*#*# Starting test: testRemoveAll()...
#test testRemoveAll
[main] 21:28:14,122 INFO  [org.apache.activemq.artemis.core.server] #*#*# Finished test: testRemoveAll()...
[main] 21:28:14,123 INFO  [org.apache.activemq.artemis.core.server] #*#*# Starting test: testRemoveOdd()...
#test testRemoveOdd
[main] 21:28:14,133 INFO  [org.apache.activemq.artemis.core.server] #*#*# Finished test: testRemoveOdd()...
[main] 21:28:14,134 INFO  [org.apache.activemq.artemis.core.server] #*#*# Starting test: testIterateThenAddMoreAndIterateAgain()...
#test testIterateThenAddMoreAndIterateAgain
[main] 21:28:14,147 INFO  [org.apache.activemq.artemis.core.server] #*#*# Finished test: testIterateThenAddMoreAndIterateAgain()...
Tests run: 29, Failures: 0, Errors: 0, Skipped: 0, Time elapsed: 8.022 sec - in org.apache.activemq.artemis.tests.unit.util.LinkedListTest
Running org.apache.activemq.artemis.tests.unit.util.MemorySizeTest
[main] 21:28:22,911 WARN  [org.apache.activemq.artemis.core.client] AMQ212047: Warning: JVM
allocated more data what would make results invalid 2,377,646,080:1,910,505,472
[main] 21:28:22,912 INFO  [org.apache.activemq.artemis.tests.unit] Server message size is
1256
[main] 21:28:31,594 WARN  [org.apache.activemq.artemis.core.client] AMQ212047: Warning: JVM
allocated more data what would make results invalid 1,910,505,472:2,026,373,120
[main] 21:28:31,595 INFO  [org.apache.activemq.artemis.tests.unit] Message reference size
is 64
Tests run: 1, Failures: 0, Errors: 0, Skipped: 0, Time elapsed: 17.446 sec - in org.apache.activemq.artemis.tests.unit.util.MemorySizeTest
Running org.apache.activemq.artemis.tests.unit.util.ObjectInputStreamWithClassLoaderTest
[main] 21:28:31,597 INFO  [org.apache.activemq.artemis.core.server] #*#*# Starting test: testClassLoaderIsolationWithProxy()...
#test testClassLoaderIsolationWithProxy
Deserialized Object org.apache.activemq.artemis.tests.unit.util.ObjectInputStreamWithClassLoaderTest$AnObjectImpl@5990e6c5
[main] 21:28:31,850 INFO  [org.apache.activemq.artemis.core.server] #*#*# Finished test: testClassLoaderIsolationWithProxy()...
[main] 21:28:31,851 INFO  [org.apache.activemq.artemis.core.server] #*#*# Starting test: testWhiteBlackListAgainstListObject()...
#test testWhiteBlackListAgainstListObject
[main] 21:28:31,880 INFO  [org.apache.activemq.artemis.core.server] #*#*# Finished test: testWhiteBlackListAgainstListObject()...
[main] 21:28:31,881 INFO  [org.apache.activemq.artemis.core.server] #*#*# Starting test: testWhiteBlackListAgainstArrayObject()...
#test testWhiteBlackListAgainstArrayObject
[main] 21:28:31,895 INFO  [org.apache.activemq.artemis.core.server] #*#*# Finished test: testWhiteBlackListAgainstArrayObject()...
[main] 21:28:31,896 INFO  [org.apache.activemq.artemis.core.server] #*#*# Starting test: testWhiteBlackListAnonymousObject()...
#test testWhiteBlackListAnonymousObject
[main] 21:28:31,918 INFO  [org.apache.activemq.artemis.core.server] #*#*# Finished test: testWhiteBlackListAnonymousObject()...
[main] 21:28:31,919 INFO  [org.apache.activemq.artemis.core.server] #*#*# Starting test: testWhiteBlackListLocalObject()...
#test testWhiteBlackListLocalObject
[main] 21:28:31,934 INFO  [org.apache.activemq.artemis.core.server] #*#*# Finished test: testWhiteBlackListLocalObject()...
[main] 21:28:31,935 INFO  [org.apache.activemq.artemis.core.server] #*#*# Starting test: testWhiteBlackListSystemProperty()...
#test testWhiteBlackListSystemProperty
[main] 21:28:31,945 INFO  [org.apache.activemq.artemis.core.server] #*#*# Finished test: testWhiteBlackListSystemProperty()...
[main] 21:28:31,946 INFO  [org.apache.activemq.artemis.core.server] #*#*# Starting test: testClassLoaderIsolation()...
#test testClassLoaderIsolation
[main] 21:28:31,978 INFO  [org.apache.activemq.artemis.core.server] #*#*# Finished test: testClassLoaderIsolation()...
[main] 21:28:31,979 INFO  [org.apache.activemq.artemis.core.server] #*#*# Starting test: testWhiteBlackList()...
#test testWhiteBlackList
[main] 21:28:31,996 INFO  [org.apache.activemq.artemis.core.server] #*#*# Finished test: testWhiteBlackList()...
[main] 21:28:31,997 INFO  [org.apache.activemq.artemis.core.server] #*#*# Starting test: testWhiteBlackListAgainstListMapObject()...
#test testWhiteBlackListAgainstListMapObject
[main] 21:28:32,020 INFO  [org.apache.activemq.artemis.core.server] #*#*# Finished test: testWhiteBlackListAgainstListMapObject()...
Tests run: 9, Failures: 0, Errors: 0, Skipped: 0, Time elapsed: 0.421 sec - in org.apache.activemq.artemis.tests.unit.util.ObjectInputStreamWithClassLoaderTest
Running org.apache.activemq.artemis.tests.unit.util.ReusableLatchTest
[main] 21:28:32,024 INFO  [org.apache.activemq.artemis.core.server] #*#*# Starting test: testLatchWithParameterizedDown()...
#test testLatchWithParameterizedDown
[main] 21:28:32,034 INFO  [org.apache.activemq.artemis.core.server] #*#*# Finished test: testLatchWithParameterizedDown()...
[main] 21:28:32,034 INFO  [org.apache.activemq.artemis.core.server] #*#*# Starting test: testLatchOnSingleThread()...
#test testLatchOnSingleThread
[main] 21:28:32,044 INFO  [org.apache.activemq.artemis.core.server] #*#*# Finished test: testLatchOnSingleThread()...
[main] 21:28:32,045 INFO  [org.apache.activemq.artemis.core.server] #*#*# Starting test: testReuseLatch()...
#test testReuseLatch
[main] 21:28:32,065 INFO  [org.apache.activemq.artemis.core.server] #*#*# Finished test: testReuseLatch()...
[main] 21:28:32,066 INFO  [org.apache.activemq.artemis.core.server] #*#*# Starting test: testLatchOnMultiThread()...
#test testLatchOnMultiThread
[main] 21:28:32,257 INFO  [org.apache.activemq.artemis.core.server] #*#*# Finished test: testLatchOnMultiThread()...
Tests run: 4, Failures: 0, Errors: 0, Skipped: 0, Time elapsed: 0.236 sec - in org.apache.activemq.artemis.tests.unit.util.ReusableLatchTest
Running org.apache.activemq.artemis.tests.unit.util.SoftValueMapTest
[main] 21:28:32,262 INFO  [org.apache.activemq.artemis.core.server] #*#*# Starting test: testEvictionsLeastUsed()...
#test testEvictionsLeastUsed
[main] 21:28:32,266 INFO  [org.apache.activemq.artemis.utils.ThreadLeakCheckRule] #test forceGC
[main] 21:28:32,407 INFO  [org.apache.activemq.artemis.utils.ThreadLeakCheckRule] #test forceGC
Done 
SoftCache.size 200
Soft cache has 200 elements
[main] 21:28:32,427 INFO  [org.apache.activemq.artemis.core.server] #*#*# Finished test: testEvictionsLeastUsed()...
[main] 21:28:32,428 INFO  [org.apache.activemq.artemis.core.server] #*#*# Starting test: testEvictions()...
#test testEvictions
[main] 21:28:32,432 INFO  [org.apache.activemq.artemis.utils.ThreadLeakCheckRule] #test forceGC
[main] 21:28:32,504 INFO  [org.apache.activemq.artemis.utils.ThreadLeakCheckRule] #test forceGC
Done 
SUREFIRE-859: Java HotSpot(TM) 64-Bit Server VM warning: INFO: os::commit_memory(0x000000073a780000,
586678272, 0) failed; error='Cannot allocate memory' (errno=12)
#
# There is insufficient memory for the Java Runtime Environment to continue.
# Native memory allocation (mmap) failed to map 586678272 bytes for committing reserved memory.
# An error report file with more information is saved as:
# <https://builds.apache.org/job/ActiveMQ-Artemis-Master/ws/tests/unit-tests/hs_err_pid17097.log>

Results :

Tests run: 600, Failures: 0, Errors: 0, Skipped: 0

[INFO] ------------------------------------------------------------------------
[INFO] Reactor Summary:
[INFO] 
[INFO] ActiveMQ Artemis Parent ............................ SUCCESS [ 11.350 s]
[INFO] ActiveMQ Artemis Commons ........................... SUCCESS [ 20.929 s]
[INFO] ActiveMQ Artemis Core Client ....................... SUCCESS [ 16.455 s]
[INFO] ActiveMQ Artemis Selector Implementation ........... SUCCESS [  5.699 s]
[INFO] ActiveMQ Artemis JMS Client ........................ SUCCESS [  7.702 s]
[INFO] ActiveMQ Artemis Native POM ........................ SUCCESS [  6.403 s]
[INFO] ActiveMQ Artemis Journal ........................... SUCCESS [  5.051 s]
[INFO] ActiveMQ Artemis JDBC Store ........................ SUCCESS [ 14.774 s]
[INFO] ActiveMQ Artemis Server ............................ SUCCESS [ 57.909 s]
[INFO] ActiveMQ Artemis Protocols ......................... SUCCESS [  1.708 s]
[INFO] ActiveMQ Artemis AMQP Protocol ..................... SUCCESS [  8.346 s]
[INFO] ActiveMQ Artemis STOMP Protocol .................... SUCCESS [  2.912 s]
[INFO] ActiveMQ Artemis OpenWire Protocol ................. SUCCESS [  3.958 s]
[INFO] ActiveMQ Artemis HQClient Protocol ................. SUCCESS [  2.736 s]
[INFO] ActiveMQ Artemis HornetQ Protocol .................. SUCCESS [  1.604 s]
[INFO] ActiveMQ Artemis MQTT Protocol ..................... SUCCESS [  1.888 s]
[INFO] ActiveMQ Artemis DTO ............................... SUCCESS [  5.958 s]
[INFO] ActiveMQ Artemis Service Extensions ................ SUCCESS [  2.809 s]
[INFO] ActiveMQ Artemis JMS Server ........................ SUCCESS [  4.066 s]
[INFO] ActiveMQ Artemis CDI Integration ................... SUCCESS [ 11.718 s]
[INFO] ActiveMQ Artemis Boot .............................. SUCCESS [  1.965 s]
[INFO] ActiveMQ Artemis Tools ............................. SUCCESS [  2.375 s]
[INFO] ActiveMQ Artemis CLI ............................... SUCCESS [ 37.911 s]
[INFO] ActiveMQ Artemis Web ............................... SUCCESS [ 10.507 s]
[INFO] ActiveMQ Artemis Web ............................... SUCCESS [  2.955 s]
[INFO] ActiveMQ Artemis JUnit Rules ....................... SUCCESS [ 16.859 s]
[INFO] ActiveMQ Artemis RAR POM ........................... SUCCESS [  3.934 s]
[INFO] ActiveMQ Artemis REST Interface Implementation ..... SUCCESS [01:38 min]
[INFO] ActiveMQ Artemis Maven Plugin ...................... SUCCESS [  7.528 s]
[INFO] ActiveMQ Artemis Server OSGi ....................... SUCCESS [  4.625 s]
[INFO] ActiveMQ Artemis Spring Integration ................ SUCCESS [  3.947 s]
[INFO] ActiveMQ Artemis Aerogear Integration .............. SUCCESS [  2.417 s]
[INFO] ActiveMQ Artemis Vert.x Integration ................ SUCCESS [  3.061 s]
[INFO] Apache ActiveMQ Artemis Distribution ............... SUCCESS [  4.838 s]
[INFO] ActiveMQ Artemis Tests POM ......................... SUCCESS [  4.685 s]
[INFO] ActiveMQ Artemis Unit Tests ........................ FAILURE [02:24 min]
[INFO] ActiveMQ Artemis Joram Tests ....................... SKIPPED
[INFO] ActiveMQ Artemis timing Tests ...................... SKIPPED
[INFO] ActiveMQ Artemis JMS Tests ......................... SKIPPED
[INFO] ActiveMQ Artemis Features .......................... SKIPPED
[INFO] ActiveMQ Artemis Test Support ...................... SKIPPED
[INFO] ActiveMQ Artemis Integration Tests ................. SKIPPED
[INFO] ActiveMQ Artemis soak Tests ........................ SKIPPED
[INFO] ActiveMQ Artemis stress Tests ...................... SKIPPED
[INFO] ActiveMQ Artemis performance Tests ................. SKIPPED
[INFO] ActiveMQ Artemis Extra Tests ....................... SKIPPED
[INFO] ------------------------------------------------------------------------
[INFO] BUILD FAILURE
[INFO] ------------------------------------------------------------------------
[INFO] Total time: 09:08 min
[INFO] Finished at: 2017-02-17T21:28:35+00:00
[INFO] Final Memory: 223M/1651M
[INFO] ------------------------------------------------------------------------
[ERROR] Failed to execute goal org.apache.maven.plugins:maven-surefire-plugin:2.18.1:test
(default-test) on project unit-tests: Execution default-test of goal org.apache.maven.plugins:maven-surefire-plugin:2.18.1:test
failed: The forked VM terminated without properly saying goodbye. VM crash or System.exit
called?
[ERROR] Command was /bin/sh -c cd <https://builds.apache.org/job/ActiveMQ-Artemis-Master/ws/tests/unit-tests>
&& /usr/local/asfpackages/java/jdk1.8.0_121/jre/bin/java -Djava.util.logging.manager=org.jboss.logmanager.LogManager
-Dlogging.configuration=<https://builds.apache.org/job/ActiveMQ-Artemis-Master/ws/tests/unit-tests/../../tests/config/logging.properties>
-Djava.library.path=<https://builds.apache.org/job/ActiveMQ-Artemis-Master/ws/tests/unit-tests/../../artemis-native/bin>
-Djgroups.bind_addr=localhost -Dorg.apache.activemq.artemis.api.core.UDPBroadcastEndpointFactory.localBindAddress=localhost
-Djava.net.preferIPv4Stack=true -jar <https://builds.apache.org/job/ActiveMQ-Artemis-Master/ws/tests/unit-tests/target/surefire/surefirebooter2187638077625939141.jar>
<https://builds.apache.org/job/ActiveMQ-Artemis-Master/ws/tests/unit-tests/target/surefire/surefire3492661909053882716tmp>
<https://builds.apache.org/job/ActiveMQ-Artemis-Master/ws/tests/unit-tests/target/surefire/surefire_177444636807412547488tmp>
[ERROR] -> [Help 1]
[ERROR] 
[ERROR] To see the full stack trace of the errors, re-run Maven with the -e switch.
[ERROR] Re-run Maven using the -X switch to enable full debug logging.
[ERROR] 
[ERROR] For more information about the errors and possible solutions, please read the following
articles:
[ERROR] [Help 1] http://cwiki.apache.org/confluence/display/MAVEN/PluginExecutionException
[ERROR] 
[ERROR] After correcting the problems, you can resume the build with the command
[ERROR]   mvn <goals> -rf :unit-tests
Build step 'Invoke top-level Maven targets' marked build as failure
Performing Post build task...
Could not match :Too many files with unapproved license  : False
Logical operation result is FALSE
Skipping script  : cat ratReport.txt
END OF POST BUILD TASK 	: 0
Recording test results

Mime
View raw message