activemq-commits mailing list archives

Site index · List index
Message view « Date » · « Thread »
Top « Date » · « Thread »
From Apache Jenkins Server <jenk...@builds.apache.org>
Subject Build failed in Jenkins: ActiveMQ-Artemis-Master #780
Date Fri, 16 Dec 2016 14:14:33 GMT
See <https://builds.apache.org/job/ActiveMQ-Artemis-Master/780/changes>

Changes:

[mtaylor] NO-JIRA properly destroy JMS topic

------------------------------------------
[...truncated 28206 lines...]
[INFO] 59 resources included (use -debug for more details)
[INFO] Rat check: Summary over all files. Unapproved: 0, unknown: 0, generated: 0, approved:
59 licenses.
[INFO] 
[INFO] --- maven-resources-plugin:2.6:testResources (default-testResources) @ artemis-test-support
---
[INFO] Using 'UTF-8' encoding to copy filtered resources.
[INFO] skip non existing resourceDirectory <https://builds.apache.org/job/ActiveMQ-Artemis-Master/ws/tests/artemis-test-support/src/test/resources>
[INFO] Copying 3 resources
[INFO] Copying 3 resources
[INFO] Copying 3 resources
[INFO] 
[INFO] --- maven-compiler-plugin:3.1:testCompile (default-testCompile) @ artemis-test-support
---
[INFO] No sources to compile
[INFO] 
[INFO] --- maven-surefire-plugin:2.18.1:test (default-test) @ artemis-test-support ---
[INFO]                                                                         
[INFO] ------------------------------------------------------------------------
[INFO] Building ActiveMQ Artemis Integration Tests 2.0.0-SNAPSHOT
[INFO] ------------------------------------------------------------------------
[INFO] 
[INFO] --- maven-enforcer-plugin:1.4:enforce (enforce-maven) @ integration-tests ---
[INFO] 
[INFO] --- maven-enforcer-plugin:1.4:enforce (enforce-java) @ integration-tests ---
[INFO] 
[INFO] --- maven-remote-resources-plugin:1.5:process (process-resource-bundles) @ integration-tests
---
[INFO] 
[INFO] --- depends-maven-plugin:1.2:generate-depends-file (generate-depends-file) @ integration-tests
---
[INFO] Created: <https://builds.apache.org/job/ActiveMQ-Artemis-Master/ws/tests/integration-tests/target/classes/META-INF/maven/dependencies.properties>
[INFO] 
[INFO] --- maven-resources-plugin:2.6:resources (default-resources) @ integration-tests ---
[INFO] Using 'UTF-8' encoding to copy filtered resources.
[INFO] skip non existing resourceDirectory <https://builds.apache.org/job/ActiveMQ-Artemis-Master/ws/tests/integration-tests/src/main/resources>
[INFO] Copying 3 resources
[INFO] 
[INFO] --- maven-compiler-plugin:3.1:compile (default-compile) @ integration-tests ---
[INFO] No sources to compile
[INFO] 
[INFO] --- maven-checkstyle-plugin:2.17:check (default) @ integration-tests ---
[INFO] Starting audit...
Audit done.
[INFO] 
[INFO] --- apache-rat-plugin:0.12:check (default) @ integration-tests ---
[INFO] Enabled default license matchers.
[INFO] Will parse SCM ignores for exclusions...
[INFO] Finished adding exclusions from SCM ignore files.
[INFO] 61 implicit excludes (use -debug for more details).
[INFO] Exclude: **/*.txt
[INFO] Exclude: **/*.md
[INFO] Exclude: etc/ide-settings/**
[INFO] Exclude: docs/**/*.json
[INFO] Exclude: docs/**/_book/
[INFO] Exclude: **/target/
[INFO] Exclude: **/META-INF/services/*
[INFO] Exclude: **/META-INF/MANIFEST.MF
[INFO] Exclude: **/*.iml
[INFO] Exclude: **/*.jceks
[INFO] Exclude: **/*.jks
[INFO] Exclude: **/org/apache/activemq/artemis/utils/json/**
[INFO] Exclude: **/org/apache/activemq/artemis/utils/Base64.java
[INFO] Exclude: **/.settings/**
[INFO] Exclude: **/.project
[INFO] Exclude: **/.classpath
[INFO] Exclude: **/.editorconfig
[INFO] Exclude: **/.checkstyle
[INFO] Exclude: **/.factorypath
[INFO] Exclude: **/org.apache.activemq.artemis.cfg
[INFO] Exclude: **/nb-configuration.xml
[INFO] Exclude: **/*.data
[INFO] Exclude: **/*.bin
[INFO] Exclude: **/src/test/resources/keystore
[INFO] Exclude: **/*.log
[INFO] Exclude: **/*.redo
[INFO] Exclude: **/node/**
[INFO] Exclude: **/node_modules/**
[INFO] Exclude: **/package.json
[INFO] Exclude: **/npm-shrinkwrap.json
[INFO] Exclude: **/CMakeFiles/
[INFO] Exclude: **/Makefile
[INFO] Exclude: **/cmake_install.cmake
[INFO] Exclude: artemis-native/src/main/c/org_apache_activemq_artemis_jlibaio_LibaioContext.h
[INFO] 613 resources included (use -debug for more details)
[INFO] Rat check: Summary over all files. Unapproved: 0, unknown: 0, generated: 0, approved:
613 licenses.
[INFO] 
[INFO] --- maven-enforcer-plugin:1.4:enforce (enforce-maven) @ integration-tests ---
[INFO] 
[INFO] --- maven-enforcer-plugin:1.4:enforce (enforce-java) @ integration-tests ---
[INFO] 
[INFO] --- maven-remote-resources-plugin:1.5:process (process-resource-bundles) @ integration-tests
---
[INFO] 
[INFO] --- depends-maven-plugin:1.2:generate-depends-file (generate-depends-file) @ integration-tests
---
[INFO] Created: <https://builds.apache.org/job/ActiveMQ-Artemis-Master/ws/tests/integration-tests/target/classes/META-INF/maven/dependencies.properties>
[INFO] 
[INFO] --- maven-resources-plugin:2.6:resources (default-resources) @ integration-tests ---
[INFO] Using 'UTF-8' encoding to copy filtered resources.
[INFO] skip non existing resourceDirectory <https://builds.apache.org/job/ActiveMQ-Artemis-Master/ws/tests/integration-tests/src/main/resources>
[INFO] Copying 3 resources
[INFO] Copying 3 resources
[INFO] 
[INFO] --- maven-compiler-plugin:3.1:compile (default-compile) @ integration-tests ---
[INFO] No sources to compile
[INFO] 
[INFO] --- maven-checkstyle-plugin:2.17:check (default) @ integration-tests ---
[INFO] Starting audit...
Audit done.
[INFO] 
[INFO] --- apache-rat-plugin:0.12:check (default) @ integration-tests ---
[INFO] Enabled default license matchers.
[INFO] Will parse SCM ignores for exclusions...
[INFO] Finished adding exclusions from SCM ignore files.
[INFO] 61 implicit excludes (use -debug for more details).
[INFO] Exclude: **/*.txt
[INFO] Exclude: **/*.md
[INFO] Exclude: etc/ide-settings/**
[INFO] Exclude: docs/**/*.json
[INFO] Exclude: docs/**/_book/
[INFO] Exclude: **/target/
[INFO] Exclude: **/META-INF/services/*
[INFO] Exclude: **/META-INF/MANIFEST.MF
[INFO] Exclude: **/*.iml
[INFO] Exclude: **/*.jceks
[INFO] Exclude: **/*.jks
[INFO] Exclude: **/org/apache/activemq/artemis/utils/json/**
[INFO] Exclude: **/org/apache/activemq/artemis/utils/Base64.java
[INFO] Exclude: **/.settings/**
[INFO] Exclude: **/.project
[INFO] Exclude: **/.classpath
[INFO] Exclude: **/.editorconfig
[INFO] Exclude: **/.checkstyle
[INFO] Exclude: **/.factorypath
[INFO] Exclude: **/org.apache.activemq.artemis.cfg
[INFO] Exclude: **/nb-configuration.xml
[INFO] Exclude: **/*.data
[INFO] Exclude: **/*.bin
[INFO] Exclude: **/src/test/resources/keystore
[INFO] Exclude: **/*.log
[INFO] Exclude: **/*.redo
[INFO] Exclude: **/node/**
[INFO] Exclude: **/node_modules/**
[INFO] Exclude: **/package.json
[INFO] Exclude: **/npm-shrinkwrap.json
[INFO] Exclude: **/CMakeFiles/
[INFO] Exclude: **/Makefile
[INFO] Exclude: **/cmake_install.cmake
[INFO] Exclude: artemis-native/src/main/c/org_apache_activemq_artemis_jlibaio_LibaioContext.h
[INFO] 613 resources included (use -debug for more details)
[INFO] Rat check: Summary over all files. Unapproved: 0, unknown: 0, generated: 0, approved:
613 licenses.
[INFO] 
[INFO] --- maven-resources-plugin:2.6:testResources (default-testResources) @ integration-tests
---
[INFO] Using 'UTF-8' encoding to copy filtered resources.
[INFO] Copying 26 resources
[INFO] Copying 3 resources
[INFO] Copying 3 resources
[INFO] 
[INFO] --- maven-compiler-plugin:3.1:testCompile (default-testCompile) @ integration-tests
---
[INFO] Changes detected - recompiling the module!
[INFO] Compiling 585 source files to <https://builds.apache.org/job/ActiveMQ-Artemis-Master/ws/tests/integration-tests/target/test-classes>
<https://builds.apache.org/job/ActiveMQ-Artemis-Master/ws/tests/integration-tests/src/test/java/org/apache/activemq/artemis/tests/integration/persistence/SyncSendTest.java>:157:
warning: non-varargs call of varargs method with inexact argument type for last parameter;
      jms.createQueue(true, "queue", null, true, null);
                                                 ^
  cast to String for a varargs call
  cast to String[] for a non-varargs call and to suppress this warning
<https://builds.apache.org/job/ActiveMQ-Artemis-Master/ws/tests/integration-tests/src/test/java/org/apache/activemq/artemis/tests/integration/cli/QueueCommandTest.java>:260:
error: cannot find symbol
      updateQueue.setRoutingType(newRoutingType.name());
                 ^
  symbol:   method setRoutingType(String)
  location: variable updateQueue of type UpdateQueue
<https://builds.apache.org/job/ActiveMQ-Artemis-Master/ws/tests/integration-tests/src/test/java/org/apache/activemq/artemis/tests/integration/cli/QueueCommandTest.java>:289:
error: cannot find symbol
      updateQueue.setRoutingType(newRoutingType.name());
                 ^
  symbol:   method setRoutingType(String)
  location: variable updateQueue of type UpdateQueue
Note: Some input files use or override a deprecated API.
Note: Recompile with -Xlint:deprecation for details.
Note: Some input files use unchecked or unsafe operations.
Note: Recompile with -Xlint:unchecked for details.
2 errors
1 warning
[INFO] ------------------------------------------------------------------------
[INFO] Reactor Summary:
[INFO] 
[INFO] ActiveMQ Artemis Parent ............................ SUCCESS [  4.397 s]
[INFO] ActiveMQ Artemis Commons ........................... SUCCESS [ 14.106 s]
[INFO] ActiveMQ Artemis Core Client ....................... SUCCESS [ 11.328 s]
[INFO] ActiveMQ Artemis Selector Implementation ........... SUCCESS [  4.024 s]
[INFO] ActiveMQ Artemis JMS Client ........................ SUCCESS [  4.566 s]
[INFO] ActiveMQ Artemis Native POM ........................ SUCCESS [  2.948 s]
[INFO] ActiveMQ Artemis Journal ........................... SUCCESS [  3.959 s]
[INFO] ActiveMQ Artemis JDBC Store ........................ SUCCESS [ 17.881 s]
[INFO] ActiveMQ Artemis Server ............................ SUCCESS [ 59.696 s]
[INFO] ActiveMQ Artemis Protocols ......................... SUCCESS [  0.910 s]
[INFO] ActiveMQ Artemis AMQP Protocol ..................... SUCCESS [  6.189 s]
[INFO] ActiveMQ Artemis STOMP Protocol .................... SUCCESS [  2.445 s]
[INFO] ActiveMQ Artemis OpenWire Protocol ................. SUCCESS [  2.324 s]
[INFO] ActiveMQ Artemis HQClient Protocol ................. SUCCESS [  1.291 s]
[INFO] ActiveMQ Artemis HornetQ Protocol .................. SUCCESS [  1.483 s]
[INFO] ActiveMQ Artemis MQTT Protocol ..................... SUCCESS [  1.876 s]
[INFO] ActiveMQ Artemis DTO ............................... SUCCESS [  3.190 s]
[INFO] ActiveMQ Artemis Service Extensions ................ SUCCESS [  2.541 s]
[INFO] ActiveMQ Artemis JMS Server ........................ SUCCESS [  2.767 s]
[INFO] ActiveMQ Artemis CDI Integration ................... SUCCESS [  5.026 s]
[INFO] ActiveMQ Artemis Boot .............................. SUCCESS [  0.979 s]
[INFO] ActiveMQ Artemis CLI ............................... SUCCESS [01:20 min]
[INFO] ActiveMQ Artemis Web ............................... SUCCESS [  5.468 s]
[INFO] ActiveMQ Artemis Web ............................... SUCCESS [  1.421 s]
[INFO] ActiveMQ Artemis JUnit Rules ....................... SUCCESS [  9.002 s]
[INFO] ActiveMQ Artemis RAR POM ........................... SUCCESS [  3.295 s]
[INFO] ActiveMQ Artemis REST Interface Implementation ..... SUCCESS [01:24 min]
[INFO] ActiveMQ Artemis Maven Plugin ...................... SUCCESS [  6.263 s]
[INFO] ActiveMQ Artemis Server OSGi ....................... SUCCESS [  2.357 s]
[INFO] ActiveMQ Artemis Spring Integration ................ SUCCESS [  1.606 s]
[INFO] ActiveMQ Artemis Aerogear Integration .............. SUCCESS [  1.797 s]
[INFO] ActiveMQ Artemis Vert.x Integration ................ SUCCESS [  1.987 s]
[INFO] ActiveMQ Artemis Tools ............................. SUCCESS [  1.447 s]
[INFO] Apache ActiveMQ Artemis Distribution ............... SUCCESS [  3.686 s]
[INFO] ActiveMQ Artemis Tests POM ......................... SUCCESS [  1.764 s]
[INFO] ActiveMQ Artemis Unit Tests ........................ SUCCESS [02:36 min]
[INFO] ActiveMQ Artemis Joram Tests ....................... SUCCESS [ 34.671 s]
[INFO] ActiveMQ Artemis timing Tests ...................... SUCCESS [  2.007 s]
[INFO] ActiveMQ Artemis JMS Tests ......................... SUCCESS [05:32 min]
[INFO] ActiveMQ Artemis Features .......................... SUCCESS [  0.101 s]
[INFO] ActiveMQ Artemis Test Support ...................... SUCCESS [  2.495 s]
[INFO] ActiveMQ Artemis Integration Tests ................. FAILURE [ 21.777 s]
[INFO] ActiveMQ Artemis soak Tests ........................ SKIPPED
[INFO] ActiveMQ Artemis stress Tests ...................... SKIPPED
[INFO] ActiveMQ Artemis performance Tests ................. SKIPPED
[INFO] ActiveMQ Artemis Extra Tests ....................... SKIPPED
[INFO] ------------------------------------------------------------------------
[INFO] BUILD FAILURE
[INFO] ------------------------------------------------------------------------
[INFO] Total time: 15:10 min
[INFO] Finished at: 2016-12-16T14:15:17+00:00
[INFO] Final Memory: 352M/4636M
[INFO] ------------------------------------------------------------------------
[ERROR] Failed to execute goal org.apache.maven.plugins:maven-compiler-plugin:3.1:testCompile
(default-testCompile) on project integration-tests: Compilation failure -> [Help 1]
[ERROR] 
[ERROR] To see the full stack trace of the errors, re-run Maven with the -e switch.
[ERROR] Re-run Maven using the -X switch to enable full debug logging.
[ERROR] 
[ERROR] For more information about the errors and possible solutions, please read the following
articles:
[ERROR] [Help 1] http://cwiki.apache.org/confluence/display/MAVEN/MojoFailureException
[ERROR] 
[ERROR] After correcting the problems, you can resume the build with the command
[ERROR]   mvn <goals> -rf :integration-tests
Build step 'Invoke top-level Maven targets' marked build as failure
Performing Post build task...
Could not match :Too many files with unapproved license  : False
Logical operation result is FALSE
Skipping script  : cat ratReport.txt
END OF POST BUILD TASK 	: 0
Recording test results

Mime
View raw message