activemq-commits mailing list archives

Site index · List index
Message view « Date » · « Thread »
Top « Date » · « Thread »
From Apache Jenkins Server <jenk...@builds.apache.org>
Subject Build failed in Jenkins: ActiveMQ-Artemis-Master #766
Date Tue, 13 Dec 2016 15:55:03 GMT
See <https://builds.apache.org/job/ActiveMQ-Artemis-Master/766/changes>

Changes:

[github] Update security.md

------------------------------------------
[...truncated 28136 lines...]
[INFO] 
[INFO] --- maven-enforcer-plugin:1.4:enforce (enforce-java) @ artemis-test-support ---
[INFO] 
[INFO] --- maven-remote-resources-plugin:1.5:process (process-resource-bundles) @ artemis-test-support
---
[INFO] 
[INFO] --- maven-resources-plugin:2.6:resources (default-resources) @ artemis-test-support
---
[INFO] Using 'UTF-8' encoding to copy filtered resources.
[INFO] skip non existing resourceDirectory <https://builds.apache.org/job/ActiveMQ-Artemis-Master/ws/tests/artemis-test-support/src/main/resources>
[INFO] Copying 3 resources
[INFO] Copying 3 resources
[INFO] 
[INFO] --- maven-compiler-plugin:3.1:compile (default-compile) @ artemis-test-support ---
[INFO] Nothing to compile - all classes are up to date
[INFO] 
[INFO] --- maven-checkstyle-plugin:2.17:check (default) @ artemis-test-support ---
[INFO] Starting audit...
Audit done.
[INFO] 
[INFO] --- apache-rat-plugin:0.12:check (default) @ artemis-test-support ---
[INFO] Enabled default license matchers.
[INFO] Will parse SCM ignores for exclusions...
[INFO] Finished adding exclusions from SCM ignore files.
[INFO] 61 implicit excludes (use -debug for more details).
[INFO] Exclude: **/*.txt
[INFO] Exclude: **/*.md
[INFO] Exclude: etc/ide-settings/**
[INFO] Exclude: docs/**/*.json
[INFO] Exclude: docs/**/_book/
[INFO] Exclude: **/target/
[INFO] Exclude: **/META-INF/services/*
[INFO] Exclude: **/META-INF/MANIFEST.MF
[INFO] Exclude: **/*.iml
[INFO] Exclude: **/*.jceks
[INFO] Exclude: **/*.jks
[INFO] Exclude: **/org/apache/activemq/artemis/utils/json/**
[INFO] Exclude: **/org/apache/activemq/artemis/utils/Base64.java
[INFO] Exclude: **/.settings/**
[INFO] Exclude: **/.project
[INFO] Exclude: **/.classpath
[INFO] Exclude: **/.editorconfig
[INFO] Exclude: **/.checkstyle
[INFO] Exclude: **/.factorypath
[INFO] Exclude: **/org.apache.activemq.artemis.cfg
[INFO] Exclude: **/nb-configuration.xml
[INFO] Exclude: **/*.data
[INFO] Exclude: **/*.bin
[INFO] Exclude: **/src/test/resources/keystore
[INFO] Exclude: **/*.log
[INFO] Exclude: **/*.redo
[INFO] Exclude: **/node/**
[INFO] Exclude: **/node_modules/**
[INFO] Exclude: **/package.json
[INFO] Exclude: **/npm-shrinkwrap.json
[INFO] Exclude: **/CMakeFiles/
[INFO] Exclude: **/Makefile
[INFO] Exclude: **/cmake_install.cmake
[INFO] Exclude: artemis-native/src/main/c/org_apache_activemq_artemis_jlibaio_LibaioContext.h
[INFO] 59 resources included (use -debug for more details)
[INFO] Rat check: Summary over all files. Unapproved: 0, unknown: 0, generated: 0, approved:
59 licenses.
[INFO] 
[INFO] --- maven-resources-plugin:2.6:testResources (default-testResources) @ artemis-test-support
---
[INFO] Using 'UTF-8' encoding to copy filtered resources.
[INFO] skip non existing resourceDirectory <https://builds.apache.org/job/ActiveMQ-Artemis-Master/ws/tests/artemis-test-support/src/test/resources>
[INFO] Copying 3 resources
[INFO] Copying 3 resources
[INFO] 
[INFO] --- maven-compiler-plugin:3.1:testCompile (default-testCompile) @ artemis-test-support
---
[INFO] No sources to compile
[INFO] 
[INFO] --- maven-enforcer-plugin:1.4:enforce (enforce-maven) @ artemis-test-support ---
[INFO] 
[INFO] --- maven-enforcer-plugin:1.4:enforce (enforce-java) @ artemis-test-support ---
[INFO] 
[INFO] --- maven-remote-resources-plugin:1.5:process (process-resource-bundles) @ artemis-test-support
---
[INFO] 
[INFO] --- maven-resources-plugin:2.6:resources (default-resources) @ artemis-test-support
---
[INFO] Using 'UTF-8' encoding to copy filtered resources.
[INFO] skip non existing resourceDirectory <https://builds.apache.org/job/ActiveMQ-Artemis-Master/ws/tests/artemis-test-support/src/main/resources>
[INFO] Copying 3 resources
[INFO] Copying 3 resources
[INFO] Copying 3 resources
[INFO] 
[INFO] --- maven-compiler-plugin:3.1:compile (default-compile) @ artemis-test-support ---
[INFO] Nothing to compile - all classes are up to date
[INFO] 
[INFO] --- maven-checkstyle-plugin:2.17:check (default) @ artemis-test-support ---
[INFO] Starting audit...
Audit done.
[INFO] 
[INFO] --- apache-rat-plugin:0.12:check (default) @ artemis-test-support ---
[INFO] Enabled default license matchers.
[INFO] Will parse SCM ignores for exclusions...
[INFO] Finished adding exclusions from SCM ignore files.
[INFO] 61 implicit excludes (use -debug for more details).
[INFO] Exclude: **/*.txt
[INFO] Exclude: **/*.md
[INFO] Exclude: etc/ide-settings/**
[INFO] Exclude: docs/**/*.json
[INFO] Exclude: docs/**/_book/
[INFO] Exclude: **/target/
[INFO] Exclude: **/META-INF/services/*
[INFO] Exclude: **/META-INF/MANIFEST.MF
[INFO] Exclude: **/*.iml
[INFO] Exclude: **/*.jceks
[INFO] Exclude: **/*.jks
[INFO] Exclude: **/org/apache/activemq/artemis/utils/json/**
[INFO] Exclude: **/org/apache/activemq/artemis/utils/Base64.java
[INFO] Exclude: **/.settings/**
[INFO] Exclude: **/.project
[INFO] Exclude: **/.classpath
[INFO] Exclude: **/.editorconfig
[INFO] Exclude: **/.checkstyle
[INFO] Exclude: **/.factorypath
[INFO] Exclude: **/org.apache.activemq.artemis.cfg
[INFO] Exclude: **/nb-configuration.xml
[INFO] Exclude: **/*.data
[INFO] Exclude: **/*.bin
[INFO] Exclude: **/src/test/resources/keystore
[INFO] Exclude: **/*.log
[INFO] Exclude: **/*.redo
[INFO] Exclude: **/node/**
[INFO] Exclude: **/node_modules/**
[INFO] Exclude: **/package.json
[INFO] Exclude: **/npm-shrinkwrap.json
[INFO] Exclude: **/CMakeFiles/
[INFO] Exclude: **/Makefile
[INFO] Exclude: **/cmake_install.cmake
[INFO] Exclude: artemis-native/src/main/c/org_apache_activemq_artemis_jlibaio_LibaioContext.h
[INFO] 59 resources included (use -debug for more details)
[INFO] Rat check: Summary over all files. Unapproved: 0, unknown: 0, generated: 0, approved:
59 licenses.
[INFO] 
[INFO] --- maven-resources-plugin:2.6:testResources (default-testResources) @ artemis-test-support
---
[INFO] Using 'UTF-8' encoding to copy filtered resources.
[INFO] skip non existing resourceDirectory <https://builds.apache.org/job/ActiveMQ-Artemis-Master/ws/tests/artemis-test-support/src/test/resources>
[INFO] Copying 3 resources
[INFO] Copying 3 resources
[INFO] Copying 3 resources
[INFO] 
[INFO] --- maven-compiler-plugin:3.1:testCompile (default-testCompile) @ artemis-test-support
---
[INFO] No sources to compile
[INFO] 
[INFO] --- maven-surefire-plugin:2.18.1:test (default-test) @ artemis-test-support ---
[INFO]                                                                         
[INFO] ------------------------------------------------------------------------
[INFO] Building ActiveMQ Artemis Integration Tests 2.0.0-SNAPSHOT
[INFO] ------------------------------------------------------------------------
[INFO] 
[INFO] --- maven-enforcer-plugin:1.4:enforce (enforce-maven) @ integration-tests ---
[INFO] 
[INFO] --- maven-enforcer-plugin:1.4:enforce (enforce-java) @ integration-tests ---
[INFO] 
[INFO] --- maven-remote-resources-plugin:1.5:process (process-resource-bundles) @ integration-tests
---
[INFO] 
[INFO] --- depends-maven-plugin:1.2:generate-depends-file (generate-depends-file) @ integration-tests
---
[INFO] Created: <https://builds.apache.org/job/ActiveMQ-Artemis-Master/ws/tests/integration-tests/target/classes/META-INF/maven/dependencies.properties>
[INFO] 
[INFO] --- maven-resources-plugin:2.6:resources (default-resources) @ integration-tests ---
[INFO] Using 'UTF-8' encoding to copy filtered resources.
[INFO] skip non existing resourceDirectory <https://builds.apache.org/job/ActiveMQ-Artemis-Master/ws/tests/integration-tests/src/main/resources>
[INFO] Copying 3 resources
[INFO] 
[INFO] --- maven-compiler-plugin:3.1:compile (default-compile) @ integration-tests ---
[INFO] No sources to compile
[INFO] 
[INFO] --- maven-checkstyle-plugin:2.17:check (default) @ integration-tests ---
[INFO] Starting audit...
<https://builds.apache.org/job/ActiveMQ-Artemis-Master/ws/tests/integration-tests/src/test/java/org/apache/activemq/artemis/tests/integration/jms/SimpleJNDIClientTest.java>:522:11:
error: 'catch' is not preceded with whitespace.
<https://builds.apache.org/job/ActiveMQ-Artemis-Master/ws/tests/integration-tests/src/test/java/org/apache/activemq/artemis/tests/integration/jms/SimpleJNDIClientTest.java>:529:
error: 'finally' child have incorrect indentation level 8, expected level should be 9.
<https://builds.apache.org/job/ActiveMQ-Artemis-Master/ws/tests/integration-tests/src/test/java/org/apache/activemq/artemis/tests/integration/jms/SimpleJNDIClientTest.java>:529:
error: 'method call' child have incorrect indentation level 8, expected level should be 9.
<https://builds.apache.org/job/ActiveMQ-Artemis-Master/ws/tests/integration-tests/src/test/java/org/apache/activemq/artemis/tests/integration/jms/SimpleJNDIClientTest.java>:530:
error: 'finally rcurly' have incorrect indentation level 5, expected level should be 6.
Audit done.
[INFO] There are 4 errors reported by Checkstyle 6.11.2 with <https://builds.apache.org/job/ActiveMQ-Artemis-Master/ws/tests/integration-tests/../../etc/checkstyle.xml>
ruleset.
[ERROR] src/test/java/org/apache/activemq/artemis/tests/integration/jms/SimpleJNDIClientTest.java:[522,11]
(whitespace) WhitespaceAround: 'catch' is not preceded with whitespace.
[ERROR] src/test/java/org/apache/activemq/artemis/tests/integration/jms/SimpleJNDIClientTest.java:[529]
(indentation) Indentation: 'finally' child have incorrect indentation level 8, expected level
should be 9.
[ERROR] src/test/java/org/apache/activemq/artemis/tests/integration/jms/SimpleJNDIClientTest.java:[529]
(indentation) Indentation: 'method call' child have incorrect indentation level 8, expected
level should be 9.
[ERROR] src/test/java/org/apache/activemq/artemis/tests/integration/jms/SimpleJNDIClientTest.java:[530]
(indentation) Indentation: 'finally rcurly' have incorrect indentation level 5, expected level
should be 6.
[INFO] ------------------------------------------------------------------------
[INFO] Reactor Summary:
[INFO] 
[INFO] ActiveMQ Artemis Parent ............................ SUCCESS [ 10.309 s]
[INFO] ActiveMQ Artemis Commons ........................... SUCCESS [ 14.808 s]
[INFO] ActiveMQ Artemis Core Client ....................... SUCCESS [ 11.701 s]
[INFO] ActiveMQ Artemis Selector Implementation ........... SUCCESS [  4.983 s]
[INFO] ActiveMQ Artemis JMS Client ........................ SUCCESS [  5.466 s]
[INFO] ActiveMQ Artemis Native POM ........................ SUCCESS [  5.706 s]
[INFO] ActiveMQ Artemis Journal ........................... SUCCESS [  4.663 s]
[INFO] ActiveMQ Artemis JDBC Store ........................ SUCCESS [  9.114 s]
[INFO] ActiveMQ Artemis Server ............................ SUCCESS [ 51.379 s]
[INFO] ActiveMQ Artemis Protocols ......................... SUCCESS [  1.621 s]
[INFO] ActiveMQ Artemis AMQP Protocol ..................... SUCCESS [  9.302 s]
[INFO] ActiveMQ Artemis STOMP Protocol .................... SUCCESS [  4.753 s]
[INFO] ActiveMQ Artemis OpenWire Protocol ................. SUCCESS [  3.363 s]
[INFO] ActiveMQ Artemis HQClient Protocol ................. SUCCESS [  1.664 s]
[INFO] ActiveMQ Artemis HornetQ Protocol .................. SUCCESS [  1.312 s]
[INFO] ActiveMQ Artemis MQTT Protocol ..................... SUCCESS [  2.759 s]
[INFO] ActiveMQ Artemis DTO ............................... SUCCESS [  5.845 s]
[INFO] ActiveMQ Artemis Service Extensions ................ SUCCESS [  3.587 s]
[INFO] ActiveMQ Artemis JMS Server ........................ SUCCESS [  4.304 s]
[INFO] ActiveMQ Artemis CDI Integration ................... SUCCESS [  8.393 s]
[INFO] ActiveMQ Artemis Boot .............................. SUCCESS [  1.401 s]
[INFO] ActiveMQ Artemis CLI ............................... SUCCESS [ 41.853 s]
[INFO] ActiveMQ Artemis Web ............................... SUCCESS [  9.010 s]
[INFO] ActiveMQ Artemis Web ............................... SUCCESS [  2.292 s]
[INFO] ActiveMQ Artemis JUnit Rules ....................... SUCCESS [ 16.366 s]
[INFO] ActiveMQ Artemis RAR POM ........................... SUCCESS [  3.790 s]
[INFO] ActiveMQ Artemis REST Interface Implementation ..... SUCCESS [01:29 min]
[INFO] ActiveMQ Artemis Maven Plugin ...................... SUCCESS [  6.381 s]
[INFO] ActiveMQ Artemis Server OSGi ....................... SUCCESS [  2.640 s]
[INFO] ActiveMQ Artemis Spring Integration ................ SUCCESS [  1.888 s]
[INFO] ActiveMQ Artemis Aerogear Integration .............. SUCCESS [  3.166 s]
[INFO] ActiveMQ Artemis Vert.x Integration ................ SUCCESS [  3.673 s]
[INFO] Apache ActiveMQ Artemis Distribution ............... SUCCESS [  5.250 s]
[INFO] ActiveMQ Artemis Tools ............................. SUCCESS [  2.326 s]
[INFO] ActiveMQ Artemis Tests POM ......................... SUCCESS [  5.129 s]
[INFO] ActiveMQ Artemis Unit Tests ........................ SUCCESS [02:28 min]
[INFO] ActiveMQ Artemis Joram Tests ....................... SUCCESS [01:09 min]
[INFO] ActiveMQ Artemis timing Tests ...................... SUCCESS [  2.936 s]
[INFO] ActiveMQ Artemis JMS Tests ......................... SUCCESS [04:31 min]
[INFO] ActiveMQ Artemis Features .......................... SUCCESS [  0.262 s]
[INFO] ActiveMQ Artemis Test Support ...................... SUCCESS [  4.568 s]
[INFO] ActiveMQ Artemis Integration Tests ................. FAILURE [ 17.871 s]
[INFO] ActiveMQ Artemis soak Tests ........................ SKIPPED
[INFO] ActiveMQ Artemis stress Tests ...................... SKIPPED
[INFO] ActiveMQ Artemis performance Tests ................. SKIPPED
[INFO] ActiveMQ Artemis Extra Tests ....................... SKIPPED
[INFO] ------------------------------------------------------------------------
[INFO] BUILD FAILURE
[INFO] ------------------------------------------------------------------------
[INFO] Total time: 14:36 min
[INFO] Finished at: 2016-12-13T15:54:16+00:00
[INFO] Final Memory: 229M/1637M
[INFO] ------------------------------------------------------------------------
[ERROR] Failed to execute goal org.apache.maven.plugins:maven-checkstyle-plugin:2.17:check
(default) on project integration-tests: You have 4 Checkstyle violations. -> [Help 1]
[ERROR] 
[ERROR] To see the full stack trace of the errors, re-run Maven with the -e switch.
[ERROR] Re-run Maven using the -X switch to enable full debug logging.
[ERROR] 
[ERROR] For more information about the errors and possible solutions, please read the following
articles:
[ERROR] [Help 1] http://cwiki.apache.org/confluence/display/MAVEN/MojoFailureException
[ERROR] 
[ERROR] After correcting the problems, you can resume the build with the command
[ERROR]   mvn <goals> -rf :integration-tests
Build step 'Invoke top-level Maven targets' marked build as failure
Performing Post build task...
Could not match :Too many files with unapproved license  : False
Logical operation result is FALSE
Skipping script  : cat ratReport.txt
END OF POST BUILD TASK 	: 0
Recording test results

Mime
View raw message